Console Output

Established TCP socket on 45929
<===[JENKINS REMOTING CAPACITY]===>channel started
Executing Maven:  -B -f /var/lib/jenkins/jobs/guilib/workspace/pom.xml -Dmaven.repo.local=/var/lib/jenkins/maven-repositories/1 deploy -Panon-cc-dev
[INFO] Scanning for projects...
[INFO]                                                                         
[INFO] ------------------------------------------------------------------------
[INFO] Building guilib 00.00.231-SNAPSHOT
[INFO] ------------------------------------------------------------------------
[WARNING] The POM for anon:anonlib:jar:00.20.045-SNAPSHOT is missing, no dependency information available
[WARNING] Attempt to (de-)serialize anonymous class hudson.maven.reporters.MavenArtifactArchiver$2; see: https://jenkins.io/redirect/serialization-of-anonymous-classes/
[WARNING] Attempt to (de-)serialize anonymous class hudson.maven.reporters.MavenFingerprinter$1; see: https://jenkins.io/redirect/serialization-of-anonymous-classes/
[INFO] ------------------------------------------------------------------------
[INFO] BUILD FAILURE
[INFO] ------------------------------------------------------------------------
[INFO] Total time: 1.341 s
[INFO] Finished at: 2018-11-28T15:18:48+01:00
[INFO] Final Memory: 12M/148M
[INFO] ------------------------------------------------------------------------
[ERROR] Failed to execute goal on project guilib: Could not resolve dependencies for project anon:guilib:jar:00.00.231-SNAPSHOT: Failure to find anon:anonlib:jar:00.20.045-SNAPSHOT in https://anon.inf.tu-dresden.de/artifactory/repo was cached in the local repository, resolution will not be reattempted until the update interval of anon.inf.tu-dresden.de has elapsed or updates are forced -> [Help 1]
[ERROR] 
[ERROR] To see the full stack trace of the errors, re-run Maven with the -e switch.
[ERROR] Re-run Maven using the -X switch to enable full debug logging.
[ERROR] 
[ERROR] For more information about the errors and possible solutions, please read the following articles:
[ERROR] [Help 1] http://cwiki.apache.org/confluence/display/MAVEN/DependencyResolutionException