Console Output

Established TCP socket on 37873
<===[JENKINS REMOTING CAPACITY]===>channel started
Executing Maven:  -B -f /var/lib/jenkins/jobs/guilib/workspace/pom.xml -Dmaven.repo.local=/var/lib/jenkins/maven-repositories/1 deploy -Panon-cc-dev
[INFO] Scanning for projects...
[INFO]                                                                         
[INFO] ------------------------------------------------------------------------
[INFO] Building guilib 00.00.231-SNAPSHOT
[INFO] ------------------------------------------------------------------------
[INFO] Downloading: http://svn.jondos.de/maven/repos/anon/anonlib/00.20.045-SNAPSHOT/maven-metadata.xml
[INFO] Downloading: https://anon.inf.tu-dresden.de/artifactory/repo/anon/anonlib/00.20.045-SNAPSHOT/maven-metadata.xml
[INFO] Downloading: https://anon.inf.tu-dresden.de/artifactory/repo/anon/anonlib/00.20.045-SNAPSHOT/anonlib-00.20.045-SNAPSHOT.pom
[INFO] Downloading: http://svn.jondos.de/maven/repos/anon/anonlib/00.20.045-SNAPSHOT/anonlib-00.20.045-SNAPSHOT.pom
[WARNING] The POM for anon:anonlib:jar:00.20.045-SNAPSHOT is missing, no dependency information available
[INFO] Downloading: https://anon.inf.tu-dresden.de/artifactory/repo/anon/anonlib/00.20.045-SNAPSHOT/anonlib-00.20.045-SNAPSHOT.jar
[INFO] Downloading: http://svn.jondos.de/maven/repos/anon/anonlib/00.20.045-SNAPSHOT/anonlib-00.20.045-SNAPSHOT.jar
[WARNING] Attempt to (de-)serialize anonymous class hudson.maven.reporters.MavenArtifactArchiver$2; see: https://jenkins.io/redirect/serialization-of-anonymous-classes/
[WARNING] Attempt to (de-)serialize anonymous class hudson.maven.reporters.MavenFingerprinter$1; see: https://jenkins.io/redirect/serialization-of-anonymous-classes/
[INFO] ------------------------------------------------------------------------
[INFO] BUILD FAILURE
[INFO] ------------------------------------------------------------------------
[INFO] Total time: 6.026 s
[INFO] Finished at: 2018-11-28T15:06:37+01:00
[INFO] Final Memory: 14M/157M
[INFO] ------------------------------------------------------------------------
[ERROR] Failed to execute goal on project guilib: Could not resolve dependencies for project anon:guilib:jar:00.00.231-SNAPSHOT: Could not find artifact anon:anonlib:jar:00.20.045-SNAPSHOT in anon.inf.tu-dresden.de (https://anon.inf.tu-dresden.de/artifactory/repo) -> [Help 1]
[ERROR] 
[ERROR] To see the full stack trace of the errors, re-run Maven with the -e switch.
[ERROR] Re-run Maven using the -X switch to enable full debug logging.
[ERROR] 
[ERROR] For more information about the errors and possible solutions, please read the following articles:
[ERROR] [Help 1] http://cwiki.apache.org/confluence/display/MAVEN/DependencyResolutionException