Console Output

<===[JENKINS REMOTING CAPACITY]===>channel started
Executing Maven:  -B -f /var/lib/jenkins/jobs/guilib/workspace/pom.xml -Dmaven.repo.local=/var/lib/jenkins/maven-repositories/1 deploy -Panon-cc-dev
[INFO] Scanning for projects...
[INFO]                                                                         
[INFO] ------------------------------------------------------------------------
[INFO] Building guilib 00.00.210-SNAPSHOT
[INFO] ------------------------------------------------------------------------
Downloading: http://anon.inf.tu-dresden.de/artifactory/repo/anon/anonlib/00.19.015-SNAPSHOT/maven-metadata.xml
Downloading: http://svn.jondos.de/maven/repos/anon/anonlib/00.19.015-SNAPSHOT/maven-metadata.xml
Downloading: http://anon.inf.tu-dresden.de/artifactory/repo/anon/anonlib/00.19.015-SNAPSHOT/anonlib-00.19.015-SNAPSHOT.pom
Downloading: http://svn.jondos.de/maven/repos/anon/anonlib/00.19.015-SNAPSHOT/anonlib-00.19.015-SNAPSHOT.pom
[WARNING] The POM for anon:anonlib:jar:00.19.015-SNAPSHOT is missing, no dependency information available
Downloading: http://anon.inf.tu-dresden.de/artifactory/repo/anon/anonlib/00.19.015-SNAPSHOT/anonlib-00.19.015-SNAPSHOT.jar
Downloading: http://svn.jondos.de/maven/repos/anon/anonlib/00.19.015-SNAPSHOT/anonlib-00.19.015-SNAPSHOT.jar
[INFO] ------------------------------------------------------------------------
[INFO] BUILD FAILURE
[INFO] ------------------------------------------------------------------------
[INFO] Total time: 2.294s
[INFO] Finished at: Thu May 19 12:01:22 CEST 2016
[INFO] Final Memory: 10M/137M
[INFO] ------------------------------------------------------------------------
[ERROR] Failed to execute goal on project guilib: Could not resolve dependencies for project anon:guilib:jar:00.00.210-SNAPSHOT: Could not find artifact anon:anonlib:jar:00.19.015-SNAPSHOT in anon.inf.tu-dresden.de (http://anon.inf.tu-dresden.de/artifactory/repo) -> [Help 1]
[ERROR] 
[ERROR] To see the full stack trace of the errors, re-run Maven with the -e switch.
[ERROR] Re-run Maven using the -X switch to enable full debug logging.
[ERROR] 
[ERROR] For more information about the errors and possible solutions, please read the following articles:
[ERROR] [Help 1] http://cwiki.apache.org/confluence/display/MAVEN/DependencyResolutionException