Console Output

Gestartet durch Benutzer sk13
[EnvInject] - Loading node environment variables.
Baue in Arbeitsbereich /var/lib/jenkins/jobs/guilib/workspace
Cleaning local Directory .
Checking out https://anon.inf.tu-dresden.de/svn/guilib/guilib/trunk at revision '2018-04-12T09:58:26.665 +0200'
AU        pom.xml
A         src
A         src/main
A         src/main/java
A         src/main/java/gui
AU        src/main/java/gui/GUIUtils.java
AU        src/main/java/gui/CertDetailsDialog.java
AU        src/main/java/gui/MultiCertTrustGraph.java
A         src/main/java/gui/dialog
AU        src/main/java/gui/dialog/JAPDialog.java
AU        src/main/java/gui/dialog/FileChooserContentPane.java
AU        src/main/java/gui/dialog/DialogContentPane.java
AU        src/main/java/gui/dialog/WorkerContentPane.java
AU        src/main/java/gui/dialog/AbstractDialogExtraButton.java
AU        src/main/java/gui/dialog/SimpleWizardContentPane.java
AU        src/main/java/gui/dialog/DialogContentPaneOptions.java
AU        src/main/java/gui/dialog/PasswordContentPane.java
AU        src/main/java/gui/dialog/CaptchaContentPane.java
AU        src/main/java/gui/dialog/TermsAndConditionsPane.java
AU        src/main/java/gui/dialog/FinishedContentPane.java
AU        src/main/java/gui/dialog/IDialogOptions.java
AU        src/main/java/gui/PopupMenu.java
A         src/main/java/gui/help
AU        src/main/java/gui/help/JAPInternalHelpViewer.java
AU        src/main/java/gui/help/JAPHelp.java
AU        src/main/java/gui/help/JAPExternalHelpViewer.java
AU        src/main/java/gui/help/AbstractHelpFileStorageManager.java
AU        src/main/java/gui/help/LocalHelpFileStorageManager.java
AU        src/main/java/gui/help/IHelpModel.java
AU        src/main/java/gui/JapCouponField.java
AU        src/main/java/gui/LinkMouseListener.java
AU        src/main/java/gui/ClipboardCopier.java
AU        src/main/java/gui/JapHtmlPane.java
AU        src/main/java/gui/FlippingPanel.java
AU        src/main/java/gui/JAPAWTMsgBox.java
AU        src/main/java/gui/ClipFrame.java
AU        src/main/java/gui/JAPHtmlMultiLineLabel.java
AU        src/main/java/gui/TermsAndConditionsDialog.java
AU        src/main/java/gui/CaptchaDialog.java
AU        src/main/java/gui/MapBox.java
A         src/main/java/gui/ILocationSettings.java
AU        src/main/java/gui/JAPHyperlinkAdapter.java
AU        src/main/java/gui/MixDetailsDialog.java
AU        src/main/java/gui/CAListCellRenderer.java
AU        src/main/java/gui/AWTUpdateQueue.java
AU        src/main/java/gui/UpperLeftStartViewport.java
AU        src/main/java/gui/TitledGridBagPanel.java
AU        src/main/java/gui/DataRetentionDialog.java
AU        src/main/java/gui/ByteNumberCellRenderer.java
A         src/main/java/gui/wizard
AU        src/main/java/gui/wizard/BasicWizardHost.java
AU        src/main/java/gui/wizard/BasicWizard.java
AU        src/main/java/gui/wizard/WizardHost.java
AU        src/main/java/gui/wizard/BasicWizardPage.java
AU        src/main/java/gui/wizard/Wizard.java
AU        src/main/java/gui/wizard/WizardPage.java
AU        src/main/java/gui/JAPJIntField.java
AU        src/main/java/gui/MultiCertOverview.java
AU        src/main/java/gui/JAPHelpContext.java
AU        src/main/java/gui/IStatusLine.java
AU        src/main/java/gui/JAPProgressBar.java
AU        src/main/java/gui/JAPMultilineLabel.java
AU        src/main/java/gui/SimpleFileFilter.java
A         src/main/resources
A         src/main/resources/images
AU        src/main/resources/images/gui.help.JAPHelp_previous.gif
AU        src/main/resources/images/gui.help.JAPHelp_help.gif
AU        src/main/resources/images/gui.help.JAPHelp_home.gif
AU        src/main/resources/images/gui.help.JAPHelp_next.gif
AU        src/main/resources/images/certinactive.gif
AU        src/main/resources/images/certinvalidinactive.gif
AU        src/main/resources/images/arrow.gif
AU        src/main/resources/images/arrow90.gif
AU        src/main/resources/images/cdisabled.gif
AU        src/main/resources/images/cenabled.gif
AU        src/main/resources/images/warning.gif
AU        src/main/resources/images/busy.gif
A         src/main/assembly
AU        src/main/assembly/jar-with-deps-assembly.xml
A         src/test
A         src/test/java
A         src/test/java/test
AU        src/test/java/test/AllTests.java
 U        .
At revision 3260
Parsing POMs
Modules changed, recalculating dependency graph
Established TCP socket on 43921
[workspace] $ /opt/java/jdk1.7/bin/java -cp /var/lib/jenkins/plugins/maven-plugin/WEB-INF/lib/maven33-agent-1.8.1.jar:/opt/maven/boot/plexus-classworlds-2.5.2.jar:/opt/maven/conf/logging jenkins.maven3.agent.Maven33Main /opt/maven /var/cache/jenkins/war/WEB-INF/lib/remoting-3.19.jar /var/lib/jenkins/plugins/maven-plugin/WEB-INF/lib/maven33-interceptor-1.8.1.jar /var/lib/jenkins/plugins/maven-plugin/WEB-INF/lib/maven3-interceptor-commons-1.8.1.jar 43921
Exception in thread "main" java.lang.UnsupportedClassVersionError: hudson/remoting/Launcher : Unsupported major.minor version 52.0
	at java.lang.ClassLoader.defineClass1(Native Method)
	at java.lang.ClassLoader.defineClass(ClassLoader.java:791)
	at java.security.SecureClassLoader.defineClass(SecureClassLoader.java:142)
	at java.net.URLClassLoader.defineClass(URLClassLoader.java:449)
	at java.net.URLClassLoader.access$100(URLClassLoader.java:71)
	at java.net.URLClassLoader$1.run(URLClassLoader.java:361)
	at java.net.URLClassLoader$1.run(URLClassLoader.java:355)
	at java.security.AccessController.doPrivileged(Native Method)
	at java.net.URLClassLoader.findClass(URLClassLoader.java:354)
	at org.codehaus.plexus.classworlds.realm.ClassRealm.loadClassFromSelf(ClassRealm.java:401)
	at org.codehaus.plexus.classworlds.strategy.SelfFirstStrategy.loadClass(SelfFirstStrategy.java:42)
	at org.codehaus.plexus.classworlds.realm.ClassRealm.unsynchronizedLoadClass(ClassRealm.java:271)
	at org.codehaus.plexus.classworlds.realm.ClassRealm.loadClass(ClassRealm.java:247)
	at org.codehaus.plexus.classworlds.realm.ClassRealm.loadClass(ClassRealm.java:239)
	at jenkins.maven3.agent.Maven33Main.main(Maven33Main.java:133)
	at jenkins.maven3.agent.Maven33Main.main(Maven33Main.java:64)
ERROR: ================================================================================
ERROR: Invalid project setup: Connection reset
ERROR: [JENKINS-18403][JENKINS-28294] JDK 'JDK 1.7' not supported to run Maven projects.
ERROR: Maven projects have to be launched with a Java version greater or equal to the minimum version required by the master.
ERROR: Use the Maven JDK Toolchains (plugin) to build your maven project with an older JDK.
ERROR: Retrying with slave Java and setting compile/test properties to point to /opt/java/jdk1.7.
ERROR: ================================================================================
Established TCP socket on 44663
[workspace] $ /usr/lib/jvm/java-8-openjdk-amd64/jre/bin/java -cp /var/lib/jenkins/plugins/maven-plugin/WEB-INF/lib/maven33-agent-1.8.1.jar:/opt/maven/boot/plexus-classworlds-2.5.2.jar:/opt/maven/conf/logging jenkins.maven3.agent.Maven33Main /opt/maven /var/cache/jenkins/war/WEB-INF/lib/remoting-3.19.jar /var/lib/jenkins/plugins/maven-plugin/WEB-INF/lib/maven33-interceptor-1.8.1.jar /var/lib/jenkins/plugins/maven-plugin/WEB-INF/lib/maven3-interceptor-commons-1.8.1.jar 44663
<===[JENKINS REMOTING CAPACITY]===>channel started
Executing Maven:  -B -f /var/lib/jenkins/jobs/guilib/workspace/pom.xml -Dmaven.repo.local=/var/lib/jenkins/maven-repositories/1 deploy -Panon-cc-dev
[INFO] Scanning for projects...
[INFO]                                                                         
[INFO] ------------------------------------------------------------------------
[INFO] Building guilib 00.00.230-SNAPSHOT
[INFO] ------------------------------------------------------------------------
[INFO] Downloading: https://repo.maven.apache.org/maven2/org/apache/maven/plugins/maven-compiler-plugin/3.6.2/maven-compiler-plugin-3.6.2.pom
[INFO] Downloaded: https://repo.maven.apache.org/maven2/org/apache/maven/plugins/maven-compiler-plugin/3.6.2/maven-compiler-plugin-3.6.2.pom (11 KB at 29.7 KB/sec)
[INFO] Downloading: https://repo.maven.apache.org/maven2/org/apache/maven/plugins/maven-compiler-plugin/3.6.2/maven-compiler-plugin-3.6.2.jar
[INFO] Downloaded: https://repo.maven.apache.org/maven2/org/apache/maven/plugins/maven-compiler-plugin/3.6.2/maven-compiler-plugin-3.6.2.jar (74 KB at 1204.2 KB/sec)
[INFO] Downloading: http://svn.jondos.de/maven/repos/anon/anonlib/00.20.044-SNAPSHOT/maven-metadata.xml
[INFO] Downloading: http://anon.inf.tu-dresden.de/artifactory/repo/anon/anonlib/00.20.044-SNAPSHOT/maven-metadata.xml
[INFO] Downloading: http://anon.inf.tu-dresden.de/artifactory/repo/anon/anonlib/00.20.044-SNAPSHOT/anonlib-00.20.044-SNAPSHOT.pom
[INFO] Downloading: http://svn.jondos.de/maven/repos/anon/anonlib/00.20.044-SNAPSHOT/anonlib-00.20.044-SNAPSHOT.pom
[WARNING] The POM for anon:anonlib:jar:00.20.044-SNAPSHOT is missing, no dependency information available
[INFO] Downloading: http://anon.inf.tu-dresden.de/artifactory/repo/anon/anonlib/00.20.044-SNAPSHOT/anonlib-00.20.044-SNAPSHOT.jar
[INFO] Downloading: http://svn.jondos.de/maven/repos/anon/anonlib/00.20.044-SNAPSHOT/anonlib-00.20.044-SNAPSHOT.jar
[WARNING] Attempt to (de-)serialize anonymous class hudson.maven.reporters.MavenArtifactArchiver$2; see: https://jenkins.io/redirect/serialization-of-anonymous-classes/
[WARNING] Attempt to (de-)serialize anonymous class hudson.maven.reporters.MavenFingerprinter$1; see: https://jenkins.io/redirect/serialization-of-anonymous-classes/
[INFO] ------------------------------------------------------------------------
[INFO] BUILD FAILURE
[INFO] ------------------------------------------------------------------------
[INFO] Total time: 2.568 s
[INFO] Finished at: 2018-04-12T09:58:36+02:00
[INFO] Final Memory: 15M/173M
[INFO] ------------------------------------------------------------------------
[ERROR] Failed to execute goal on project guilib: Could not resolve dependencies for project anon:guilib:jar:00.00.230-SNAPSHOT: Could not find artifact anon:anonlib:jar:00.20.044-SNAPSHOT in anon.inf.tu-dresden.de (http://anon.inf.tu-dresden.de/artifactory/repo) -> [Help 1]
[ERROR] 
[ERROR] To see the full stack trace of the errors, re-run Maven with the -e switch.
[ERROR] Re-run Maven using the -X switch to enable full debug logging.
[ERROR] 
[ERROR] For more information about the errors and possible solutions, please read the following articles:
[ERROR] [Help 1] http://cwiki.apache.org/confluence/display/MAVEN/DependencyResolutionException
[JENKINS] Archiving /var/lib/jenkins/jobs/guilib/workspace/pom.xml to anon/guilib/00.00.230-SNAPSHOT/guilib-00.00.230-SNAPSHOT.pom
channel stopped
Finished: FAILURE