Console Output

Established TCP socket on 34293
<===[JENKINS REMOTING CAPACITY]===>channel started
Executing Maven:  -B -f /var/lib/jenkins/jobs/TunDeviceLib/workspace/pom.xml -Dmaven.repo.local=/var/lib/jenkins/maven-repositories/0 deploy -Plinux-x64,linux-x86
[INFO] Scanning for projects...
[INFO]                                                                         
[INFO] ------------------------------------------------------------------------
[INFO] Building TunDeviceLib 0.0.1-SNAPSHOT
[INFO] ------------------------------------------------------------------------
[INFO] 
[INFO] --- cmake-maven-plugin:3.7.2-b1:generate (cmake-generate-linux_64) @ TunDeviceLib ---
[INFO] Using local binaries
CMake Error at CMakeLists.txt:59:
  Parse error.  Expected a command name, got unquoted argument with text
  "LINK_FLAGS="$LINK_FLAGS -m32"".


-- Configuring incomplete, errors occurred!
[WARNING] Attempt to (de-)serialize anonymous class hudson.maven.reporters.MavenArtifactArchiver$2; see: https://jenkins.io/redirect/serialization-of-anonymous-classes/
[WARNING] Attempt to (de-)serialize anonymous class hudson.maven.reporters.MavenFingerprinter$1; see: https://jenkins.io/redirect/serialization-of-anonymous-classes/
[INFO] ------------------------------------------------------------------------
[INFO] BUILD FAILURE
[INFO] ------------------------------------------------------------------------
[INFO] Total time: 2.976 s
[INFO] Finished at: 2018-11-20T11:16:00+01:00
[INFO] Final Memory: 13M/156M
[INFO] ------------------------------------------------------------------------
Warte bis Jenkins die Datensammlung abgeschlossen hat
[ERROR] Failed to execute goal com.googlecode.cmake-maven-project:cmake-maven-plugin:3.7.2-b1:generate (cmake-generate-linux_64) on project TunDeviceLib: Return code: 1 -> [Help 1]
[ERROR] 
[ERROR] To see the full stack trace of the errors, re-run Maven with the -e switch.
[ERROR] Re-run Maven using the -X switch to enable full debug logging.
[ERROR] 
[ERROR] For more information about the errors and possible solutions, please read the following articles:
[ERROR] [Help 1] http://cwiki.apache.org/confluence/display/MAVEN/MojoExecutionException