Console Output

Build wurde durch eine SCM-Änderung ausgelöst.
Running as SYSTEM
[EnvInject] - Loading node environment variables.
Baue in Arbeitsbereich /var/lib/jenkins/jobs/TunDeviceLib/workspace
Cleaning local Directory .
Checking out https://anon.inf.tu-dresden.de/svn/TunDeviceLib/TunDeviceLib/trunk at revision '2020-04-08T21:23:06.756 +0200'
A         .settings
A         .settings/org.eclipse.jdt.core.prefs
A         .settings/org.eclipse.m2e.core.prefs
A         src
A         src/main
A         src/main/c
A         src/main/c/CMakeLists.txt
A         src/main/c/TunDeviceLib.c
A         src/main/c/private.h
A         src/main/c/tuntap-unix-linux.c
A         src/main/c/tuntap-unix.c
A         src/main/c/tuntap-windows.c
A         src/main/c/tuntap.c
A         src/main/c/tuntap.h
A         src/main/c/tuntap_log.c
A         src/main/java
A         src/main/java/org
A         src/main/java/org/it4y
A         src/main/java/org/it4y/jni
A         src/main/java/org/it4y/jni/JNILoader.java
A         src/main/java/org/it4y/jni/libc.java
A         src/main/java/org/it4y/jni/tuntap.java
A         src/main/java/org/it4y/net
A         src/main/java/org/it4y/net/tuntap
A         src/main/java/org/it4y/net/tuntap/TunDevice.java
A         src/main/resources
AU        src/main/resources/TunDeviceLib.dll
AU        src/main/resources/libTunDeviceLib-x86.so
AU        src/main/resources/libTunDeviceLib.so
A         .classpath
A         .project
A         pom.xml
At revision 36

[EnvInject] - Executing scripts and injecting environment variables after the SCM step.
[EnvInject] - Injecting as environment variables the properties content 
JAVA_HOME=/opt/java/jdk1.8

[EnvInject] - Variables injected successfully.
Parsing POMs
Modules changed, recalculating dependency graph
Established TCP socket on 42353
[workspace] $ java -cp /var/lib/jenkins/plugins/maven-plugin/WEB-INF/lib/maven33-agent-1.12.jar:/opt/maven/boot/plexus-classworlds-2.5.2.jar:/opt/maven/conf/logging jenkins.maven3.agent.Maven33Main /opt/maven /var/cache/jenkins/war/WEB-INF/lib/remoting-4.2.jar /var/lib/jenkins/plugins/maven-plugin/WEB-INF/lib/maven33-interceptor-1.12.jar /var/lib/jenkins/plugins/maven-plugin/WEB-INF/lib/maven3-interceptor-commons-1.12.jar 42353
<===[JENKINS REMOTING CAPACITY]===>channel started
Executing Maven:  -B -f /var/lib/jenkins/jobs/TunDeviceLib/workspace/pom.xml -Dmaven.repo.local=/var/lib/jenkins/maven-repositories/0 deploy -Plinux-x64,linux-x86
[INFO] Scanning for projects...
[INFO]                                                                         
[INFO] ------------------------------------------------------------------------
[INFO] Building TunDeviceLib 0.0.1-SNAPSHOT
[INFO] ------------------------------------------------------------------------
[INFO] Downloading: https://repo.maven.apache.org/maven2/com/googlecode/cmake-maven-project/cmake-maven-plugin/3.16.3-b2/cmake-maven-plugin-3.16.3-b2.pom
[INFO] Downloaded: https://repo.maven.apache.org/maven2/com/googlecode/cmake-maven-project/cmake-maven-plugin/3.16.3-b2/cmake-maven-plugin-3.16.3-b2.pom (8 KB at 9.0 KB/sec)
[INFO] Downloading: https://repo.maven.apache.org/maven2/com/googlecode/cmake-maven-project/cmake/3.16.3-b2/cmake-3.16.3-b2.pom
[INFO] Downloaded: https://repo.maven.apache.org/maven2/com/googlecode/cmake-maven-project/cmake/3.16.3-b2/cmake-3.16.3-b2.pom (10 KB at 181.0 KB/sec)
[INFO] Downloading: https://repo.maven.apache.org/maven2/com/googlecode/cmake-maven-project/cmake-maven-plugin/3.16.3-b2/cmake-maven-plugin-3.16.3-b2.jar
[INFO] Downloaded: https://repo.maven.apache.org/maven2/com/googlecode/cmake-maven-project/cmake-maven-plugin/3.16.3-b2/cmake-maven-plugin-3.16.3-b2.jar (23 KB at 149.0 KB/sec)
[INFO] Downloading: https://repo.maven.apache.org/maven2/org/apache/maven/plugins/maven-compiler-plugin/3.8.1/maven-compiler-plugin-3.8.1.pom
[INFO] Downloaded: https://repo.maven.apache.org/maven2/org/apache/maven/plugins/maven-compiler-plugin/3.8.1/maven-compiler-plugin-3.8.1.pom (13 KB at 248.6 KB/sec)
[INFO] Downloading: https://repo.maven.apache.org/maven2/org/apache/maven/plugins/maven-plugins/33/maven-plugins-33.pom
[INFO] Downloaded: https://repo.maven.apache.org/maven2/org/apache/maven/plugins/maven-plugins/33/maven-plugins-33.pom (11 KB at 222.1 KB/sec)
[INFO] Downloading: https://repo.maven.apache.org/maven2/org/apache/maven/maven-parent/33/maven-parent-33.pom
[INFO] Downloaded: https://repo.maven.apache.org/maven2/org/apache/maven/maven-parent/33/maven-parent-33.pom (44 KB at 756.5 KB/sec)
[INFO] Downloading: https://repo.maven.apache.org/maven2/org/apache/apache/21/apache-21.pom
[INFO] Downloaded: https://repo.maven.apache.org/maven2/org/apache/apache/21/apache-21.pom (17 KB at 371.2 KB/sec)
[INFO] Downloading: https://repo.maven.apache.org/maven2/org/apache/maven/plugins/maven-compiler-plugin/3.8.1/maven-compiler-plugin-3.8.1.jar
[INFO] Downloaded: https://repo.maven.apache.org/maven2/org/apache/maven/plugins/maven-compiler-plugin/3.8.1/maven-compiler-plugin-3.8.1.jar (61 KB at 1238.0 KB/sec)
[INFO] Downloading: https://repo.maven.apache.org/maven2/org/apache/maven/plugins/maven-surefire-plugin/3.0.0-M4/maven-surefire-plugin-3.0.0-M4.pom
[INFO] Downloaded: https://repo.maven.apache.org/maven2/org/apache/maven/plugins/maven-surefire-plugin/3.0.0-M4/maven-surefire-plugin-3.0.0-M4.pom (8 KB at 171.7 KB/sec)
[INFO] Downloading: https://repo.maven.apache.org/maven2/org/apache/maven/surefire/surefire/3.0.0-M4/surefire-3.0.0-M4.pom
[INFO] Downloaded: https://repo.maven.apache.org/maven2/org/apache/maven/surefire/surefire/3.0.0-M4/surefire-3.0.0-M4.pom (27 KB at 558.4 KB/sec)
[INFO] Downloading: https://repo.maven.apache.org/maven2/org/apache/maven/plugins/maven-surefire-plugin/3.0.0-M4/maven-surefire-plugin-3.0.0-M4.jar
[INFO] Downloaded: https://repo.maven.apache.org/maven2/org/apache/maven/plugins/maven-surefire-plugin/3.0.0-M4/maven-surefire-plugin-3.0.0-M4.jar (42 KB at 827.0 KB/sec)
[INFO] ------------------------------------------------------------------------
[INFO] BUILD FAILURE
[INFO] ------------------------------------------------------------------------
[INFO] Total time: 4.476 s
[INFO] Finished at: 2020-04-08T21:23:29+02:00
[INFO] Final Memory: 14M/118M
[INFO] ------------------------------------------------------------------------
Warte bis Jenkins die Datensammlung abgeschlossen hat
[ERROR] Failed to execute goal com.googlecode.cmake-maven-project:cmake-maven-plugin:3.16.3-b2:generate (cmake-generate-linux_64) on project TunDeviceLib: The plugin com.googlecode.cmake-maven-project:cmake-maven-plugin:3.16.3-b2 requires Maven version 3.6.0 -> [Help 1]
[ERROR] 
[ERROR] To see the full stack trace of the errors, re-run Maven with the -e switch.
[ERROR] Re-run Maven using the -X switch to enable full debug logging.
[ERROR] 
[ERROR] For more information about the errors and possible solutions, please read the following articles:
[ERROR] [Help 1] http://cwiki.apache.org/confluence/display/MAVEN/PluginIncompatibleException
[JENKINS] Archiving /var/lib/jenkins/jobs/TunDeviceLib/workspace/pom.xml to anon/TunDeviceLib/0.0.1-SNAPSHOT/TunDeviceLib-0.0.1-SNAPSHOT.pom
channel stopped
Finished: FAILURE