Gestartet durch vorgelagertes Projekt „OpenANONLib“, Build 44 Ursprünglich gestartet durch: Gestartet durch vorgelagertes Projekt „anonlib“, Build 213 Ursprünglich gestartet durch: Build wurde durch eine SCM-Änderung ausgelöst. Running as SYSTEM [EnvInject] - Loading node environment variables. Baue in Arbeitsbereich /var/lib/jenkins/jobs/OpenANONLib/workspace/MAVEN_PROFILE/anon-cc-dev The recommended git tool is: NONE using credential openanonlibgit > git rev-parse --resolve-git-dir /var/lib/jenkins/jobs/OpenANONLib/workspace/MAVEN_PROFILE/anon-cc-dev/.git # timeout=10 Fetching changes from the remote Git repository > git config remote.origin.url https://dud-scm.inf.tu-dresden.de/ANON-next/ap4-openanonlib.git # timeout=10 Fetching upstream changes from https://dud-scm.inf.tu-dresden.de/ANON-next/ap4-openanonlib.git > git --version # timeout=10 > git --version # 'git version 2.20.1' using GIT_ASKPASS to set credentials Git access to OpenANONLib for Jenkins > git fetch --tags --force --progress -- https://dud-scm.inf.tu-dresden.de/ANON-next/ap4-openanonlib.git +refs/heads/*:refs/remotes/origin/* # timeout=10 Checking out Revision 0ed47857e841764fd3d5ddd203a9bd54a28a5a90 (refs/remotes/origin/master) > git config core.sparsecheckout # timeout=10 > git checkout -f 0ed47857e841764fd3d5ddd203a9bd54a28a5a90 # timeout=10 Commit message: "Removed broken link from README.md" > git rev-list --no-walk 0ed47857e841764fd3d5ddd203a9bd54a28a5a90 # timeout=10 [Gradle] - Launching build. [anon-cc-dev] $ /var/lib/jenkins/jobs/OpenANONLib/workspace/MAVEN_PROFILE/anon-cc-dev/gradlew -x test build FAILURE: Build failed with an exception. * What went wrong: Could not determine java version from '11.0.15'. * Try: Run with --stacktrace option to get the stack trace. Run with --info or --debug option to get more log output. Build step 'Gradle ausführen' changed build result to FAILURE Build step 'Gradle ausführen' marked build as failure Finished: FAILURE