Gestartet durch vorgelagertes Projekt „OpenANONLib“, Build 45 Ursprünglich gestartet durch: Gestartet durch vorgelagertes Projekt „anonlib“, Build 214 Ursprünglich gestartet durch: Gestartet durch Benutzer sk13 Running as SYSTEM [EnvInject] - Loading node environment variables. Baue in Arbeitsbereich /var/lib/jenkins/jobs/OpenANONLib/workspace/MAVEN_PROFILE/anon-cc-dev-android The recommended git tool is: NONE using credential openanonlibgit > git rev-parse --resolve-git-dir /var/lib/jenkins/jobs/OpenANONLib/workspace/MAVEN_PROFILE/anon-cc-dev-android/.git # timeout=10 Fetching changes from the remote Git repository > git config remote.origin.url # timeout=10 Fetching upstream changes from > git --version # timeout=10 > git --version # 'git version 2.20.1' using GIT_ASKPASS to set credentials Git access to OpenANONLib for Jenkins > git fetch --tags --force --progress -- +refs/heads/*:refs/remotes/origin/* # timeout=10 Checking out Revision 0ed47857e841764fd3d5ddd203a9bd54a28a5a90 (refs/remotes/origin/master) > git config core.sparsecheckout # timeout=10 > git checkout -f 0ed47857e841764fd3d5ddd203a9bd54a28a5a90 # timeout=10 Commit message: "Removed broken link from" > git rev-list --no-walk 0ed47857e841764fd3d5ddd203a9bd54a28a5a90 # timeout=10 [Gradle] - Launching build. [anon-cc-dev-android] $ /var/lib/jenkins/jobs/OpenANONLib/workspace/MAVEN_PROFILE/anon-cc-dev-android/gradlew -x test build FAILURE: Build failed with an exception. * What went wrong: Could not determine java version from '11.0.15'. * Try: Run with --stacktrace option to get the stack trace. Run with --info or --debug option to get more log output. Build step 'Gradle ausführen' changed build result to FAILURE Build step 'Gradle ausführen' marked build as failure Finished: FAILURE