Console Output

Gestartet durch vorgelagertes Projekt „OpenANONLib“, Build 2
Ursprünglich gestartet durch:
 Gestartet durch Benutzer sk13
[EnvInject] - Loading node environment variables.
Baue in Arbeitsbereich /var/lib/jenkins/jobs/OpenANONLib/workspace/MAVEN_PROFILE/anon-cc-dev-android
 > git rev-parse --is-inside-work-tree # timeout=10
Fetching changes from the remote Git repository
 > git config remote.origin.url https://dud-scm.inf.tu-dresden.de/ANON-next/ap4-openanonlib.git # timeout=10
Fetching upstream changes from https://dud-scm.inf.tu-dresden.de/ANON-next/ap4-openanonlib.git
 > git --version # timeout=10
using GIT_ASKPASS to set credentials Git access to OpenANONLib for Jenkins
 > git fetch --tags --progress https://dud-scm.inf.tu-dresden.de/ANON-next/ap4-openanonlib.git +refs/heads/*:refs/remotes/origin/*
Checking out Revision 85dcdee5810e1eb76d8eca2c0bfb1192f92d3ac5 (refs/remotes/origin/master)
 > git config core.sparsecheckout # timeout=10
 > git checkout -f 85dcdee5810e1eb76d8eca2c0bfb1192f92d3ac5
Commit message: "Reenabled ANON test case and removed obsolete call from Tor-related test case"
 > git rev-list --no-walk 85dcdee5810e1eb76d8eca2c0bfb1192f92d3ac5 # timeout=10
[Gradle] - Launching build.
[anon-cc-dev-android] $ /var/lib/jenkins/jobs/OpenANONLib/workspace/MAVEN_PROFILE/anon-cc-dev-android/gradlew build
Starting a Gradle Daemon (subsequent builds will be faster)
:compileJava/var/lib/jenkins/jobs/OpenANONLib/workspace/MAVEN_PROFILE/anon-cc-dev-android/src/main/java/org/openanonlib/anonymization/tor/TorChannel.java:11: warning: NotImplementedException is internal proprietary API and may be removed in a future release
import sun.reflect.generics.reflectiveObjects.NotImplementedException;
                                             ^
/var/lib/jenkins/jobs/OpenANONLib/workspace/MAVEN_PROFILE/anon-cc-dev-android/src/main/java/org/openanonlib/anonymization/tor/TorChannel.java:25: warning: NotImplementedException is internal proprietary API and may be removed in a future release
        throw new NotImplementedException();
                  ^
/var/lib/jenkins/jobs/OpenANONLib/workspace/MAVEN_PROFILE/anon-cc-dev-android/src/main/java/org/openanonlib/anonymization/tor/TorChannel.java:30: warning: NotImplementedException is internal proprietary API and may be removed in a future release
        throw new NotImplementedException();
                  ^
3 warnings

:processResources UP-TO-DATE
:classes
:jar
:assemble
:compileTestJava
:processTestResources UP-TO-DATE
:testClasses
:test

org.openanonlib.apps.AnonSocketImplFactoryTest > Tor_HTTP_IPTest FAILED
    java.io.IOException at AnonSocketImplFactoryTest.java:58

org.openanonlib.apps.AnonSocketImplFactoryTest > ANON_HTTP_IPTest FAILED
    java.io.IOException at AnonSocketImplFactoryTest.java:38

2 tests completed, 2 failed
:test FAILED

FAILURE: Build failed with an exception.

* What went wrong:
Execution failed for task ':test'.
> There were failing tests. See the report at: file:///var/lib/jenkins/jobs/OpenANONLib/workspace/MAVEN_PROFILE/anon-cc-dev-android/build/reports/tests/test/index.html

* Try:
Run with --stacktrace option to get the stack trace. Run with --info or --debug option to get more log output.

BUILD FAILED

Total time: 8.776 secs
Build step 'Invoke Gradle script' changed build result to FAILURE
Build step 'Invoke Gradle script' marked build as failure
Finished: FAILURE