Console Output

<===[JENKINS REMOTING CAPACITY]===>channel started
log4j:WARN No appenders could be found for logger (org.apache.commons.beanutils.converters.BooleanConverter).
log4j:WARN Please initialize the log4j system properly.
Executing Maven:  -B -f /var/lib/jenkins/jobs/MixConfig-release/workspace/pom.xml -Dmaven.repo.local=/var/lib/jenkins/maven-repositories/0 deploy -Panon-cc-release
[INFO] Scanning for projects...
[INFO]                                                                         
[INFO] ------------------------------------------------------------------------
[INFO] Building MixConfig 00.05.038-SNAPSHOT
[INFO] ------------------------------------------------------------------------
Downloading: http://repo.maven.apache.org/maven2/org/apache/maven/plugins/maven-jarsigner-plugin/1.3.1/maven-jarsigner-plugin-1.3.1.pom
Downloaded: http://repo.maven.apache.org/maven2/org/apache/maven/plugins/maven-jarsigner-plugin/1.3.1/maven-jarsigner-plugin-1.3.1.pom (7 KB at 19.5 KB/sec)
Downloading: http://repo.maven.apache.org/maven2/org/apache/maven/plugins/maven-jarsigner-plugin/1.3.1/maven-jarsigner-plugin-1.3.1.jar
Downloaded: http://repo.maven.apache.org/maven2/org/apache/maven/plugins/maven-jarsigner-plugin/1.3.1/maven-jarsigner-plugin-1.3.1.jar (33 KB at 445.6 KB/sec)
Downloading: http://anon.inf.tu-dresden.de/artifactory/repo/anon/guilib/00.00.201-SNAPSHOT/maven-metadata.xml
Downloaded: http://anon.inf.tu-dresden.de/artifactory/repo/anon/guilib/00.00.201-SNAPSHOT/maven-metadata.xml (305 B at 5.1 KB/sec)
Downloading: http://anon.inf.tu-dresden.de/artifactory/repo/anon/anonlib/00.19.005-SNAPSHOT/maven-metadata.xml
Downloaded: http://anon.inf.tu-dresden.de/artifactory/repo/anon/anonlib/00.19.005-SNAPSHOT/maven-metadata.xml (306 B at 18.7 KB/sec)
Downloading: http://anon.inf.tu-dresden.de/artifactory/repo/anon/BouncyCastleLightForAN.ON/01.50.003-SNAPSHOT/maven-metadata.xml
Downloaded: http://anon.inf.tu-dresden.de/artifactory/repo/anon/BouncyCastleLightForAN.ON/01.50.003-SNAPSHOT/maven-metadata.xml (324 B at 21.1 KB/sec)
Downloading: http://anon.inf.tu-dresden.de/artifactory/repo/anon/HTTPClient/00.04.010-SNAPSHOT/maven-metadata.xml
Downloaded: http://anon.inf.tu-dresden.de/artifactory/repo/anon/HTTPClient/00.04.010-SNAPSHOT/maven-metadata.xml (309 B at 17.8 KB/sec)
Downloading: http://anon.inf.tu-dresden.de/artifactory/repo/anon/SkypeForANON/0.0.13-SNAPSHOT/maven-metadata.xml
Downloaded: http://anon.inf.tu-dresden.de/artifactory/repo/anon/SkypeForANON/0.0.13-SNAPSHOT/maven-metadata.xml (308 B at 18.8 KB/sec)
Downloading: http://anon.inf.tu-dresden.de/artifactory/repo/anon/ApacheFTPClient/0.0.2-SNAPSHOT/maven-metadata.xml
Downloaded: http://anon.inf.tu-dresden.de/artifactory/repo/anon/ApacheFTPClient/0.0.2-SNAPSHOT/maven-metadata.xml (310 B at 20.2 KB/sec)
Downloading: http://anon.inf.tu-dresden.de/artifactory/repo/anon/logging/0.1.9-SNAPSHOT/maven-metadata.xml
Downloaded: http://anon.inf.tu-dresden.de/artifactory/repo/anon/logging/0.1.9-SNAPSHOT/maven-metadata.xml (302 B at 19.7 KB/sec)
Downloading: http://anon.inf.tu-dresden.de/artifactory/repo/anon/log4jForANON/0.0.4-SNAPSHOT/maven-metadata.xml
Downloaded: http://anon.inf.tu-dresden.de/artifactory/repo/anon/log4jForANON/0.0.4-SNAPSHOT/maven-metadata.xml (307 B at 20.0 KB/sec)
[INFO] 
[INFO] --- maven-resources-plugin:2.5:resources (default-resources) @ MixConfig ---
[debug] execute contextualize
[WARNING] Using platform encoding (UTF-8 actually) to copy filtered resources, i.e. build is platform dependent!
[INFO] Copying 166 resources
[INFO] 
[INFO] --- maven-compiler-plugin:3.1:compile (default-compile) @ MixConfig ---
[INFO] Changes detected - recompiling the module!
[WARNING] File encoding has not been set, using platform encoding UTF-8, i.e. build is platform dependent!
[INFO] Compiling 78 source files to /var/lib/jenkins/jobs/MixConfig-release/workspace/target/classes
[WARNING] /var/lib/jenkins/jobs/MixConfig-release/workspace/src/main/java/mixconfig/tools/dataretention/RetentionDlg.java: Some input files use or override a deprecated API.
[WARNING] /var/lib/jenkins/jobs/MixConfig-release/workspace/src/main/java/mixconfig/tools/dataretention/RetentionDlg.java: Recompile with -Xlint:deprecation for details.
[WARNING] /var/lib/jenkins/jobs/MixConfig-release/workspace/src/main/java/mixconfig/panels/CertPanel.java: Some input files use unchecked or unsafe operations.
[WARNING] /var/lib/jenkins/jobs/MixConfig-release/workspace/src/main/java/mixconfig/panels/CertPanel.java: Recompile with -Xlint:unchecked for details.
[INFO] 
[INFO] --- maven-resources-plugin:2.5:testResources (default-testResources) @ MixConfig ---
[debug] execute contextualize
[WARNING] Using platform encoding (UTF-8 actually) to copy filtered resources, i.e. build is platform dependent!
[INFO] skip non existing resourceDirectory /var/lib/jenkins/jobs/MixConfig-release/workspace/src/test/resources
[INFO] 
[INFO] --- maven-compiler-plugin:3.1:testCompile (default-testCompile) @ MixConfig ---
[INFO] Changes detected - recompiling the module!
[WARNING] File encoding has not been set, using platform encoding UTF-8, i.e. build is platform dependent!
[INFO] Compiling 1 source file to /var/lib/jenkins/jobs/MixConfig-release/workspace/target/test-classes
[INFO] 
[INFO] --- maven-surefire-plugin:2.10:test (default-test) @ MixConfig ---
[INFO] Surefire report directory: /var/lib/jenkins/jobs/MixConfig-release/workspace/target/surefire-reports

-------------------------------------------------------
 T E S T S
-------------------------------------------------------

Results :

Tests run: 0, Failures: 0, Errors: 0, Skipped: 0

[JENKINS] Zeichne Testergebnisse auf
[INFO] 
[INFO] --- maven-jar-plugin:2.3.2:jar (default-jar) @ MixConfig ---
[INFO] Building jar: /var/lib/jenkins/jobs/MixConfig-release/workspace/target/MixConfig-00.05.038-SNAPSHOT.jar
[INFO] 
[INFO] --- maven-assembly-plugin:2.4:single (create-executable-jar) @ MixConfig ---
[INFO] Building jar: /var/lib/jenkins/jobs/MixConfig-release/workspace/target/MixConfig-00.05.038-SNAPSHOT-jar-with-dependencies.jar
[INFO] 
[INFO] --- maven-jarsigner-plugin:1.3.1:sign (sign-executable-jar) @ MixConfig ---
Downloading: http://repo.maven.apache.org/maven2/org/apache/maven/maven-plugin-api/2.1.0/maven-plugin-api-2.1.0.pom
Downloaded: http://repo.maven.apache.org/maven2/org/apache/maven/maven-plugin-api/2.1.0/maven-plugin-api-2.1.0.pom (2 KB at 20.6 KB/sec)
Downloading: http://repo.maven.apache.org/maven2/org/apache/maven/maven/2.1.0/maven-2.1.0.pom
Downloaded: http://repo.maven.apache.org/maven2/org/apache/maven/maven/2.1.0/maven-2.1.0.pom (22 KB at 336.9 KB/sec)
Downloading: http://repo.maven.apache.org/maven2/org/apache/maven/maven-project/2.1.0/maven-project-2.1.0.pom
Downloaded: http://repo.maven.apache.org/maven2/org/apache/maven/maven-project/2.1.0/maven-project-2.1.0.pom (3 KB at 43.6 KB/sec)
Downloading: http://repo.maven.apache.org/maven2/org/apache/maven/maven-settings/2.1.0/maven-settings-2.1.0.pom
Downloaded: http://repo.maven.apache.org/maven2/org/apache/maven/maven-settings/2.1.0/maven-settings-2.1.0.pom (3 KB at 35.4 KB/sec)
Downloading: http://repo.maven.apache.org/maven2/org/apache/maven/maven-model/2.1.0/maven-model-2.1.0.pom
Downloaded: http://repo.maven.apache.org/maven2/org/apache/maven/maven-model/2.1.0/maven-model-2.1.0.pom (4 KB at 51.8 KB/sec)
Downloading: http://repo.maven.apache.org/maven2/org/codehaus/plexus/plexus-interpolation/1.8.1/plexus-interpolation-1.8.1.pom
Downloaded: http://repo.maven.apache.org/maven2/org/codehaus/plexus/plexus-interpolation/1.8.1/plexus-interpolation-1.8.1.pom (880 B at 13.4 KB/sec)
Downloading: http://repo.maven.apache.org/maven2/org/codehaus/plexus/plexus/1.0.13/plexus-1.0.13.pom
Downloaded: http://repo.maven.apache.org/maven2/org/codehaus/plexus/plexus/1.0.13/plexus-1.0.13.pom (11 KB at 146.7 KB/sec)
Downloading: http://repo.maven.apache.org/maven2/org/apache/maven/maven-profile/2.1.0/maven-profile-2.1.0.pom
Downloaded: http://repo.maven.apache.org/maven2/org/apache/maven/maven-profile/2.1.0/maven-profile-2.1.0.pom (2 KB at 40.6 KB/sec)
Downloading: http://repo.maven.apache.org/maven2/org/apache/maven/maven-artifact-manager/2.1.0/maven-artifact-manager-2.1.0.pom
Downloaded: http://repo.maven.apache.org/maven2/org/apache/maven/maven-artifact-manager/2.1.0/maven-artifact-manager-2.1.0.pom (4 KB at 62.0 KB/sec)
Downloading: http://repo.maven.apache.org/maven2/org/apache/maven/maven-repository-metadata/2.1.0/maven-repository-metadata-2.1.0.pom
Downloaded: http://repo.maven.apache.org/maven2/org/apache/maven/maven-repository-metadata/2.1.0/maven-repository-metadata-2.1.0.pom (2 KB at 36.9 KB/sec)
Downloading: http://repo.maven.apache.org/maven2/org/apache/maven/maven-artifact/2.1.0/maven-artifact-2.1.0.pom
Downloaded: http://repo.maven.apache.org/maven2/org/apache/maven/maven-artifact/2.1.0/maven-artifact-2.1.0.pom (2 KB at 31.4 KB/sec)
Downloading: http://repo.maven.apache.org/maven2/org/apache/maven/maven-plugin-registry/2.1.0/maven-plugin-registry-2.1.0.pom
Downloaded: http://repo.maven.apache.org/maven2/org/apache/maven/maven-plugin-registry/2.1.0/maven-plugin-registry-2.1.0.pom (2 KB at 39.9 KB/sec)
Downloading: http://repo.maven.apache.org/maven2/org/apache/maven/shared/maven-shared-utils/0.5/maven-shared-utils-0.5.pom
Downloaded: http://repo.maven.apache.org/maven2/org/apache/maven/shared/maven-shared-utils/0.5/maven-shared-utils-0.5.pom (5 KB at 103.5 KB/sec)
Downloading: http://repo.maven.apache.org/maven2/org/sonatype/plexus/plexus-sec-dispatcher/1.4/plexus-sec-dispatcher-1.4.pom
Downloaded: http://repo.maven.apache.org/maven2/org/sonatype/plexus/plexus-sec-dispatcher/1.4/plexus-sec-dispatcher-1.4.pom (3 KB at 60.2 KB/sec)
Downloading: http://repo.maven.apache.org/maven2/org/apache/maven/shared/maven-jarsigner/1.3.1/maven-jarsigner-1.3.1.pom
Downloaded: http://repo.maven.apache.org/maven2/org/apache/maven/shared/maven-jarsigner/1.3.1/maven-jarsigner-1.3.1.pom (4 KB at 59.2 KB/sec)
Downloading: http://repo.maven.apache.org/maven2/org/apache/maven/maven-toolchain/2.1.0/maven-toolchain-2.1.0.pom
Downloaded: http://repo.maven.apache.org/maven2/org/apache/maven/maven-toolchain/2.1.0/maven-toolchain-2.1.0.pom (4 KB at 68.0 KB/sec)
Downloading: http://repo.maven.apache.org/maven2/org/apache/maven/maven-core/2.1.0/maven-core-2.1.0.pom
Downloaded: http://repo.maven.apache.org/maven2/org/apache/maven/maven-core/2.1.0/maven-core-2.1.0.pom (9 KB at 169.3 KB/sec)
Downloading: http://repo.maven.apache.org/maven2/org/apache/maven/maven-plugin-parameter-documenter/2.1.0/maven-plugin-parameter-documenter-2.1.0.pom
Downloaded: http://repo.maven.apache.org/maven2/org/apache/maven/maven-plugin-parameter-documenter/2.1.0/maven-plugin-parameter-documenter-2.1.0.pom (2 KB at 39.7 KB/sec)
Downloading: http://repo.maven.apache.org/maven2/org/apache/maven/reporting/maven-reporting-api/2.1.0/maven-reporting-api-2.1.0.pom
Downloaded: http://repo.maven.apache.org/maven2/org/apache/maven/reporting/maven-reporting-api/2.1.0/maven-reporting-api-2.1.0.pom (2 KB at 37.6 KB/sec)
Downloading: http://repo.maven.apache.org/maven2/org/apache/maven/reporting/maven-reporting/2.1.0/maven-reporting-2.1.0.pom
Downloaded: http://repo.maven.apache.org/maven2/org/apache/maven/reporting/maven-reporting/2.1.0/maven-reporting-2.1.0.pom (2 KB at 29.3 KB/sec)
Downloading: http://repo.maven.apache.org/maven2/org/apache/maven/maven-error-diagnostics/2.1.0/maven-error-diagnostics-2.1.0.pom
Downloaded: http://repo.maven.apache.org/maven2/org/apache/maven/maven-error-diagnostics/2.1.0/maven-error-diagnostics-2.1.0.pom (2 KB at 34.0 KB/sec)
Downloading: http://repo.maven.apache.org/maven2/org/apache/maven/maven-plugin-descriptor/2.1.0/maven-plugin-descriptor-2.1.0.pom
Downloaded: http://repo.maven.apache.org/maven2/org/apache/maven/maven-plugin-descriptor/2.1.0/maven-plugin-descriptor-2.1.0.pom (3 KB at 41.1 KB/sec)
Downloading: http://repo.maven.apache.org/maven2/org/apache/maven/maven-monitor/2.1.0/maven-monitor-2.1.0.pom
Downloaded: http://repo.maven.apache.org/maven2/org/apache/maven/maven-monitor/2.1.0/maven-monitor-2.1.0.pom (2 KB at 25.0 KB/sec)
Downloading: http://repo.maven.apache.org/maven2/org/sonatype/plexus/plexus-sec-dispatcher/1.1/plexus-sec-dispatcher-1.1.pom
Downloaded: http://repo.maven.apache.org/maven2/org/sonatype/plexus/plexus-sec-dispatcher/1.1/plexus-sec-dispatcher-1.1.pom (3 KB at 54.5 KB/sec)
Downloading: http://repo.maven.apache.org/maven2/org/sonatype/spice/spice-parent/11/spice-parent-11.pom
Downloaded: http://repo.maven.apache.org/maven2/org/sonatype/spice/spice-parent/11/spice-parent-11.pom (4 KB at 78.0 KB/sec)
Downloading: http://repo.maven.apache.org/maven2/org/sonatype/plexus/plexus-cipher/1.1/plexus-cipher-1.1.pom
Downloaded: http://repo.maven.apache.org/maven2/org/sonatype/plexus/plexus-cipher/1.1/plexus-cipher-1.1.pom (2 KB at 38.7 KB/sec)
Downloading: http://repo.maven.apache.org/maven2/org/codehaus/plexus/plexus-interpolation/1.8.1/plexus-interpolation-1.8.1.jar
Downloading: http://repo.maven.apache.org/maven2/org/apache/maven/shared/maven-shared-utils/0.5/maven-shared-utils-0.5.jar
Downloading: http://repo.maven.apache.org/maven2/org/sonatype/plexus/plexus-sec-dispatcher/1.4/plexus-sec-dispatcher-1.4.jar
Downloading: http://repo.maven.apache.org/maven2/org/apache/maven/shared/maven-jarsigner/1.3.1/maven-jarsigner-1.3.1.jar
Downloading: http://repo.maven.apache.org/maven2/org/apache/maven/reporting/maven-reporting-api/2.1.0/maven-reporting-api-2.1.0.jar
Downloaded: http://repo.maven.apache.org/maven2/org/apache/maven/reporting/maven-reporting-api/2.1.0/maven-reporting-api-2.1.0.jar (11 KB at 142.5 KB/sec)
Downloaded: http://repo.maven.apache.org/maven2/org/codehaus/plexus/plexus-interpolation/1.8.1/plexus-interpolation-1.8.1.jar (50 KB at 660.1 KB/sec)
Downloaded: http://repo.maven.apache.org/maven2/org/sonatype/plexus/plexus-sec-dispatcher/1.4/plexus-sec-dispatcher-1.4.jar (28 KB at 297.3 KB/sec)
Downloaded: http://repo.maven.apache.org/maven2/org/apache/maven/shared/maven-jarsigner/1.3.1/maven-jarsigner-1.3.1.jar (22 KB at 226.2 KB/sec)
Downloaded: http://repo.maven.apache.org/maven2/org/apache/maven/shared/maven-shared-utils/0.5/maven-shared-utils-0.5.jar (161 KB at 1016.1 KB/sec)
[WARNING] Enter Passphrase for keystore: 
[INFO] ------------------------------------------------------------------------
[INFO] BUILD FAILURE
[INFO] ------------------------------------------------------------------------
[INFO] Total time: 13.671s
[INFO] Finished at: Mon Mar 03 13:19:43 CET 2014
[INFO] Final Memory: 25M/464M
[INFO] ------------------------------------------------------------------------
Warte bis Jenkins die Datensammlung abgeschlossen hat
[ERROR] Failed to execute goal org.apache.maven.plugins:maven-jarsigner-plugin:1.3.1:sign (sign-executable-jar) on project MixConfig: Ausführung von '/bin/sh -c cd /var/lib/jenkins/jobs/MixConfig-release/workspace && /opt/java/jdk1.7.0_21/jre/../bin/jarsigner -sigfile JAP-TEAM /var/lib/jenkins/jobs/MixConfig-release/workspace/target/MixConfig-00.05.038-SNAPSHOT-jar-with-dependencies.jar jap' fehlgeschlagen - Ergebniscode (1) -> [Help 1]
[ERROR] 
[ERROR] To see the full stack trace of the errors, re-run Maven with the -e switch.
[ERROR] Re-run Maven using the -X switch to enable full debug logging.
[ERROR] 
[ERROR] For more information about the errors and possible solutions, please read the following articles:
[ERROR] [Help 1] http://cwiki.apache.org/confluence/display/MAVEN/MojoExecutionException