Console Output

<===[JENKINS REMOTING CAPACITY]===>channel started
Executing Maven:  -B -f /var/lib/jenkins/jobs/MixConfig-daily-dev-snapshot/workspace/pom.xml -Dmaven.repo.local=/var/lib/jenkins/maven-repositories/0 deploy -Panon-cc-dev,anon-cc-daily-snapshot
[INFO] Scanning for projects...
[INFO]                                                                         
[INFO] ------------------------------------------------------------------------
[INFO] Building MixConfig 00.05.038-SNAPSHOT
[INFO] ------------------------------------------------------------------------
Downloading: http://anon.inf.tu-dresden.de/artifactory/repo/anon/guilib/00.00.201-SNAPSHOT/maven-metadata.xml
Downloaded: http://anon.inf.tu-dresden.de/artifactory/repo/anon/guilib/00.00.201-SNAPSHOT/maven-metadata.xml (305 B at 1.0 KB/sec)
Downloading: http://svn.jondos.de/maven/repos/anon/anonlib/00.19.005-SNAPSHOT/maven-metadata.xml
Downloading: http://anon.inf.tu-dresden.de/artifactory/repo/anon/anonlib/00.19.005-SNAPSHOT/maven-metadata.xml
Downloaded: http://anon.inf.tu-dresden.de/artifactory/repo/anon/anonlib/00.19.005-SNAPSHOT/maven-metadata.xml (306 B at 5.6 KB/sec)
Downloading: http://anon.inf.tu-dresden.de/artifactory/repo/anon/BouncyCastleLightForAN.ON/01.50.003-SNAPSHOT/maven-metadata.xml
Downloading: http://svn.jondos.de/maven/repos/anon/BouncyCastleLightForAN.ON/01.50.003-SNAPSHOT/maven-metadata.xml
Downloaded: http://anon.inf.tu-dresden.de/artifactory/repo/anon/BouncyCastleLightForAN.ON/01.50.003-SNAPSHOT/maven-metadata.xml (324 B at 11.7 KB/sec)
Downloading: http://anon.inf.tu-dresden.de/artifactory/repo/anon/HTTPClient/00.04.010-SNAPSHOT/maven-metadata.xml
Downloading: http://svn.jondos.de/maven/repos/anon/HTTPClient/00.04.010-SNAPSHOT/maven-metadata.xml
Downloaded: http://anon.inf.tu-dresden.de/artifactory/repo/anon/HTTPClient/00.04.010-SNAPSHOT/maven-metadata.xml (309 B at 8.2 KB/sec)
Downloading: http://anon.inf.tu-dresden.de/artifactory/repo/anon/SkypeForANON/0.0.13-SNAPSHOT/maven-metadata.xml
Downloading: http://svn.jondos.de/maven/repos/anon/SkypeForANON/0.0.13-SNAPSHOT/maven-metadata.xml
Downloaded: http://anon.inf.tu-dresden.de/artifactory/repo/anon/SkypeForANON/0.0.13-SNAPSHOT/maven-metadata.xml (308 B at 12.0 KB/sec)
Downloading: http://anon.inf.tu-dresden.de/artifactory/repo/anon/ApacheFTPClient/0.0.2-SNAPSHOT/maven-metadata.xml
Downloading: http://svn.jondos.de/maven/repos/anon/ApacheFTPClient/0.0.2-SNAPSHOT/maven-metadata.xml
Downloaded: http://anon.inf.tu-dresden.de/artifactory/repo/anon/ApacheFTPClient/0.0.2-SNAPSHOT/maven-metadata.xml (310 B at 9.8 KB/sec)
Downloading: http://anon.inf.tu-dresden.de/artifactory/repo/anon/logging/0.1.9-SNAPSHOT/maven-metadata.xml
Downloading: http://svn.jondos.de/maven/repos/anon/logging/0.1.9-SNAPSHOT/maven-metadata.xml
Downloaded: http://anon.inf.tu-dresden.de/artifactory/repo/anon/logging/0.1.9-SNAPSHOT/maven-metadata.xml (302 B at 14.7 KB/sec)
Downloading: http://svn.jondos.de/maven/repos/anon/log4jForANON/0.0.4-SNAPSHOT/maven-metadata.xml
Downloading: http://anon.inf.tu-dresden.de/artifactory/repo/anon/log4jForANON/0.0.4-SNAPSHOT/maven-metadata.xml
Downloaded: http://anon.inf.tu-dresden.de/artifactory/repo/anon/log4jForANON/0.0.4-SNAPSHOT/maven-metadata.xml (307 B at 10.7 KB/sec)
[INFO] 
[INFO] --- maven-resources-plugin:2.5:resources (default-resources) @ MixConfig ---
[debug] execute contextualize
[WARNING] Using platform encoding (UTF-8 actually) to copy filtered resources, i.e. build is platform dependent!
[INFO] Copying 166 resources
[INFO] 
[INFO] --- maven-compiler-plugin:3.1:compile (default-compile) @ MixConfig ---
[INFO] Changes detected - recompiling the module!
[WARNING] File encoding has not been set, using platform encoding UTF-8, i.e. build is platform dependent!
[INFO] Compiling 78 source files to /var/lib/jenkins/jobs/MixConfig-daily-dev-snapshot/workspace/target/classes
[WARNING] /var/lib/jenkins/jobs/MixConfig-daily-dev-snapshot/workspace/src/main/java/mixconfig/tools/dataretention/DataRetentionLogFileEntry.java: Some input files use or override a deprecated API.
[WARNING] /var/lib/jenkins/jobs/MixConfig-daily-dev-snapshot/workspace/src/main/java/mixconfig/tools/dataretention/DataRetentionLogFileEntry.java: Recompile with -Xlint:deprecation for details.
[WARNING] /var/lib/jenkins/jobs/MixConfig-daily-dev-snapshot/workspace/src/main/java/mixconfig/panels/CertPanel.java: Some input files use unchecked or unsafe operations.
[WARNING] /var/lib/jenkins/jobs/MixConfig-daily-dev-snapshot/workspace/src/main/java/mixconfig/panels/CertPanel.java: Recompile with -Xlint:unchecked for details.
[INFO] 
[INFO] --- maven-resources-plugin:2.5:testResources (default-testResources) @ MixConfig ---
[debug] execute contextualize
[WARNING] Using platform encoding (UTF-8 actually) to copy filtered resources, i.e. build is platform dependent!
[INFO] skip non existing resourceDirectory /var/lib/jenkins/jobs/MixConfig-daily-dev-snapshot/workspace/src/test/resources
[INFO] 
[INFO] --- maven-compiler-plugin:3.1:testCompile (default-testCompile) @ MixConfig ---
[INFO] Changes detected - recompiling the module!
[WARNING] File encoding has not been set, using platform encoding UTF-8, i.e. build is platform dependent!
[INFO] Compiling 1 source file to /var/lib/jenkins/jobs/MixConfig-daily-dev-snapshot/workspace/target/test-classes
[INFO] 
[INFO] --- maven-surefire-plugin:2.10:test (default-test) @ MixConfig ---
[INFO] Surefire report directory: /var/lib/jenkins/jobs/MixConfig-daily-dev-snapshot/workspace/target/surefire-reports

-------------------------------------------------------
 T E S T S
-------------------------------------------------------

Results :

Tests run: 0, Failures: 0, Errors: 0, Skipped: 0

[JENKINS] Zeichne Testergebnisse auf
[INFO] 
[INFO] --- maven-jar-plugin:2.3.2:jar (default-jar) @ MixConfig ---
[INFO] Building jar: /var/lib/jenkins/jobs/MixConfig-daily-dev-snapshot/workspace/target/MixConfig-00.05.038-SNAPSHOT.jar
[INFO] 
[INFO] --- maven-assembly-plugin:2.4:single (create-executable-jar) @ MixConfig ---
[INFO] Building jar: /var/lib/jenkins/jobs/MixConfig-daily-dev-snapshot/workspace/target/MixConfig-00.05.038-SNAPSHOT-jar-with-dependencies.jar
[INFO] 
[INFO] --- maven-jarsigner-plugin:1.3.1:sign (sign-executable-jar) @ MixConfig ---
[INFO] 1 Archiv(e) verarbeitet
[INFO] 
[INFO] --- maven-install-plugin:2.3.1:install (default-install) @ MixConfig ---
[INFO] Installing /var/lib/jenkins/jobs/MixConfig-daily-dev-snapshot/workspace/target/MixConfig-00.05.038-SNAPSHOT.jar to /var/lib/jenkins/maven-repositories/0/anon/MixConfig/00.05.038-SNAPSHOT/MixConfig-00.05.038-SNAPSHOT.jar
[INFO] Installing /var/lib/jenkins/jobs/MixConfig-daily-dev-snapshot/workspace/pom.xml to /var/lib/jenkins/maven-repositories/0/anon/MixConfig/00.05.038-SNAPSHOT/MixConfig-00.05.038-SNAPSHOT.pom
[INFO] Installing /var/lib/jenkins/jobs/MixConfig-daily-dev-snapshot/workspace/target/MixConfig-00.05.038-SNAPSHOT-jar-with-dependencies.jar to /var/lib/jenkins/maven-repositories/0/anon/MixConfig/00.05.038-SNAPSHOT/MixConfig-00.05.038-SNAPSHOT-jar-with-dependencies.jar
[INFO] 
[INFO] --- maven-deploy-plugin:2.7:deploy (default-deploy) @ MixConfig ---
Downloading: https://anon.inf.tu-dresden.de:443/artifactory/artifacts-dev/anon/MixConfig/00.05.038-SNAPSHOT/maven-metadata.xml
Downloaded: https://anon.inf.tu-dresden.de:443/artifactory/artifacts-dev/anon/MixConfig/00.05.038-SNAPSHOT/maven-metadata.xml (308 B at 0.8 KB/sec)
Uploading: https://anon.inf.tu-dresden.de:443/artifactory/artifacts-dev/anon/MixConfig/00.05.038-SNAPSHOT/MixConfig-00.05.038-20150418.220931-2.jar
Uploaded: https://anon.inf.tu-dresden.de:443/artifactory/artifacts-dev/anon/MixConfig/00.05.038-SNAPSHOT/MixConfig-00.05.038-20150418.220931-2.jar (914 KB at 2810.3 KB/sec)
Uploading: https://anon.inf.tu-dresden.de:443/artifactory/artifacts-dev/anon/MixConfig/00.05.038-SNAPSHOT/MixConfig-00.05.038-20150418.220931-2.pom
Uploaded: https://anon.inf.tu-dresden.de:443/artifactory/artifacts-dev/anon/MixConfig/00.05.038-SNAPSHOT/MixConfig-00.05.038-20150418.220931-2.pom (11 KB at 8.7 KB/sec)
Downloading: https://anon.inf.tu-dresden.de:443/artifactory/artifacts-dev/anon/MixConfig/maven-metadata.xml
Downloaded: https://anon.inf.tu-dresden.de:443/artifactory/artifacts-dev/anon/MixConfig/maven-metadata.xml (2 KB at 15.6 KB/sec)
Uploading: https://anon.inf.tu-dresden.de:443/artifactory/artifacts-dev/anon/MixConfig/00.05.038-SNAPSHOT/maven-metadata.xml
Uploaded: https://anon.inf.tu-dresden.de:443/artifactory/artifacts-dev/anon/MixConfig/00.05.038-SNAPSHOT/maven-metadata.xml (775 B at 6.6 KB/sec)
Uploading: https://anon.inf.tu-dresden.de:443/artifactory/artifacts-dev/anon/MixConfig/maven-metadata.xml
Uploaded: https://anon.inf.tu-dresden.de:443/artifactory/artifacts-dev/anon/MixConfig/maven-metadata.xml (2 KB at 6.3 KB/sec)
Uploading: https://anon.inf.tu-dresden.de:443/artifactory/artifacts-dev/anon/MixConfig/00.05.038-SNAPSHOT/MixConfig-00.05.038-20150418.220931-2-jar-with-dependencies.jar
Uploaded: https://anon.inf.tu-dresden.de:443/artifactory/artifacts-dev/anon/MixConfig/00.05.038-SNAPSHOT/MixConfig-00.05.038-20150418.220931-2-jar-with-dependencies.jar (3825 KB at 6854.5 KB/sec)
Uploading: https://anon.inf.tu-dresden.de:443/artifactory/artifacts-dev/anon/MixConfig/00.05.038-SNAPSHOT/maven-metadata.xml
Uploaded: https://anon.inf.tu-dresden.de:443/artifactory/artifacts-dev/anon/MixConfig/00.05.038-SNAPSHOT/maven-metadata.xml (1007 B at 5.6 KB/sec)
[INFO] 
[INFO] --- maven-antrun-plugin:1.6:run (default) @ MixConfig ---
[INFO] Executing tasks

main:

getCurrentVersionInformation:
     [echo] Current Version: 00.05.035

deploy_to_sourceforge:
     [exec] ssh_askpass: exec(/usr/bin/ssh-askpass): No such file or directory
     [exec] ssh_askpass: exec(/usr/bin/ssh-askpass): No such file or directory
     [exec] ssh_askpass: exec(/usr/bin/ssh-askpass): No such file or directory
     [exec] ssh_askpass: exec(/usr/bin/ssh-askpass): No such file or directory
     [exec] Permission denied, please try again.
     [exec] ssh_askpass: exec(/usr/bin/ssh-askpass): No such file or directory
     [exec] Received disconnect from 216.34.181.57: 2: Too many authentication failures for anonsfrelease
     [exec] rsync: connection unexpectedly closed (0 bytes received so far) [sender]
     [exec] rsync error: unexplained error (code 255) at io.c(605) [sender=3.0.9]
[INFO] ------------------------------------------------------------------------
[INFO] BUILD FAILURE
[INFO] ------------------------------------------------------------------------
[INFO] Total time: 4:53.238s
[INFO] Finished at: Sun Apr 19 00:10:17 CEST 2015
[INFO] Final Memory: 31M/463M
[INFO] ------------------------------------------------------------------------
[ERROR] Failed to execute goal org.apache.maven.plugins:maven-antrun-plugin:1.6:run (default) on project MixConfig: An Ant BuildException has occured: The following error occurred while executing this line:
Warte bis Jenkins die Datensammlung abgeschlossen hat[ERROR] /var/lib/jenkins/jobs/MixConfig-daily-dev-snapshot/workspace/ant_build_maven_anon_cc_deploy.xml:47: exec returned: 255
[ERROR] -> [Help 1]
[ERROR] 

[ERROR] To see the full stack trace of the errors, re-run Maven with the -e switch.
[ERROR] Re-run Maven using the -X switch to enable full debug logging.
[ERROR] 
[ERROR] For more information about the errors and possible solutions, please read the following articles:
[ERROR] [Help 1] http://cwiki.apache.org/confluence/display/MAVEN/MojoExecutionException