Console Output

Established TCP socket on 34193
<===[JENKINS REMOTING CAPACITY]===>channel started
Executing Maven:  -B -f /var/lib/jenkins/jobs/JAP/workspace/pom.xml -Dmaven.repo.local=/var/lib/jenkins/maven-repositories/0 deploy -Panon-cc-dev
[INFO] Scanning for projects...
[INFO]                                                                         
[INFO] ------------------------------------------------------------------------
[INFO] Building jap 00.20.010-SNAPSHOT
[INFO] ------------------------------------------------------------------------
[INFO] Downloading: https://anon.inf.tu-dresden.de/artifactory/repo/anon/guilib/00.00.231-SNAPSHOT/guilib-00.00.231-20190201.160523-2.pom
[INFO] Downloading: http://svn.jondos.de/maven/repos/anon/guilib/00.00.231-SNAPSHOT/guilib-00.00.231-20190201.160523-2.pom
[WARNING] The POM for anon:guilib:jar:00.00.231-20190201.160523-2 is missing, no dependency information available
[INFO] Downloading: https://anon.inf.tu-dresden.de/artifactory/repo/anon/guilib/00.00.231-SNAPSHOT/guilib-00.00.231-20190201.160523-2.jar
[WARNING] Attempt to (de-)serialize anonymous class hudson.maven.reporters.MavenArtifactArchiver$2; see: https://jenkins.io/redirect/serialization-of-anonymous-classes/
[WARNING] Attempt to (de-)serialize anonymous class hudson.maven.reporters.MavenFingerprinter$1; see: https://jenkins.io/redirect/serialization-of-anonymous-classes/
[INFO] ------------------------------------------------------------------------
[INFO] BUILD FAILURE
[INFO] ------------------------------------------------------------------------
[INFO] Total time: 3.781 s
[INFO] Finished at: 2019-02-01T17:07:56+01:00
[INFO] Final Memory: 14M/113M
[INFO] ------------------------------------------------------------------------
[ERROR] Failed to execute goal on project jap: Could not resolve dependencies for project anon:jap:jar:00.20.010-SNAPSHOT: Could not find artifact anon:guilib:jar:00.00.231-20190201.160523-2 in anon.inf.tu-dresden.de-snapshots (https://anon.inf.tu-dresden.de/artifactory/repo/) -> [Help 1]
[ERROR] 
[ERROR] To see the full stack trace of the errors, re-run Maven with the -e switch.