Console Output

Established TCP socket on 44107
<===[JENKINS REMOTING CAPACITY]===>channel started
Executing Maven:  -B -f /var/lib/jenkins/jobs/JAP-dev-daily-snapshot/workspace/pom.xml -Dmaven.repo.local=/var/lib/jenkins/maven-repositories/1 deploy -Panon-cc-dev,anon-cc-daily-snapshot
[INFO] Scanning for projects...
[INFO]                                                                         
[INFO] ------------------------------------------------------------------------
[INFO] Building jap 00.20.012-SNAPSHOT
[INFO] ------------------------------------------------------------------------
[INFO] Downloading: http://svn.jondos.de/maven/repos/anon/guilib/00.00.237-SNAPSHOT/maven-metadata.xml
[INFO] Downloading: https://anon.inf.tu-dresden.de/artifactory/repo/anon/guilib/00.00.237-SNAPSHOT/maven-metadata.xml
[WARNING] Could not transfer metadata anon:guilib:00.00.237-SNAPSHOT/maven-metadata.xml from/to anon.inf.tu-dresden.de-snapshots (https://anon.inf.tu-dresden.de/artifactory/repo/): Failed to transfer file: https://anon.inf.tu-dresden.de/artifactory/repo/anon/guilib/00.00.237-SNAPSHOT/maven-metadata.xml. Return code is: 503 , ReasonPhrase:Service Unavailable.
[WARNING] Failure to transfer anon:guilib:00.00.237-SNAPSHOT/maven-metadata.xml from https://anon.inf.tu-dresden.de/artifactory/repo/ was cached in the local repository, resolution will not be reattempted until the update interval of anon.inf.tu-dresden.de-snapshots has elapsed or updates are forced. Original error: Could not transfer metadata anon:guilib:00.00.237-SNAPSHOT/maven-metadata.xml from/to anon.inf.tu-dresden.de-snapshots (https://anon.inf.tu-dresden.de/artifactory/repo/): Failed to transfer file: https://anon.inf.tu-dresden.de/artifactory/repo/anon/guilib/00.00.237-SNAPSHOT/maven-metadata.xml. Return code is: 503 , ReasonPhrase:Service Unavailable.
[INFO] Downloading: https://anon.inf.tu-dresden.de/artifactory/repo/anon/anonlib/00.21.023-SNAPSHOT/maven-metadata.xml
[INFO] Downloading: https://anon.inf.tu-dresden.de/artifactory/repo/anon/anonlib/00.21.023-SNAPSHOT/maven-metadata.xml
[INFO] Downloading: http://svn.jondos.de/maven/repos/anon/anonlib/00.21.023-SNAPSHOT/maven-metadata.xml
[WARNING] Could not transfer metadata anon:anonlib:00.21.023-SNAPSHOT/maven-metadata.xml from/to anon.inf.tu-dresden.de-snapshots (https://anon.inf.tu-dresden.de/artifactory/repo/): Failed to transfer file: https://anon.inf.tu-dresden.de/artifactory/repo/anon/anonlib/00.21.023-SNAPSHOT/maven-metadata.xml. Return code is: 503 , ReasonPhrase:Service Unavailable.
[WARNING] Could not transfer metadata anon:anonlib:00.21.023-SNAPSHOT/maven-metadata.xml from/to anon.inf.tu-dresden.de (https://anon.inf.tu-dresden.de/artifactory/repo): Failed to transfer file: https://anon.inf.tu-dresden.de/artifactory/repo/anon/anonlib/00.21.023-SNAPSHOT/maven-metadata.xml. Return code is: 503 , ReasonPhrase:Service Unavailable.
[WARNING] Failure to transfer anon:anonlib:00.21.023-SNAPSHOT/maven-metadata.xml from https://anon.inf.tu-dresden.de/artifactory/repo/ was cached in the local repository, resolution will not be reattempted until the update interval of anon.inf.tu-dresden.de-snapshots has elapsed or updates are forced. Original error: Could not transfer metadata anon:anonlib:00.21.023-SNAPSHOT/maven-metadata.xml from/to anon.inf.tu-dresden.de-snapshots (https://anon.inf.tu-dresden.de/artifactory/repo/): Failed to transfer file: https://anon.inf.tu-dresden.de/artifactory/repo/anon/anonlib/00.21.023-SNAPSHOT/maven-metadata.xml. Return code is: 503 , ReasonPhrase:Service Unavailable.
[WARNING] Failure to transfer anon:anonlib:00.21.023-SNAPSHOT/maven-metadata.xml from https://anon.inf.tu-dresden.de/artifactory/repo was cached in the local repository, resolution will not be reattempted until the update interval of anon.inf.tu-dresden.de has elapsed or updates are forced. Original error: Could not transfer metadata anon:anonlib:00.21.023-SNAPSHOT/maven-metadata.xml from/to anon.inf.tu-dresden.de (https://anon.inf.tu-dresden.de/artifactory/repo): Failed to transfer file: https://anon.inf.tu-dresden.de/artifactory/repo/anon/anonlib/00.21.023-SNAPSHOT/maven-metadata.xml. Return code is: 503 , ReasonPhrase:Service Unavailable.
[INFO] Downloading: https://anon.inf.tu-dresden.de/artifactory/repo/anon/BouncyCastleLightForAN.ON/01.65.002-SNAPSHOT/maven-metadata.xml
[INFO] Downloading: http://svn.jondos.de/maven/repos/anon/BouncyCastleLightForAN.ON/01.65.002-SNAPSHOT/maven-metadata.xml
[WARNING] Could not transfer metadata anon:BouncyCastleLightForAN.ON:01.65.002-SNAPSHOT/maven-metadata.xml from/to anon.inf.tu-dresden.de-snapshots (https://anon.inf.tu-dresden.de/artifactory/repo/): Failed to transfer file: https://anon.inf.tu-dresden.de/artifactory/repo/anon/BouncyCastleLightForAN.ON/01.65.002-SNAPSHOT/maven-metadata.xml. Return code is: 503 , ReasonPhrase:Service Unavailable.
[WARNING] Failure to transfer anon:BouncyCastleLightForAN.ON:01.65.002-SNAPSHOT/maven-metadata.xml from https://anon.inf.tu-dresden.de/artifactory/repo/ was cached in the local repository, resolution will not be reattempted until the update interval of anon.inf.tu-dresden.de-snapshots has elapsed or updates are forced. Original error: Could not transfer metadata anon:BouncyCastleLightForAN.ON:01.65.002-SNAPSHOT/maven-metadata.xml from/to anon.inf.tu-dresden.de-snapshots (https://anon.inf.tu-dresden.de/artifactory/repo/): Failed to transfer file: https://anon.inf.tu-dresden.de/artifactory/repo/anon/BouncyCastleLightForAN.ON/01.65.002-SNAPSHOT/maven-metadata.xml. Return code is: 503 , ReasonPhrase:Service Unavailable.
[INFO] Downloading: https://anon.inf.tu-dresden.de/artifactory/repo/anon/HTTPClient/00.04.014-SNAPSHOT/maven-metadata.xml
[INFO] Downloading: http://svn.jondos.de/maven/repos/anon/HTTPClient/00.04.014-SNAPSHOT/maven-metadata.xml
[WARNING] Could not transfer metadata anon:HTTPClient:00.04.014-SNAPSHOT/maven-metadata.xml from/to anon.inf.tu-dresden.de-snapshots (https://anon.inf.tu-dresden.de/artifactory/repo/): Failed to transfer file: https://anon.inf.tu-dresden.de/artifactory/repo/anon/HTTPClient/00.04.014-SNAPSHOT/maven-metadata.xml. Return code is: 503 , ReasonPhrase:Service Unavailable.
[WARNING] Failure to transfer anon:HTTPClient:00.04.014-SNAPSHOT/maven-metadata.xml from https://anon.inf.tu-dresden.de/artifactory/repo/ was cached in the local repository, resolution will not be reattempted until the update interval of anon.inf.tu-dresden.de-snapshots has elapsed or updates are forced. Original error: Could not transfer metadata anon:HTTPClient:00.04.014-SNAPSHOT/maven-metadata.xml from/to anon.inf.tu-dresden.de-snapshots (https://anon.inf.tu-dresden.de/artifactory/repo/): Failed to transfer file: https://anon.inf.tu-dresden.de/artifactory/repo/anon/HTTPClient/00.04.014-SNAPSHOT/maven-metadata.xml. Return code is: 503 , ReasonPhrase:Service Unavailable.
[INFO] Downloading: https://anon.inf.tu-dresden.de/artifactory/repo/anon/SkypeForANON/0.0.13-SNAPSHOT/maven-metadata.xml
[INFO] Downloading: http://svn.jondos.de/maven/repos/anon/SkypeForANON/0.0.13-SNAPSHOT/maven-metadata.xml
[WARNING] Could not transfer metadata anon:SkypeForANON:0.0.13-SNAPSHOT/maven-metadata.xml from/to anon.inf.tu-dresden.de-snapshots (https://anon.inf.tu-dresden.de/artifactory/repo/): Failed to transfer file: https://anon.inf.tu-dresden.de/artifactory/repo/anon/SkypeForANON/0.0.13-SNAPSHOT/maven-metadata.xml. Return code is: 503 , ReasonPhrase:Service Unavailable.
[WARNING] Failure to transfer anon:SkypeForANON:0.0.13-SNAPSHOT/maven-metadata.xml from https://anon.inf.tu-dresden.de/artifactory/repo/ was cached in the local repository, resolution will not be reattempted until the update interval of anon.inf.tu-dresden.de-snapshots has elapsed or updates are forced. Original error: Could not transfer metadata anon:SkypeForANON:0.0.13-SNAPSHOT/maven-metadata.xml from/to anon.inf.tu-dresden.de-snapshots (https://anon.inf.tu-dresden.de/artifactory/repo/): Failed to transfer file: https://anon.inf.tu-dresden.de/artifactory/repo/anon/SkypeForANON/0.0.13-SNAPSHOT/maven-metadata.xml. Return code is: 503 , ReasonPhrase:Service Unavailable.
[INFO] Downloading: https://anon.inf.tu-dresden.de/artifactory/repo/anon/ApacheFTPClient/0.0.2-SNAPSHOT/maven-metadata.xml
[INFO] Downloading: http://svn.jondos.de/maven/repos/anon/ApacheFTPClient/0.0.2-SNAPSHOT/maven-metadata.xml
[WARNING] Could not transfer metadata anon:ApacheFTPClient:0.0.2-SNAPSHOT/maven-metadata.xml from/to anon.inf.tu-dresden.de-snapshots (https://anon.inf.tu-dresden.de/artifactory/repo/): Failed to transfer file: https://anon.inf.tu-dresden.de/artifactory/repo/anon/ApacheFTPClient/0.0.2-SNAPSHOT/maven-metadata.xml. Return code is: 503 , ReasonPhrase:Service Unavailable.
[WARNING] Failure to transfer anon:ApacheFTPClient:0.0.2-SNAPSHOT/maven-metadata.xml from https://anon.inf.tu-dresden.de/artifactory/repo/ was cached in the local repository, resolution will not be reattempted until the update interval of anon.inf.tu-dresden.de-snapshots has elapsed or updates are forced. Original error: Could not transfer metadata anon:ApacheFTPClient:0.0.2-SNAPSHOT/maven-metadata.xml from/to anon.inf.tu-dresden.de-snapshots (https://anon.inf.tu-dresden.de/artifactory/repo/): Failed to transfer file: https://anon.inf.tu-dresden.de/artifactory/repo/anon/ApacheFTPClient/0.0.2-SNAPSHOT/maven-metadata.xml. Return code is: 503 , ReasonPhrase:Service Unavailable.
[INFO] Downloading: https://anon.inf.tu-dresden.de/artifactory/repo/anon/logging/0.1.9-SNAPSHOT/maven-metadata.xml
[INFO] Downloading: http://svn.jondos.de/maven/repos/anon/logging/0.1.9-SNAPSHOT/maven-metadata.xml
[WARNING] Could not transfer metadata anon:logging:0.1.9-SNAPSHOT/maven-metadata.xml from/to anon.inf.tu-dresden.de-snapshots (https://anon.inf.tu-dresden.de/artifactory/repo/): Failed to transfer file: https://anon.inf.tu-dresden.de/artifactory/repo/anon/logging/0.1.9-SNAPSHOT/maven-metadata.xml. Return code is: 503 , ReasonPhrase:Service Unavailable.
[WARNING] Failure to transfer anon:logging:0.1.9-SNAPSHOT/maven-metadata.xml from https://anon.inf.tu-dresden.de/artifactory/repo/ was cached in the local repository, resolution will not be reattempted until the update interval of anon.inf.tu-dresden.de-snapshots has elapsed or updates are forced. Original error: Could not transfer metadata anon:logging:0.1.9-SNAPSHOT/maven-metadata.xml from/to anon.inf.tu-dresden.de-snapshots (https://anon.inf.tu-dresden.de/artifactory/repo/): Failed to transfer file: https://anon.inf.tu-dresden.de/artifactory/repo/anon/logging/0.1.9-SNAPSHOT/maven-metadata.xml. Return code is: 503 , ReasonPhrase:Service Unavailable.
[INFO] Downloading: https://anon.inf.tu-dresden.de/artifactory/repo/anon/log4jForANON/0.0.4-SNAPSHOT/maven-metadata.xml
[INFO] Downloading: http://svn.jondos.de/maven/repos/anon/log4jForANON/0.0.4-SNAPSHOT/maven-metadata.xml
[WARNING] Could not transfer metadata anon:log4jForANON:0.0.4-SNAPSHOT/maven-metadata.xml from/to anon.inf.tu-dresden.de-snapshots (https://anon.inf.tu-dresden.de/artifactory/repo/): Failed to transfer file: https://anon.inf.tu-dresden.de/artifactory/repo/anon/log4jForANON/0.0.4-SNAPSHOT/maven-metadata.xml. Return code is: 503 , ReasonPhrase:Service Unavailable.
[WARNING] Failure to transfer anon:log4jForANON:0.0.4-SNAPSHOT/maven-metadata.xml from https://anon.inf.tu-dresden.de/artifactory/repo/ was cached in the local repository, resolution will not be reattempted until the update interval of anon.inf.tu-dresden.de-snapshots has elapsed or updates are forced. Original error: Could not transfer metadata anon:log4jForANON:0.0.4-SNAPSHOT/maven-metadata.xml from/to anon.inf.tu-dresden.de-snapshots (https://anon.inf.tu-dresden.de/artifactory/repo/): Failed to transfer file: https://anon.inf.tu-dresden.de/artifactory/repo/anon/log4jForANON/0.0.4-SNAPSHOT/maven-metadata.xml. Return code is: 503 , ReasonPhrase:Service Unavailable.
[INFO] 
[INFO] --- maven-resources-plugin:2.6:resources (default-resources) @ jap ---
[WARNING] Using platform encoding (UTF-8 actually) to copy filtered resources, i.e. build is platform dependent!
[INFO] Copying 1465 resources
[INFO] 
[INFO] --- maven-compiler-plugin:3.6.2:compile (default-compile) @ jap ---
[INFO] Changes detected - recompiling the module!
[WARNING] File encoding has not been set, using platform encoding UTF-8, i.e. build is platform dependent!
[INFO] Compiling 118 source files to /var/lib/jenkins/jobs/JAP-dev-daily-snapshot/workspace/target/classes
[INFO] 
[INFO] --- maven-resources-plugin:2.6:testResources (default-testResources) @ jap ---
[WARNING] Using platform encoding (UTF-8 actually) to copy filtered resources, i.e. build is platform dependent!
[INFO] skip non existing resourceDirectory /var/lib/jenkins/jobs/JAP-dev-daily-snapshot/workspace/src/test/resources
[INFO] 
[INFO] --- maven-compiler-plugin:3.6.2:testCompile (default-testCompile) @ jap ---
[INFO] Nothing to compile - all classes are up to date
[INFO] 
[INFO] --- maven-surefire-plugin:2.12.4:test (default-test) @ jap ---
[INFO] No tests to run.
[JENKINS] Zeichne Testergebnisse auf
[INFO] 
[INFO] --- maven-jar-plugin:2.4:jar (default-jar) @ jap ---
[INFO] Building jar: /var/lib/jenkins/jobs/JAP-dev-daily-snapshot/workspace/target/jap-00.20.012-SNAPSHOT.jar
[INFO] 
[INFO] --- maven-assembly-plugin:3.0.0:single (create-executable-jar) @ jap ---
[INFO] Building jar: /var/lib/jenkins/jobs/JAP-dev-daily-snapshot/workspace/target/jap-00.20.012-SNAPSHOT-jar-with-dependencies.jar
[INFO] 
[INFO] --- maven-jarsigner-plugin:1.4:sign (sign-executable-jar) @ jap ---
[INFO] 1 Archiv(e) verarbeitet
[INFO] 
[INFO] --- maven-install-plugin:2.4:install (default-install) @ jap ---
[INFO] Installing /var/lib/jenkins/jobs/JAP-dev-daily-snapshot/workspace/target/jap-00.20.012-SNAPSHOT.jar to /var/lib/jenkins/maven-repositories/1/anon/jap/00.20.012-SNAPSHOT/jap-00.20.012-SNAPSHOT.jar
[INFO] Installing /var/lib/jenkins/jobs/JAP-dev-daily-snapshot/workspace/pom.xml to /var/lib/jenkins/maven-repositories/1/anon/jap/00.20.012-SNAPSHOT/jap-00.20.012-SNAPSHOT.pom
[INFO] Installing /var/lib/jenkins/jobs/JAP-dev-daily-snapshot/workspace/target/jap-00.20.012-SNAPSHOT-jar-with-dependencies.jar to /var/lib/jenkins/maven-repositories/1/anon/jap/00.20.012-SNAPSHOT/jap-00.20.012-SNAPSHOT-jar-with-dependencies.jar
[INFO] 
[INFO] --- maven-deploy-plugin:2.7:deploy (default-deploy) @ jap ---
[INFO] Downloading: https://anon.inf.tu-dresden.de:443/artifactory/artifacts-dev/anon/jap/00.20.012-SNAPSHOT/maven-metadata.xml
[WARNING] Could not transfer metadata anon:jap:00.20.012-SNAPSHOT/maven-metadata.xml from/to anon.inf.tu-dresden.de-snapshots (https://anon.inf.tu-dresden.de:443/artifactory/artifacts-dev): Failed to transfer file: https://anon.inf.tu-dresden.de:443/artifactory/artifacts-dev/anon/jap/00.20.012-SNAPSHOT/maven-metadata.xml. Return code is: 503 , ReasonPhrase:Service Unavailable.
[INFO] ------------------------------------------------------------------------
[INFO] BUILD FAILURE
[INFO] ------------------------------------------------------------------------
[INFO] Total time: 46.500 s
[INFO] Finished at: 2021-12-12T00:11:11+01:00
[INFO] Final Memory: 30M/389M
[INFO] ------------------------------------------------------------------------
[ERROR] Failed to execute goal org.apache.maven.plugins:maven-deploy-plugin:2.7:deploy (default-deploy) on project jap: Failed to retrieve remote metadata anon:jap:00.20.012-SNAPSHOT/maven-metadata.xml: Could not transfer metadata anon:jap:00.20.012-SNAPSHOT/maven-metadata.xml from/to anon.inf.tu-dresden.de-snapshots (https://anon.inf.tu-dresden.de:443/artifactory/artifacts-dev): Failed to transfer file: https://anon.inf.tu-dresden.de:443/artifactory/artifacts-dev/anon/jap/00.20.012-SNAPSHOT/maven-metadata.xml. Return code is: 503 , ReasonPhrase:Service Unavailable. -> [Help 1]
[ERROR] 
[ERROR] To see the full stack trace of the errors, re-run Maven with the -e switch.
[ERROR] Re-run Maven using the -X switch to enable full debug logging.
[ERROR] 
[ERROR] For more information about the errors and possible solutions, please read the following articles:
[ERROR] [Help 1] http://cwiki.apache.org/confluence/display/MAVEN/MojoExecutionException