Console Output

<===[JENKINS REMOTING CAPACITY]===>channel started
Executing Maven:  -B -f /var/lib/jenkins/jobs/InfoService-daily-dev-snapshot/workspace/pom.xml -Dmaven.repo.local=/var/lib/jenkins/maven-repositories/0 deploy -Panon-cc-dev,anon-cc-daily-snapshot
[INFO] Scanning for projects...
[INFO]                                                                         
[INFO] ------------------------------------------------------------------------
[INFO] Building InfoService 00.09.005-SNAPSHOT
[INFO] ------------------------------------------------------------------------
Downloading: http://anon.inf.tu-dresden.de/artifactory/repo/anon/anonlib/00.19.003-SNAPSHOT/maven-metadata.xml
Downloaded: http://anon.inf.tu-dresden.de/artifactory/repo/anon/anonlib/00.19.003-SNAPSHOT/maven-metadata.xml (306 B at 1.3 KB/sec)
Downloading: http://anon.inf.tu-dresden.de/artifactory/repo/anon/BouncyCastleLightForAN.ON/01.50.001-SNAPSHOT/maven-metadata.xml
Downloading: http://svn.jondos.de/maven/repos/anon/BouncyCastleLightForAN.ON/01.50.001-SNAPSHOT/maven-metadata.xml
Downloaded: http://anon.inf.tu-dresden.de/artifactory/repo/anon/BouncyCastleLightForAN.ON/01.50.001-SNAPSHOT/maven-metadata.xml (324 B at 13.2 KB/sec)
[WARNING] Could not transfer metadata anon:BouncyCastleLightForAN.ON:01.50.001-SNAPSHOT/maven-metadata.xml from/to jondos.repos.http (http://svn.jondos.de/maven/repos): Connection to http://svn.jondos.de refused
[WARNING] Failure to transfer anon:BouncyCastleLightForAN.ON:01.50.001-SNAPSHOT/maven-metadata.xml from http://svn.jondos.de/maven/repos was cached in the local repository, resolution will not be reattempted until the update interval of jondos.repos.http has elapsed or updates are forced. Original error: Could not transfer metadata anon:BouncyCastleLightForAN.ON:01.50.001-SNAPSHOT/maven-metadata.xml from/to jondos.repos.http (http://svn.jondos.de/maven/repos): Connection to http://svn.jondos.de refused
Downloading: http://svn.jondos.de/maven/repos/anon/HTTPClient/00.04.010-SNAPSHOT/maven-metadata.xml
Downloading: http://anon.inf.tu-dresden.de/artifactory/repo/anon/HTTPClient/00.04.010-SNAPSHOT/maven-metadata.xml
Downloaded: http://anon.inf.tu-dresden.de/artifactory/repo/anon/HTTPClient/00.04.010-SNAPSHOT/maven-metadata.xml (309 B at 2.4 KB/sec)
[WARNING] Could not transfer metadata anon:HTTPClient:00.04.010-SNAPSHOT/maven-metadata.xml from/to jondos.repos.http (http://svn.jondos.de/maven/repos): svn.jondos.de: Der Name oder der Dienst ist nicht bekannt
[WARNING] Failure to transfer anon:HTTPClient:00.04.010-SNAPSHOT/maven-metadata.xml from http://svn.jondos.de/maven/repos was cached in the local repository, resolution will not be reattempted until the update interval of jondos.repos.http has elapsed or updates are forced. Original error: Could not transfer metadata anon:HTTPClient:00.04.010-SNAPSHOT/maven-metadata.xml from/to jondos.repos.http (http://svn.jondos.de/maven/repos): svn.jondos.de: Der Name oder der Dienst ist nicht bekannt
Downloading: http://anon.inf.tu-dresden.de/artifactory/repo/anon/SkypeForANON/0.0.13-SNAPSHOT/maven-metadata.xml
Downloading: http://svn.jondos.de/maven/repos/anon/SkypeForANON/0.0.13-SNAPSHOT/maven-metadata.xml
Downloaded: http://anon.inf.tu-dresden.de/artifactory/repo/anon/SkypeForANON/0.0.13-SNAPSHOT/maven-metadata.xml (308 B at 18.8 KB/sec)
[WARNING] Could not transfer metadata anon:SkypeForANON:0.0.13-SNAPSHOT/maven-metadata.xml from/to jondos.repos.http (http://svn.jondos.de/maven/repos): svn.jondos.de
[WARNING] Failure to transfer anon:SkypeForANON:0.0.13-SNAPSHOT/maven-metadata.xml from http://svn.jondos.de/maven/repos was cached in the local repository, resolution will not be reattempted until the update interval of jondos.repos.http has elapsed or updates are forced. Original error: Could not transfer metadata anon:SkypeForANON:0.0.13-SNAPSHOT/maven-metadata.xml from/to jondos.repos.http (http://svn.jondos.de/maven/repos): svn.jondos.de
Downloading: http://anon.inf.tu-dresden.de/artifactory/repo/anon/ApacheFTPClient/0.0.2-SNAPSHOT/maven-metadata.xml
Downloading: http://svn.jondos.de/maven/repos/anon/ApacheFTPClient/0.0.2-SNAPSHOT/maven-metadata.xml
Downloaded: http://anon.inf.tu-dresden.de/artifactory/repo/anon/ApacheFTPClient/0.0.2-SNAPSHOT/maven-metadata.xml (310 B at 21.6 KB/sec)
[WARNING] Could not transfer metadata anon:ApacheFTPClient:0.0.2-SNAPSHOT/maven-metadata.xml from/to jondos.repos.http (http://svn.jondos.de/maven/repos): svn.jondos.de
[WARNING] Failure to transfer anon:ApacheFTPClient:0.0.2-SNAPSHOT/maven-metadata.xml from http://svn.jondos.de/maven/repos was cached in the local repository, resolution will not be reattempted until the update interval of jondos.repos.http has elapsed or updates are forced. Original error: Could not transfer metadata anon:ApacheFTPClient:0.0.2-SNAPSHOT/maven-metadata.xml from/to jondos.repos.http (http://svn.jondos.de/maven/repos): svn.jondos.de
Downloading: http://anon.inf.tu-dresden.de/artifactory/repo/anon/logging/0.1.9-SNAPSHOT/maven-metadata.xml
Downloading: http://svn.jondos.de/maven/repos/anon/logging/0.1.9-SNAPSHOT/maven-metadata.xml
Downloaded: http://anon.inf.tu-dresden.de/artifactory/repo/anon/logging/0.1.9-SNAPSHOT/maven-metadata.xml (302 B at 19.7 KB/sec)
[WARNING] Could not transfer metadata anon:logging:0.1.9-SNAPSHOT/maven-metadata.xml from/to jondos.repos.http (http://svn.jondos.de/maven/repos): svn.jondos.de
[WARNING] Failure to transfer anon:logging:0.1.9-SNAPSHOT/maven-metadata.xml from http://svn.jondos.de/maven/repos was cached in the local repository, resolution will not be reattempted until the update interval of jondos.repos.http has elapsed or updates are forced. Original error: Could not transfer metadata anon:logging:0.1.9-SNAPSHOT/maven-metadata.xml from/to jondos.repos.http (http://svn.jondos.de/maven/repos): svn.jondos.de
Downloading: http://svn.jondos.de/maven/repos/anon/log4jForANON/0.0.4-SNAPSHOT/maven-metadata.xml
Downloading: http://anon.inf.tu-dresden.de/artifactory/repo/anon/log4jForANON/0.0.4-SNAPSHOT/maven-metadata.xml
Downloaded: http://anon.inf.tu-dresden.de/artifactory/repo/anon/log4jForANON/0.0.4-SNAPSHOT/maven-metadata.xml (307 B at 2.7 KB/sec)
[WARNING] Could not transfer metadata anon:log4jForANON:0.0.4-SNAPSHOT/maven-metadata.xml from/to jondos.repos.http (http://svn.jondos.de/maven/repos): svn.jondos.de
[WARNING] Failure to transfer anon:log4jForANON:0.0.4-SNAPSHOT/maven-metadata.xml from http://svn.jondos.de/maven/repos was cached in the local repository, resolution will not be reattempted until the update interval of jondos.repos.http has elapsed or updates are forced. Original error: Could not transfer metadata anon:log4jForANON:0.0.4-SNAPSHOT/maven-metadata.xml from/to jondos.repos.http (http://svn.jondos.de/maven/repos): svn.jondos.de
[INFO] 
[INFO] --- maven-resources-plugin:2.5:resources (default-resources) @ InfoService ---
[debug] execute contextualize
[WARNING] Using platform encoding (UTF-8 actually) to copy filtered resources, i.e. build is platform dependent!
[INFO] Copying 12 resources
[INFO] 
[INFO] --- maven-compiler-plugin:3.1:compile (default-compile) @ InfoService ---
[INFO] Changes detected - recompiling the module!
[WARNING] File encoding has not been set, using platform encoding UTF-8, i.e. build is platform dependent!
[INFO] Compiling 126 source files to /var/lib/jenkins/jobs/InfoService-daily-dev-snapshot/workspace/target/classes
[WARNING] /var/lib/jenkins/jobs/InfoService-daily-dev-snapshot/workspace/src/main/java/infoservice/performance/PerformanceMeter.java: Some input files use or override a deprecated API.
[WARNING] /var/lib/jenkins/jobs/InfoService-daily-dev-snapshot/workspace/src/main/java/infoservice/performance/PerformanceMeter.java: Recompile with -Xlint:deprecation for details.
[WARNING] /var/lib/jenkins/jobs/InfoService-daily-dev-snapshot/workspace/src/main/java/infoservice/performance/PerformanceMeter.java: Some input files use unchecked or unsafe operations.
[WARNING] /var/lib/jenkins/jobs/InfoService-daily-dev-snapshot/workspace/src/main/java/infoservice/performance/PerformanceMeter.java: Recompile with -Xlint:unchecked for details.
[INFO] 
[INFO] --- maven-resources-plugin:2.5:testResources (default-testResources) @ InfoService ---
[debug] execute contextualize
[WARNING] Using platform encoding (UTF-8 actually) to copy filtered resources, i.e. build is platform dependent!
[INFO] skip non existing resourceDirectory /var/lib/jenkins/jobs/InfoService-daily-dev-snapshot/workspace/src/test/resources
[INFO] 
[INFO] --- maven-compiler-plugin:3.1:testCompile (default-testCompile) @ InfoService ---
[INFO] Changes detected - recompiling the module!
[WARNING] File encoding has not been set, using platform encoding UTF-8, i.e. build is platform dependent!
[INFO] Compiling 9 source files to /var/lib/jenkins/jobs/InfoService-daily-dev-snapshot/workspace/target/test-classes
[INFO] 
[INFO] --- maven-surefire-plugin:2.12:test (default-test) @ InfoService ---
[INFO] Tests are skipped.
[INFO] 
[INFO] --- maven-jar-plugin:2.3.2:jar (default-jar) @ InfoService ---
[INFO] Building jar: /var/lib/jenkins/jobs/InfoService-daily-dev-snapshot/workspace/target/InfoService-00.09.005-SNAPSHOT.jar
[INFO] 
[INFO] --- maven-assembly-plugin:2.4:single (create-executable-jar) @ InfoService ---
[INFO] Building jar: /var/lib/jenkins/jobs/InfoService-daily-dev-snapshot/workspace/target/InfoService-00.09.005-SNAPSHOT-jar-with-dependencies.jar
[INFO] 
[INFO] --- maven-jarsigner-plugin:1.2:sign (sign-executable-jar) @ InfoService ---
[INFO] 1 Archiv(e) verarbeitet
[INFO] 
[INFO] --- maven-install-plugin:2.3.1:install (default-install) @ InfoService ---
[INFO] Installing /var/lib/jenkins/jobs/InfoService-daily-dev-snapshot/workspace/target/InfoService-00.09.005-SNAPSHOT.jar to /var/lib/jenkins/maven-repositories/0/anon/InfoService/00.09.005-SNAPSHOT/InfoService-00.09.005-SNAPSHOT.jar
[INFO] Installing /var/lib/jenkins/jobs/InfoService-daily-dev-snapshot/workspace/pom.xml to /var/lib/jenkins/maven-repositories/0/anon/InfoService/00.09.005-SNAPSHOT/InfoService-00.09.005-SNAPSHOT.pom
[INFO] Installing /var/lib/jenkins/jobs/InfoService-daily-dev-snapshot/workspace/target/InfoService-00.09.005-SNAPSHOT-jar-with-dependencies.jar to /var/lib/jenkins/maven-repositories/0/anon/InfoService/00.09.005-SNAPSHOT/InfoService-00.09.005-SNAPSHOT-jar-with-dependencies.jar
[INFO] 
[INFO] --- maven-deploy-plugin:2.7:deploy (default-deploy) @ InfoService ---
Downloading: https://anon.inf.tu-dresden.de:443/artifactory/artifacts-dev/anon/InfoService/00.09.005-SNAPSHOT/maven-metadata.xml
Downloaded: https://anon.inf.tu-dresden.de:443/artifactory/artifacts-dev/anon/InfoService/00.09.005-SNAPSHOT/maven-metadata.xml (310 B at 1.1 KB/sec)
Uploading: https://anon.inf.tu-dresden.de:443/artifactory/artifacts-dev/anon/InfoService/00.09.005-SNAPSHOT/InfoService-00.09.005-20151209.230823-2.jar
Uploaded: https://anon.inf.tu-dresden.de:443/artifactory/artifacts-dev/anon/InfoService/00.09.005-SNAPSHOT/InfoService-00.09.005-20151209.230823-2.jar (303 KB at 1255.9 KB/sec)
Uploading: https://anon.inf.tu-dresden.de:443/artifactory/artifacts-dev/anon/InfoService/00.09.005-SNAPSHOT/InfoService-00.09.005-20151209.230823-2.pom
Uploaded: https://anon.inf.tu-dresden.de:443/artifactory/artifacts-dev/anon/InfoService/00.09.005-SNAPSHOT/InfoService-00.09.005-20151209.230823-2.pom (7 KB at 36.8 KB/sec)
Downloading: https://anon.inf.tu-dresden.de:443/artifactory/artifacts-dev/anon/InfoService/maven-metadata.xml
[WARNING] Checksum validation failed, expected edc1e3c5c537d3e323937cbf336773db65e1b295 but is ae17489e4ce24deada60f7cc8143bc2b138e3abf for https://anon.inf.tu-dresden.de:443/artifactory/artifacts-dev/anon/InfoService/maven-metadata.xml
Downloaded: https://anon.inf.tu-dresden.de:443/artifactory/artifacts-dev/anon/InfoService/maven-metadata.xml (3 KB at 64.1 KB/sec)
Uploading: https://anon.inf.tu-dresden.de:443/artifactory/artifacts-dev/anon/InfoService/00.09.005-SNAPSHOT/maven-metadata.xml
Uploaded: https://anon.inf.tu-dresden.de:443/artifactory/artifacts-dev/anon/InfoService/00.09.005-SNAPSHOT/maven-metadata.xml (777 B at 36.1 KB/sec)
Uploading: https://anon.inf.tu-dresden.de:443/artifactory/artifacts-dev/anon/InfoService/maven-metadata.xml
Uploaded: https://anon.inf.tu-dresden.de:443/artifactory/artifacts-dev/anon/InfoService/maven-metadata.xml (3 KB at 90.6 KB/sec)
Uploading: https://anon.inf.tu-dresden.de:443/artifactory/artifacts-dev/anon/InfoService/00.09.005-SNAPSHOT/InfoService-00.09.005-20151209.230823-2-jar-with-dependencies.jar
Uploaded: https://anon.inf.tu-dresden.de:443/artifactory/artifacts-dev/anon/InfoService/00.09.005-SNAPSHOT/InfoService-00.09.005-20151209.230823-2-jar-with-dependencies.jar (4380 KB at 11523.9 KB/sec)
Uploading: https://anon.inf.tu-dresden.de:443/artifactory/artifacts-dev/anon/InfoService/00.09.005-SNAPSHOT/maven-metadata.xml
Uploaded: https://anon.inf.tu-dresden.de:443/artifactory/artifacts-dev/anon/InfoService/00.09.005-SNAPSHOT/maven-metadata.xml (1009 B at 46.9 KB/sec)
[INFO] 
[INFO] --- maven-antrun-plugin:1.7:run (default) @ InfoService ---
[INFO] Executing tasks

main:

getCurrentVersionInformation:
     [echo] Current Version: IS.09.004

deploy_to_anon:
     [copy] Copying 1 file to /var/www/JapWeb/develop

deploy_to_sourceforge:
     [exec] ssh: Could not resolve hostname frs.sourceforge.net: Name or service not known
     [exec] rsync: connection unexpectedly closed (0 bytes received so far) [sender]
     [exec] rsync error: unexplained error (code 255) at io.c(226) [sender=3.1.1]
[INFO] ------------------------------------------------------------------------
[INFO] BUILD FAILURE
[INFO] ------------------------------------------------------------------------
[INFO] Total time: 3:32.369s
[INFO] Finished at: Thu Dec 10 00:08:51 CET 2015
[INFO] Final Memory: 26M/199M
[INFO] ------------------------------------------------------------------------
Warte bis Jenkins die Datensammlung abgeschlossen hat
[ERROR] Failed to execute goal org.apache.maven.plugins:maven-antrun-plugin:1.7:run (default) on project InfoService: An Ant BuildException has occured: The following error occurred while executing this line:
[ERROR] /var/lib/jenkins/jobs/InfoService-daily-dev-snapshot/workspace/ant_build_maven_anon_cc_daily_snapshot.xml:50: exec returned: 255
[ERROR] around Ant part ...<ant antfile="/var/lib/jenkins/jobs/InfoService-daily-dev-snapshot/workspace/ant_build_maven_anon_cc_daily_snapshot.xml">... @ 7:124 in /var/lib/jenkins/jobs/InfoService-daily-dev-snapshot/workspace/target/antrun/build-main.xml
[ERROR] -> [Help 1]
[ERROR] 
[ERROR] To see the full stack trace of the errors, re-run Maven with the -e switch.
[ERROR] Re-run Maven using the -X switch to enable full debug logging.
[ERROR] 
[ERROR] For more information about the errors and possible solutions, please read the following articles:
[ERROR] [Help 1] http://cwiki.apache.org/confluence/display/MAVEN/MojoExecutionException