Console Output

Established TCP socket on 46689
<===[JENKINS REMOTING CAPACITY]===>channel started
Established TCP socket on 51868
<===[JENKINS REMOTING CAPACITY]===>channel started
Executing Maven:  -B -f /var/lib/jenkins/jobs/InfoService-daily-dev-snapshot/workspace/pom.xml -Dmaven.repo.local=/var/lib/jenkins/maven-repositories/1 deploy -Panon-cc-dev,anon-cc-daily-snapshot
[INFO] Scanning for projects...
[INFO]                                                                         
[INFO] ------------------------------------------------------------------------
[INFO] Building InfoService 00.09.009-SNAPSHOT
[INFO] ------------------------------------------------------------------------
[INFO] Downloading: http://anon.inf.tu-dresden.de/artifactory/repo/anon/anonlib/00.20.012-SNAPSHOT/maven-metadata.xml
[INFO] Downloading: http://anon.inf.tu-dresden.de/artifactory/repo/anon/anonlib/00.20.012-SNAPSHOT/anonlib-00.20.012-SNAPSHOT.pom
[WARNING] The POM for anon:anonlib:jar:00.20.012-SNAPSHOT is missing, no dependency information available
[INFO] Downloading: http://anon.inf.tu-dresden.de/artifactory/repo/anon/anonlib/00.20.012-SNAPSHOT/anonlib-00.20.012-SNAPSHOT.jar
[INFO] ------------------------------------------------------------------------
[INFO] BUILD FAILURE
[INFO] ------------------------------------------------------------------------
[INFO] Total time: 2.835 s
[INFO] Finished at: 2017-07-07T10:05:57+02:00
[INFO] Final Memory: 12M/154M
[INFO] ------------------------------------------------------------------------
[ERROR] Failed to execute goal on project InfoService: Could not resolve dependencies for project anon:InfoService:jar:00.09.009-SNAPSHOT: Could not find artifact anon:anonlib:jar:00.20.012-SNAPSHOT in anon.inf.tu-dresden.de (http://anon.inf.tu-dresden.de/artifactory/repo) -> [Help 1]
[ERROR] 
[ERROR] To see the full stack trace of the errors, re-run Maven with the -e switch.
[ERROR] Re-run Maven using the -X switch to enable full debug logging.
[ERROR] 
[ERROR] For more information about the errors and possible solutions, please read the following articles:
[ERROR] [Help 1] http://cwiki.apache.org/confluence/display/MAVEN/DependencyResolutionException