Console Output

Established TCP socket on 41437
<===[JENKINS REMOTING CAPACITY]===>channel started
Executing Maven:  -B -f /var/lib/jenkins/jobs/InfoService-daily-dev-snapshot/workspace/pom.xml -Dmaven.repo.local=/var/lib/jenkins/maven-repositories/1 deploy -Panon-cc-dev,anon-cc-daily-snapshot
[INFO] Scanning for projects...
[INFO]                                                                         
[INFO] ------------------------------------------------------------------------
[INFO] Building InfoService 00.09.015-SNAPSHOT
[INFO] ------------------------------------------------------------------------
[INFO] Downloading: https://anon.inf.tu-dresden.de/artifactory/repo/anon/anonlib/00.21.026-SNAPSHOT/maven-metadata.xml
[INFO] Downloaded: https://anon.inf.tu-dresden.de/artifactory/repo/anon/anonlib/00.21.026-SNAPSHOT/maven-metadata.xml (327 B at 0.4 KB/sec)
[INFO] Downloading: https://anon.inf.tu-dresden.de/artifactory/repo/anon/BouncyCastleLightForAN.ON/01.65.002-SNAPSHOT/maven-metadata.xml
[INFO] Downloaded: https://anon.inf.tu-dresden.de/artifactory/repo/anon/BouncyCastleLightForAN.ON/01.65.002-SNAPSHOT/maven-metadata.xml (345 B at 7.0 KB/sec)
[INFO] Downloading: https://anon.inf.tu-dresden.de/artifactory/repo/anon/HTTPClient/00.04.014-SNAPSHOT/maven-metadata.xml
[INFO] Downloaded: https://anon.inf.tu-dresden.de/artifactory/repo/anon/HTTPClient/00.04.014-SNAPSHOT/maven-metadata.xml (330 B at 8.1 KB/sec)
[INFO] Downloading: https://anon.inf.tu-dresden.de/artifactory/repo/anon/SkypeForANON/0.0.13-SNAPSHOT/maven-metadata.xml
[INFO] Downloaded: https://anon.inf.tu-dresden.de/artifactory/repo/anon/SkypeForANON/0.0.13-SNAPSHOT/maven-metadata.xml (329 B at 5.5 KB/sec)
[INFO] Downloading: https://anon.inf.tu-dresden.de/artifactory/repo/anon/ApacheFTPClient/0.0.2-SNAPSHOT/maven-metadata.xml
[INFO] Downloaded: https://anon.inf.tu-dresden.de/artifactory/repo/anon/ApacheFTPClient/0.0.2-SNAPSHOT/maven-metadata.xml (331 B at 13.5 KB/sec)
[INFO] Downloading: https://anon.inf.tu-dresden.de/artifactory/repo/anon/logging/0.1.9-SNAPSHOT/maven-metadata.xml
[INFO] Downloaded: https://anon.inf.tu-dresden.de/artifactory/repo/anon/logging/0.1.9-SNAPSHOT/maven-metadata.xml (302 B at 4.6 KB/sec)
[INFO] Downloading: https://anon.inf.tu-dresden.de/artifactory/repo/anon/log4jForANON/0.0.4-SNAPSHOT/maven-metadata.xml
[INFO] Downloaded: https://anon.inf.tu-dresden.de/artifactory/repo/anon/log4jForANON/0.0.4-SNAPSHOT/maven-metadata.xml (328 B at 4.3 KB/sec)
[INFO] 
[INFO] --- maven-resources-plugin:2.6:resources (default-resources) @ InfoService ---
[WARNING] Using platform encoding (UTF-8 actually) to copy filtered resources, i.e. build is platform dependent!
[INFO] Copying 14 resources
[INFO] 
[INFO] --- maven-compiler-plugin:3.8.1:compile (default-compile) @ InfoService ---
[INFO] Changes detected - recompiling the module!
[WARNING] File encoding has not been set, using platform encoding UTF-8, i.e. build is platform dependent!
[INFO] Compiling 127 source files to /var/lib/jenkins/jobs/InfoService-daily-dev-snapshot/workspace/target/classes
[INFO] /var/lib/jenkins/jobs/InfoService-daily-dev-snapshot/workspace/src/main/java/infoservice/japforwarding/ServerVerifier.java: Some input files use or override a deprecated API.
[INFO] /var/lib/jenkins/jobs/InfoService-daily-dev-snapshot/workspace/src/main/java/infoservice/japforwarding/ServerVerifier.java: Recompile with -Xlint:deprecation for details.
[INFO] /var/lib/jenkins/jobs/InfoService-daily-dev-snapshot/workspace/src/main/java/infoservice/agreement/paxos/PaxosInstance.java: Some input files use unchecked or unsafe operations.
[INFO] /var/lib/jenkins/jobs/InfoService-daily-dev-snapshot/workspace/src/main/java/infoservice/agreement/paxos/PaxosInstance.java: Recompile with -Xlint:unchecked for details.
[INFO] 
[INFO] --- maven-resources-plugin:2.6:testResources (default-testResources) @ InfoService ---
[WARNING] Using platform encoding (UTF-8 actually) to copy filtered resources, i.e. build is platform dependent!
[INFO] skip non existing resourceDirectory /var/lib/jenkins/jobs/InfoService-daily-dev-snapshot/workspace/src/test/resources
[INFO] 
[INFO] --- maven-compiler-plugin:3.8.1:testCompile (default-testCompile) @ InfoService ---
[INFO] Changes detected - recompiling the module!
[WARNING] File encoding has not been set, using platform encoding UTF-8, i.e. build is platform dependent!
[INFO] Compiling 9 source files to /var/lib/jenkins/jobs/InfoService-daily-dev-snapshot/workspace/target/test-classes
[INFO] 
[INFO] --- maven-surefire-plugin:2.12:test (default-test) @ InfoService ---
[INFO] Tests are skipped.
[INFO] 
[INFO] --- maven-jar-plugin:2.4:jar (default-jar) @ InfoService ---
[INFO] Building jar: /var/lib/jenkins/jobs/InfoService-daily-dev-snapshot/workspace/target/InfoService-00.09.015-SNAPSHOT.jar
[INFO] 
[INFO] --- maven-assembly-plugin:3.3.0:single (create-executable-jar) @ InfoService ---
[INFO] Building jar: /var/lib/jenkins/jobs/InfoService-daily-dev-snapshot/workspace/target/InfoService-00.09.015-SNAPSHOT-jar-with-dependencies.jar
[INFO] 
[INFO] --- maven-jarsigner-plugin:3.0.0:sign (sign-executable-jar) @ InfoService ---
[INFO] 1 Archiv(e) verarbeitet
[INFO] 
[INFO] --- maven-install-plugin:2.4:install (default-install) @ InfoService ---
[INFO] Installing /var/lib/jenkins/jobs/InfoService-daily-dev-snapshot/workspace/target/InfoService-00.09.015-SNAPSHOT.jar to /var/lib/jenkins/maven-repositories/1/anon/InfoService/00.09.015-SNAPSHOT/InfoService-00.09.015-SNAPSHOT.jar
[INFO] Installing /var/lib/jenkins/jobs/InfoService-daily-dev-snapshot/workspace/pom.xml to /var/lib/jenkins/maven-repositories/1/anon/InfoService/00.09.015-SNAPSHOT/InfoService-00.09.015-SNAPSHOT.pom
[INFO] Installing /var/lib/jenkins/jobs/InfoService-daily-dev-snapshot/workspace/target/InfoService-00.09.015-SNAPSHOT-jar-with-dependencies.jar to /var/lib/jenkins/maven-repositories/1/anon/InfoService/00.09.015-SNAPSHOT/InfoService-00.09.015-SNAPSHOT-jar-with-dependencies.jar
[INFO] 
[INFO] --- maven-deploy-plugin:2.7:deploy (default-deploy) @ InfoService ---
[INFO] Downloading: https://anon.inf.tu-dresden.de:443/artifactory/artifacts-dev/anon/InfoService/00.09.015-SNAPSHOT/maven-metadata.xml
[INFO] Downloaded: https://anon.inf.tu-dresden.de:443/artifactory/artifacts-dev/anon/InfoService/00.09.015-SNAPSHOT/maven-metadata.xml (331 B at 2.3 KB/sec)
[INFO] Uploading: https://anon.inf.tu-dresden.de:443/artifactory/artifacts-dev/anon/InfoService/00.09.015-SNAPSHOT/InfoService-00.09.015-20210504.220625-2.jar
[INFO] Uploaded: https://anon.inf.tu-dresden.de:443/artifactory/artifacts-dev/anon/InfoService/00.09.015-SNAPSHOT/InfoService-00.09.015-20210504.220625-2.jar (320 KB at 36.6 KB/sec)
[INFO] Uploading: https://anon.inf.tu-dresden.de:443/artifactory/artifacts-dev/anon/InfoService/00.09.015-SNAPSHOT/InfoService-00.09.015-20210504.220625-2.pom
[INFO] Uploaded: https://anon.inf.tu-dresden.de:443/artifactory/artifacts-dev/anon/InfoService/00.09.015-SNAPSHOT/InfoService-00.09.015-20210504.220625-2.pom (7 KB at 1.8 KB/sec)
[INFO] Downloading: https://anon.inf.tu-dresden.de:443/artifactory/artifacts-dev/anon/InfoService/maven-metadata.xml
[INFO] Downloaded: https://anon.inf.tu-dresden.de:443/artifactory/artifacts-dev/anon/InfoService/maven-metadata.xml (4 KB at 90.5 KB/sec)
[INFO] Uploading: https://anon.inf.tu-dresden.de:443/artifactory/artifacts-dev/anon/InfoService/00.09.015-SNAPSHOT/maven-metadata.xml
[INFO] Uploaded: https://anon.inf.tu-dresden.de:443/artifactory/artifacts-dev/anon/InfoService/00.09.015-SNAPSHOT/maven-metadata.xml (777 B at 42.2 KB/sec)
[INFO] Uploading: https://anon.inf.tu-dresden.de:443/artifactory/artifacts-dev/anon/InfoService/maven-metadata.xml
[INFO] Uploaded: https://anon.inf.tu-dresden.de:443/artifactory/artifacts-dev/anon/InfoService/maven-metadata.xml (4 KB at 34.7 KB/sec)
[INFO] Uploading: https://anon.inf.tu-dresden.de:443/artifactory/artifacts-dev/anon/InfoService/00.09.015-SNAPSHOT/InfoService-00.09.015-20210504.220625-2-jar-with-dependencies.jar
[INFO] Uploaded: https://anon.inf.tu-dresden.de:443/artifactory/artifacts-dev/anon/InfoService/00.09.015-SNAPSHOT/InfoService-00.09.015-20210504.220625-2-jar-with-dependencies.jar (3722 KB at 5338.9 KB/sec)
[INFO] Uploading: https://anon.inf.tu-dresden.de:443/artifactory/artifacts-dev/anon/InfoService/00.09.015-SNAPSHOT/maven-metadata.xml
[INFO] Uploaded: https://anon.inf.tu-dresden.de:443/artifactory/artifacts-dev/anon/InfoService/00.09.015-SNAPSHOT/maven-metadata.xml (1009 B at 61.6 KB/sec)
[INFO] 
[INFO] --- maven-antrun-plugin:3.0.0:run (default) @ InfoService ---
[INFO] Executing tasks
[WARNING]      [echo] Current Version: IS.09.010
[INFO]      [copy] Copying 1 file to /var/www/JapWeb/develop
[INFO]      [exec] Could not chdir to home directory /home/users/a/an/anonsfrelease: No such file or directory
[INFO]      [exec] rsync: mkdir "/home/frs/project/anon/infoservice-development/IS.09.010" failed: No such file or directory (2)
[INFO]      [exec] rsync error: error in file IO (code 11) at main.c(688) [Receiver=3.1.4dev]
[INFO] ------------------------------------------------------------------------
[INFO] BUILD FAILURE
[INFO] ------------------------------------------------------------------------
[INFO] Total time: 46.932 s
[INFO] Finished at: 2021-05-05T00:06:45+02:00
[INFO] Final Memory: 32M/299M
[INFO] ------------------------------------------------------------------------
Warte bis Jenkins die Datensammlung abgeschlossen hat
[ERROR] Failed to execute goal org.apache.maven.plugins:maven-antrun-plugin:3.0.0:run (default) on project InfoService: An Ant BuildException has occured: The following error occurred while executing this line:
[ERROR] /var/lib/jenkins/jobs/InfoService-daily-dev-snapshot/workspace/ant_build_maven_anon_cc_daily_snapshot.xml:50: exec returned: 11
[ERROR] around Ant part ...<ant antfile="/var/lib/jenkins/jobs/InfoService-daily-dev-snapshot/workspace/ant_build_maven_anon_cc_daily_snapshot.xml">... @ 7:126 in /var/lib/jenkins/jobs/InfoService-daily-dev-snapshot/workspace/target/antrun/build-main.xml
[ERROR] -> [Help 1]
[ERROR] 
[ERROR] To see the full stack trace of the errors, re-run Maven with the -e switch.
[ERROR] Re-run Maven using the -X switch to enable full debug logging.
[ERROR] 
[ERROR] For more information about the errors and possible solutions, please read the following articles:
[ERROR] [Help 1] http://cwiki.apache.org/confluence/display/MAVEN/MojoExecutionException