Console Output

Gestartet durch Benutzer sk13
Running as SYSTEM
[EnvInject] - Loading node environment variables.
Baue in Arbeitsbereich /var/lib/jenkins/jobs/ANONdroidVPN-snapshot/workspace
The recommended git tool is: NONE
No credentials specified
Cloning the remote Git repository
Cloning repository https://dud-scm.inf.tu-dresden.de/an.on/anonguard.git
 > git init /var/lib/jenkins/jobs/ANONdroidVPN-snapshot/workspace # timeout=10
Fetching upstream changes from https://dud-scm.inf.tu-dresden.de/an.on/anonguard.git
 > git --version # timeout=10
 > git --version # 'git version 2.20.1'
 > git fetch --tags --force --progress -- https://dud-scm.inf.tu-dresden.de/an.on/anonguard.git +refs/heads/*:refs/remotes/origin/* # timeout=10
 > git config remote.origin.url https://dud-scm.inf.tu-dresden.de/an.on/anonguard.git # timeout=10
 > git config --add remote.origin.fetch +refs/heads/*:refs/remotes/origin/* # timeout=10
Avoid second fetch
 > git rev-parse refs/remotes/origin/master^{commit} # timeout=10
Checking out Revision 70803ee0dc8e8df694589375322d53b6d829e2d0 (refs/remotes/origin/master)
 > git config core.sparsecheckout # timeout=10
 > git checkout -f 70803ee0dc8e8df694589375322d53b6d829e2d0 # timeout=10
Commit message: "Update .gitlab-ci.yml file"
First time build. Skipping changelog.
[EnvInject] - Executing scripts and injecting environment variables after the SCM step.
[EnvInject] - Injecting as environment variables the properties content 
LC_NUMERIC="en_US.UTF-8"
ANDROID_NDK_HOME=/opt/android-ndk-r15
ANDROID_HOME=/opt/android-sdk-linux

[EnvInject] - Variables injected successfully.
[Gradle] - Launching build.
[workspace] $ /var/lib/jenkins/jobs/ANONdroidVPN-snapshot/workspace/gradlew assembleRelease
Starting a Gradle Daemon (subsequent builds will be faster)
> Task :app:preBuild UP-TO-DATE
> Task :app:preNoRemotePCAPReleaseBuild UP-TO-DATE
> Task :app:compileNoRemotePCAPReleaseAidl NO-SOURCE
> Task :app:compileNoRemotePCAPReleaseRenderscript NO-SOURCE
> Task :app:generateNoRemotePCAPReleaseBuildConfig
> Task :app:javaPreCompileNoRemotePCAPRelease
> Task :app:generateNoRemotePCAPReleaseResValues
> Task :app:generateNoRemotePCAPReleaseResources
> Task :app:checkNoRemotePCAPReleaseAarMetadata
> Task :app:createNoRemotePCAPReleaseCompatibleScreenManifests
> Task :app:extractDeepLinksNoRemotePCAPRelease

> Task :app:processNoRemotePCAPReleaseMainManifest
/var/lib/jenkins/jobs/ANONdroidVPN-snapshot/workspace/app/src/main/AndroidManifest.xml:24:5-26:28 Warning:
	uses-permission#android.permission.ACCESS_WIFI_STATE was tagged at AndroidManifest.xml:24 to remove other declarations but no other declaration present
/var/lib/jenkins/jobs/ANONdroidVPN-snapshot/workspace/app/src/main/AndroidManifest.xml:27:5-29:28 Warning:
	uses-permission#android.permission.ACCESS_COARSE_LOCATION was tagged at AndroidManifest.xml:27 to remove other declarations but no other declaration present
/var/lib/jenkins/jobs/ANONdroidVPN-snapshot/workspace/app/src/main/AndroidManifest.xml:30:5-32:28 Warning:
	uses-permission#android.permission.ACCESS_FINE_LOCATION was tagged at AndroidManifest.xml:30 to remove other declarations but no other declaration present

> Task :app:mergeNoRemotePCAPReleaseResources
> Task :app:processNoRemotePCAPReleaseManifest
> Task :app:mapNoRemotePCAPReleaseSourceSetPaths
> Task :app:extractProguardFiles

> Task :app:configureCMakeRelWithDebInfo[arm64-v8a]
C/C++: noRemotePCAPRelease|arm64-v8a :CMake Warning (dev) in CMakeLists.txt:
C/C++: noRemotePCAPRelease|arm64-v8a :  No project() command is present.  The top-level CMakeLists.txt file must
C/C++: noRemotePCAPRelease|arm64-v8a :  contain a literal, direct call to the project() command.  Add a line of
C/C++: noRemotePCAPRelease|arm64-v8a :  code such as
C/C++: noRemotePCAPRelease|arm64-v8a :    project(ProjectName)
C/C++: noRemotePCAPRelease|arm64-v8a :  near the top of the file, but after cmake_minimum_required().
C/C++: noRemotePCAPRelease|arm64-v8a :  CMake is pretending there is a "project(Project)" command on the first
C/C++: noRemotePCAPRelease|arm64-v8a :  line.
C/C++: noRemotePCAPRelease|arm64-v8a :This warning is for project developers.  Use -Wno-dev to suppress it.
C/C++: noRemotePCAPRelease|arm64-v8a :CMake Warning at /opt/android-sdk-linux/ndk/24.0.8215888/build/cmake/android-legacy.toolchain.cmake:415 (message):
C/C++: noRemotePCAPRelease|arm64-v8a :  An old version of CMake is being used that cannot automatically detect
C/C++: noRemotePCAPRelease|arm64-v8a :  compiler attributes.  Compiler identification is being bypassed.  Some
C/C++: noRemotePCAPRelease|arm64-v8a :  values may be wrong or missing.  Update to CMake 3.19 or newer to use
C/C++: noRemotePCAPRelease|arm64-v8a :  CMake's built-in compiler identification.
C/C++: noRemotePCAPRelease|arm64-v8a :Call Stack (most recent call first):
C/C++: noRemotePCAPRelease|arm64-v8a :  /opt/android-sdk-linux/ndk/24.0.8215888/build/cmake/android.toolchain.cmake:54 (include)
C/C++: noRemotePCAPRelease|arm64-v8a :  /mnt/sdd1/opt/android-sdk-linux/cmake/3.18.1/share/cmake-3.18/Modules/CMakeDetermineSystem.cmake:93 (include)
C/C++: noRemotePCAPRelease|arm64-v8a :CMake Warning at /opt/android-sdk-linux/ndk/24.0.8215888/build/cmake/android-legacy.toolchain.cmake:415 (message):
C/C++: noRemotePCAPRelease|arm64-v8a :  An old version of CMake is being used that cannot automatically detect
C/C++: noRemotePCAPRelease|arm64-v8a :  compiler attributes.  Compiler identification is being bypassed.  Some
C/C++: noRemotePCAPRelease|arm64-v8a :  values may be wrong or missing.  Update to CMake 3.19 or newer to use
C/C++: noRemotePCAPRelease|arm64-v8a :  CMake's built-in compiler identification.
C/C++: noRemotePCAPRelease|arm64-v8a :Call Stack (most recent call first):
C/C++: noRemotePCAPRelease|arm64-v8a :  /opt/android-sdk-linux/ndk/24.0.8215888/build/cmake/android.toolchain.cmake:54 (include)
C/C++: noRemotePCAPRelease|arm64-v8a :  /var/lib/jenkins/jobs/ANONdroidVPN-snapshot/workspace/app/.cxx/RelWithDebInfo/42562m1a/arm64-v8a/CMakeFiles/3.18.1-g262b901/CMakeSystem.cmake:6 (include)
C/C++: noRemotePCAPRelease|arm64-v8a :  /var/lib/jenkins/jobs/ANONdroidVPN-snapshot/workspace/app/.cxx/RelWithDebInfo/42562m1a/arm64-v8a/CMakeFiles/CMakeTmp/CMakeLists.txt:2 (project)
C/C++: noRemotePCAPRelease|arm64-v8a :CMake Warning at /opt/android-sdk-linux/ndk/24.0.8215888/build/cmake/android-legacy.toolchain.cmake:415 (message):
C/C++: noRemotePCAPRelease|arm64-v8a :  An old version of CMake is being used that cannot automatically detect
C/C++: noRemotePCAPRelease|arm64-v8a :  compiler attributes.  Compiler identification is being bypassed.  Some
C/C++: noRemotePCAPRelease|arm64-v8a :  values may be wrong or missing.  Update to CMake 3.19 or newer to use
C/C++: noRemotePCAPRelease|arm64-v8a :  CMake's built-in compiler identification.
C/C++: noRemotePCAPRelease|arm64-v8a :Call Stack (most recent call first):
C/C++: noRemotePCAPRelease|arm64-v8a :  /opt/android-sdk-linux/ndk/24.0.8215888/build/cmake/android.toolchain.cmake:54 (include)
C/C++: noRemotePCAPRelease|arm64-v8a :  /var/lib/jenkins/jobs/ANONdroidVPN-snapshot/workspace/app/.cxx/RelWithDebInfo/42562m1a/arm64-v8a/CMakeFiles/3.18.1-g262b901/CMakeSystem.cmake:6 (include)
C/C++: noRemotePCAPRelease|arm64-v8a :  /var/lib/jenkins/jobs/ANONdroidVPN-snapshot/workspace/app/.cxx/RelWithDebInfo/42562m1a/arm64-v8a/CMakeFiles/CMakeTmp/CMakeLists.txt:2 (project)

> Task :app:buildCMakeRelWithDebInfo[arm64-v8a]

> Task :app:configureCMakeRelWithDebInfo[armeabi-v7a]
C/C++: noRemotePCAPRelease|armeabi-v7a :CMake Warning (dev) in CMakeLists.txt:
C/C++: noRemotePCAPRelease|armeabi-v7a :  No project() command is present.  The top-level CMakeLists.txt file must
C/C++: noRemotePCAPRelease|armeabi-v7a :  contain a literal, direct call to the project() command.  Add a line of
C/C++: noRemotePCAPRelease|armeabi-v7a :  code such as
C/C++: noRemotePCAPRelease|armeabi-v7a :    project(ProjectName)
C/C++: noRemotePCAPRelease|armeabi-v7a :  near the top of the file, but after cmake_minimum_required().
C/C++: noRemotePCAPRelease|armeabi-v7a :  CMake is pretending there is a "project(Project)" command on the first
C/C++: noRemotePCAPRelease|armeabi-v7a :  line.
C/C++: noRemotePCAPRelease|armeabi-v7a :This warning is for project developers.  Use -Wno-dev to suppress it.
C/C++: noRemotePCAPRelease|armeabi-v7a :CMake Warning at /opt/android-sdk-linux/ndk/24.0.8215888/build/cmake/android-legacy.toolchain.cmake:415 (message):
C/C++: noRemotePCAPRelease|armeabi-v7a :  An old version of CMake is being used that cannot automatically detect
C/C++: noRemotePCAPRelease|armeabi-v7a :  compiler attributes.  Compiler identification is being bypassed.  Some
C/C++: noRemotePCAPRelease|armeabi-v7a :  values may be wrong or missing.  Update to CMake 3.19 or newer to use
C/C++: noRemotePCAPRelease|armeabi-v7a :  CMake's built-in compiler identification.
C/C++: noRemotePCAPRelease|armeabi-v7a :Call Stack (most recent call first):
C/C++: noRemotePCAPRelease|armeabi-v7a :  /opt/android-sdk-linux/ndk/24.0.8215888/build/cmake/android.toolchain.cmake:54 (include)
C/C++: noRemotePCAPRelease|armeabi-v7a :  /mnt/sdd1/opt/android-sdk-linux/cmake/3.18.1/share/cmake-3.18/Modules/CMakeDetermineSystem.cmake:93 (include)
C/C++: noRemotePCAPRelease|armeabi-v7a :CMake Warning at /opt/android-sdk-linux/ndk/24.0.8215888/build/cmake/android-legacy.toolchain.cmake:415 (message):
C/C++: noRemotePCAPRelease|armeabi-v7a :  An old version of CMake is being used that cannot automatically detect
C/C++: noRemotePCAPRelease|armeabi-v7a :  compiler attributes.  Compiler identification is being bypassed.  Some
C/C++: noRemotePCAPRelease|armeabi-v7a :  values may be wrong or missing.  Update to CMake 3.19 or newer to use
C/C++: noRemotePCAPRelease|armeabi-v7a :  CMake's built-in compiler identification.
C/C++: noRemotePCAPRelease|armeabi-v7a :Call Stack (most recent call first):
C/C++: noRemotePCAPRelease|armeabi-v7a :  /opt/android-sdk-linux/ndk/24.0.8215888/build/cmake/android.toolchain.cmake:54 (include)
C/C++: noRemotePCAPRelease|armeabi-v7a :  /var/lib/jenkins/jobs/ANONdroidVPN-snapshot/workspace/app/.cxx/RelWithDebInfo/42562m1a/armeabi-v7a/CMakeFiles/3.18.1-g262b901/CMakeSystem.cmake:6 (include)
C/C++: noRemotePCAPRelease|armeabi-v7a :  /var/lib/jenkins/jobs/ANONdroidVPN-snapshot/workspace/app/.cxx/RelWithDebInfo/42562m1a/armeabi-v7a/CMakeFiles/CMakeTmp/CMakeLists.txt:2 (project)
C/C++: noRemotePCAPRelease|armeabi-v7a :CMake Warning at /opt/android-sdk-linux/ndk/24.0.8215888/build/cmake/android-legacy.toolchain.cmake:415 (message):
C/C++: noRemotePCAPRelease|armeabi-v7a :  An old version of CMake is being used that cannot automatically detect
C/C++: noRemotePCAPRelease|armeabi-v7a :  compiler attributes.  Compiler identification is being bypassed.  Some
C/C++: noRemotePCAPRelease|armeabi-v7a :  values may be wrong or missing.  Update to CMake 3.19 or newer to use
C/C++: noRemotePCAPRelease|armeabi-v7a :  CMake's built-in compiler identification.
C/C++: noRemotePCAPRelease|armeabi-v7a :Call Stack (most recent call first):
C/C++: noRemotePCAPRelease|armeabi-v7a :  /opt/android-sdk-linux/ndk/24.0.8215888/build/cmake/android.toolchain.cmake:54 (include)
C/C++: noRemotePCAPRelease|armeabi-v7a :  /var/lib/jenkins/jobs/ANONdroidVPN-snapshot/workspace/app/.cxx/RelWithDebInfo/42562m1a/armeabi-v7a/CMakeFiles/3.18.1-g262b901/CMakeSystem.cmake:6 (include)
C/C++: noRemotePCAPRelease|armeabi-v7a :  /var/lib/jenkins/jobs/ANONdroidVPN-snapshot/workspace/app/.cxx/RelWithDebInfo/42562m1a/armeabi-v7a/CMakeFiles/CMakeTmp/CMakeLists.txt:2 (project)

> Task :app:buildCMakeRelWithDebInfo[armeabi-v7a]

> Task :app:configureCMakeRelWithDebInfo[x86]
C/C++: noRemotePCAPRelease|x86 :CMake Warning (dev) in CMakeLists.txt:
C/C++: noRemotePCAPRelease|x86 :  No project() command is present.  The top-level CMakeLists.txt file must
C/C++: noRemotePCAPRelease|x86 :  contain a literal, direct call to the project() command.  Add a line of
C/C++: noRemotePCAPRelease|x86 :  code such as
C/C++: noRemotePCAPRelease|x86 :    project(ProjectName)
C/C++: noRemotePCAPRelease|x86 :  near the top of the file, but after cmake_minimum_required().
C/C++: noRemotePCAPRelease|x86 :  CMake is pretending there is a "project(Project)" command on the first
C/C++: noRemotePCAPRelease|x86 :  line.
C/C++: noRemotePCAPRelease|x86 :This warning is for project developers.  Use -Wno-dev to suppress it.
C/C++: noRemotePCAPRelease|x86 :CMake Warning at /opt/android-sdk-linux/ndk/24.0.8215888/build/cmake/android-legacy.toolchain.cmake:415 (message):
C/C++: noRemotePCAPRelease|x86 :  An old version of CMake is being used that cannot automatically detect
C/C++: noRemotePCAPRelease|x86 :  compiler attributes.  Compiler identification is being bypassed.  Some
C/C++: noRemotePCAPRelease|x86 :  values may be wrong or missing.  Update to CMake 3.19 or newer to use
C/C++: noRemotePCAPRelease|x86 :  CMake's built-in compiler identification.
C/C++: noRemotePCAPRelease|x86 :Call Stack (most recent call first):
C/C++: noRemotePCAPRelease|x86 :  /opt/android-sdk-linux/ndk/24.0.8215888/build/cmake/android.toolchain.cmake:54 (include)
C/C++: noRemotePCAPRelease|x86 :  /mnt/sdd1/opt/android-sdk-linux/cmake/3.18.1/share/cmake-3.18/Modules/CMakeDetermineSystem.cmake:93 (include)
C/C++: noRemotePCAPRelease|x86 :CMake Warning at /opt/android-sdk-linux/ndk/24.0.8215888/build/cmake/android-legacy.toolchain.cmake:415 (message):
C/C++: noRemotePCAPRelease|x86 :  An old version of CMake is being used that cannot automatically detect
C/C++: noRemotePCAPRelease|x86 :  compiler attributes.  Compiler identification is being bypassed.  Some
C/C++: noRemotePCAPRelease|x86 :  values may be wrong or missing.  Update to CMake 3.19 or newer to use
C/C++: noRemotePCAPRelease|x86 :  CMake's built-in compiler identification.
C/C++: noRemotePCAPRelease|x86 :Call Stack (most recent call first):
C/C++: noRemotePCAPRelease|x86 :  /opt/android-sdk-linux/ndk/24.0.8215888/build/cmake/android.toolchain.cmake:54 (include)
C/C++: noRemotePCAPRelease|x86 :  /var/lib/jenkins/jobs/ANONdroidVPN-snapshot/workspace/app/.cxx/RelWithDebInfo/42562m1a/x86/CMakeFiles/3.18.1-g262b901/CMakeSystem.cmake:6 (include)
C/C++: noRemotePCAPRelease|x86 :  /var/lib/jenkins/jobs/ANONdroidVPN-snapshot/workspace/app/.cxx/RelWithDebInfo/42562m1a/x86/CMakeFiles/CMakeTmp/CMakeLists.txt:2 (project)
C/C++: noRemotePCAPRelease|x86 :CMake Warning at /opt/android-sdk-linux/ndk/24.0.8215888/build/cmake/android-legacy.toolchain.cmake:415 (message):
C/C++: noRemotePCAPRelease|x86 :  An old version of CMake is being used that cannot automatically detect
C/C++: noRemotePCAPRelease|x86 :  compiler attributes.  Compiler identification is being bypassed.  Some
C/C++: noRemotePCAPRelease|x86 :  values may be wrong or missing.  Update to CMake 3.19 or newer to use
C/C++: noRemotePCAPRelease|x86 :  CMake's built-in compiler identification.
C/C++: noRemotePCAPRelease|x86 :Call Stack (most recent call first):
C/C++: noRemotePCAPRelease|x86 :  /opt/android-sdk-linux/ndk/24.0.8215888/build/cmake/android.toolchain.cmake:54 (include)
C/C++: noRemotePCAPRelease|x86 :  /var/lib/jenkins/jobs/ANONdroidVPN-snapshot/workspace/app/.cxx/RelWithDebInfo/42562m1a/x86/CMakeFiles/3.18.1-g262b901/CMakeSystem.cmake:6 (include)
C/C++: noRemotePCAPRelease|x86 :  /var/lib/jenkins/jobs/ANONdroidVPN-snapshot/workspace/app/.cxx/RelWithDebInfo/42562m1a/x86/CMakeFiles/CMakeTmp/CMakeLists.txt:2 (project)

> Task :app:buildCMakeRelWithDebInfo[x86]

> Task :app:configureCMakeRelWithDebInfo[x86_64]
C/C++: noRemotePCAPRelease|x86_64 :CMake Warning (dev) in CMakeLists.txt:
C/C++: noRemotePCAPRelease|x86_64 :  No project() command is present.  The top-level CMakeLists.txt file must
C/C++: noRemotePCAPRelease|x86_64 :  contain a literal, direct call to the project() command.  Add a line of
C/C++: noRemotePCAPRelease|x86_64 :  code such as
C/C++: noRemotePCAPRelease|x86_64 :    project(ProjectName)
C/C++: noRemotePCAPRelease|x86_64 :  near the top of the file, but after cmake_minimum_required().
C/C++: noRemotePCAPRelease|x86_64 :  CMake is pretending there is a "project(Project)" command on the first
C/C++: noRemotePCAPRelease|x86_64 :  line.
C/C++: noRemotePCAPRelease|x86_64 :This warning is for project developers.  Use -Wno-dev to suppress it.
C/C++: noRemotePCAPRelease|x86_64 :CMake Warning at /opt/android-sdk-linux/ndk/24.0.8215888/build/cmake/android-legacy.toolchain.cmake:415 (message):
C/C++: noRemotePCAPRelease|x86_64 :  An old version of CMake is being used that cannot automatically detect
C/C++: noRemotePCAPRelease|x86_64 :  compiler attributes.  Compiler identification is being bypassed.  Some
C/C++: noRemotePCAPRelease|x86_64 :  values may be wrong or missing.  Update to CMake 3.19 or newer to use
C/C++: noRemotePCAPRelease|x86_64 :  CMake's built-in compiler identification.
C/C++: noRemotePCAPRelease|x86_64 :Call Stack (most recent call first):
C/C++: noRemotePCAPRelease|x86_64 :  /opt/android-sdk-linux/ndk/24.0.8215888/build/cmake/android.toolchain.cmake:54 (include)
C/C++: noRemotePCAPRelease|x86_64 :  /mnt/sdd1/opt/android-sdk-linux/cmake/3.18.1/share/cmake-3.18/Modules/CMakeDetermineSystem.cmake:93 (include)
C/C++: noRemotePCAPRelease|x86_64 :CMake Warning at /opt/android-sdk-linux/ndk/24.0.8215888/build/cmake/android-legacy.toolchain.cmake:415 (message):
C/C++: noRemotePCAPRelease|x86_64 :  An old version of CMake is being used that cannot automatically detect
C/C++: noRemotePCAPRelease|x86_64 :  compiler attributes.  Compiler identification is being bypassed.  Some
C/C++: noRemotePCAPRelease|x86_64 :  values may be wrong or missing.  Update to CMake 3.19 or newer to use
C/C++: noRemotePCAPRelease|x86_64 :  CMake's built-in compiler identification.
C/C++: noRemotePCAPRelease|x86_64 :Call Stack (most recent call first):
C/C++: noRemotePCAPRelease|x86_64 :  /opt/android-sdk-linux/ndk/24.0.8215888/build/cmake/android.toolchain.cmake:54 (include)
C/C++: noRemotePCAPRelease|x86_64 :  /var/lib/jenkins/jobs/ANONdroidVPN-snapshot/workspace/app/.cxx/RelWithDebInfo/42562m1a/x86_64/CMakeFiles/3.18.1-g262b901/CMakeSystem.cmake:6 (include)
C/C++: noRemotePCAPRelease|x86_64 :  /var/lib/jenkins/jobs/ANONdroidVPN-snapshot/workspace/app/.cxx/RelWithDebInfo/42562m1a/x86_64/CMakeFiles/CMakeTmp/CMakeLists.txt:2 (project)
C/C++: noRemotePCAPRelease|x86_64 :CMake Warning at /opt/android-sdk-linux/ndk/24.0.8215888/build/cmake/android-legacy.toolchain.cmake:415 (message):
C/C++: noRemotePCAPRelease|x86_64 :  An old version of CMake is being used that cannot automatically detect
C/C++: noRemotePCAPRelease|x86_64 :  compiler attributes.  Compiler identification is being bypassed.  Some
C/C++: noRemotePCAPRelease|x86_64 :  values may be wrong or missing.  Update to CMake 3.19 or newer to use
C/C++: noRemotePCAPRelease|x86_64 :  CMake's built-in compiler identification.
C/C++: noRemotePCAPRelease|x86_64 :Call Stack (most recent call first):
C/C++: noRemotePCAPRelease|x86_64 :  /opt/android-sdk-linux/ndk/24.0.8215888/build/cmake/android.toolchain.cmake:54 (include)
C/C++: noRemotePCAPRelease|x86_64 :  /var/lib/jenkins/jobs/ANONdroidVPN-snapshot/workspace/app/.cxx/RelWithDebInfo/42562m1a/x86_64/CMakeFiles/3.18.1-g262b901/CMakeSystem.cmake:6 (include)
C/C++: noRemotePCAPRelease|x86_64 :  /var/lib/jenkins/jobs/ANONdroidVPN-snapshot/workspace/app/.cxx/RelWithDebInfo/42562m1a/x86_64/CMakeFiles/CMakeTmp/CMakeLists.txt:2 (project)

> Task :app:buildCMakeRelWithDebInfo[x86_64]
> Task :app:externalNativeBuildNoRemotePCAPRelease
> Task :app:mergeNoRemotePCAPReleaseJniLibFolders
> Task :app:processNoRemotePCAPReleaseManifestForPackage
> Task :app:mergeNoRemotePCAPReleaseNativeLibs
> Task :app:stripNoRemotePCAPReleaseDebugSymbols
> Task :app:extractNoRemotePCAPReleaseNativeSymbolTables
> Task :app:mergeNoRemotePCAPReleaseNativeDebugMetadata
> Task :app:checkNoRemotePCAPReleaseDuplicateClasses
> Task :app:desugarNoRemotePCAPReleaseFileDependencies
> Task :app:mergeNoRemotePCAPReleaseShaders
> Task :app:compileNoRemotePCAPReleaseShaders NO-SOURCE
> Task :app:generateNoRemotePCAPReleaseAssets UP-TO-DATE
> Task :app:mergeNoRemotePCAPReleaseAssets
> Task :app:mergeNoRemotePCAPReleaseArtProfile
> Task :app:processNoRemotePCAPReleaseJavaRes NO-SOURCE
> Task :app:compressNoRemotePCAPReleaseAssets
> Task :app:processNoRemotePCAPReleaseResources
> Task :app:collectNoRemotePCAPReleaseDependencies
> Task :app:mergeNoRemotePCAPReleaseJavaResource

> Task :app:compileNoRemotePCAPReleaseJavaWithJavac
/var/lib/jenkins/jobs/ANONdroidVPN-snapshot/workspace/app/src/main/java/anonvpn/anon_next/android/util/AndroidResourceLoaderHelper.java:91: warning: [unchecked] unchecked call to put(K,V) as a member of the raw type Hashtable
														a_loadedResources.put(entry, object);
														                     ^
  where K,V are type-variables:
    K extends Object declared in class Hashtable
    V extends Object declared in class Hashtable
Note: Some input files use or override a deprecated API.
Note: Recompile with -Xlint:deprecation for details.
1 warning

> Task :app:dexBuilderNoRemotePCAPRelease
> Task :app:lintVitalAnalyzeNoRemotePCAPRelease
> Task :app:mergeDexNoRemotePCAPRelease
> Task :app:lintVitalReportNoRemotePCAPRelease
> Task :app:sdkNoRemotePCAPReleaseDependencyData

> Task :app:lintVitalNoRemotePCAPRelease
/var/lib/jenkins/jobs/ANONdroidVPN-snapshot/workspace/app/src/main/res/layout/fragment_connect_detail.xml:148: Error: @+id/connect_b_select is not a sibling in the same RelativeLayout [NotSibling]
        android:layout_above="@+id/connect_b_select"
        ~~~~~~~~~~~~~~~~~~~~~~~~~~~~~~~~~~~~~~~~~~~~

   Explanation for issues of type "NotSibling":
   Layout constraints in a given ConstraintLayout or RelativeLayout should
   reference other views within the same relative layout (but not itself!)

1 errors, 0 warnings


> Task :app:writeNoRemotePCAPReleaseAppMetadata
> Task :app:writeNoRemotePCAPReleaseSigningConfigVersions
> Task :app:preWithRemotePCAPReleaseBuild UP-TO-DATE
> Task :app:compileWithRemotePCAPReleaseAidl NO-SOURCE
> Task :app:compileWithRemotePCAPReleaseRenderscript NO-SOURCE
> Task :app:generateWithRemotePCAPReleaseBuildConfig
> Task :app:javaPreCompileWithRemotePCAPRelease
> Task :app:generateWithRemotePCAPReleaseResValues
> Task :app:generateWithRemotePCAPReleaseResources
> Task :app:checkWithRemotePCAPReleaseAarMetadata
> Task :app:optimizeNoRemotePCAPReleaseResources
> Task :app:createWithRemotePCAPReleaseCompatibleScreenManifests
> Task :app:extractDeepLinksWithRemotePCAPRelease

> Task :app:processWithRemotePCAPReleaseMainManifest
/var/lib/jenkins/jobs/ANONdroidVPN-snapshot/workspace/app/src/main/AndroidManifest.xml:24:5-26:28 Warning:
	uses-permission#android.permission.ACCESS_WIFI_STATE was tagged at AndroidManifest.xml:24 to remove other declarations but no other declaration present
/var/lib/jenkins/jobs/ANONdroidVPN-snapshot/workspace/app/src/main/AndroidManifest.xml:27:5-29:28 Warning:
	uses-permission#android.permission.ACCESS_COARSE_LOCATION was tagged at AndroidManifest.xml:27 to remove other declarations but no other declaration present
/var/lib/jenkins/jobs/ANONdroidVPN-snapshot/workspace/app/src/main/AndroidManifest.xml:30:5-32:28 Warning:
	uses-permission#android.permission.ACCESS_FINE_LOCATION was tagged at AndroidManifest.xml:30 to remove other declarations but no other declaration present

> Task :app:processWithRemotePCAPReleaseManifest

> Task :app:configureCMakeRelWithDebInfo[arm64-v8a]-2
C/C++: withRemotePCAPRelease|arm64-v8a :CMake Warning (dev) in CMakeLists.txt:
C/C++: withRemotePCAPRelease|arm64-v8a :  No project() command is present.  The top-level CMakeLists.txt file must
C/C++: withRemotePCAPRelease|arm64-v8a :  contain a literal, direct call to the project() command.  Add a line of
C/C++: withRemotePCAPRelease|arm64-v8a :  code such as
C/C++: withRemotePCAPRelease|arm64-v8a :    project(ProjectName)
C/C++: withRemotePCAPRelease|arm64-v8a :  near the top of the file, but after cmake_minimum_required().
C/C++: withRemotePCAPRelease|arm64-v8a :  CMake is pretending there is a "project(Project)" command on the first
C/C++: withRemotePCAPRelease|arm64-v8a :  line.
C/C++: withRemotePCAPRelease|arm64-v8a :This warning is for project developers.  Use -Wno-dev to suppress it.
C/C++: withRemotePCAPRelease|arm64-v8a :CMake Warning at /opt/android-sdk-linux/ndk/24.0.8215888/build/cmake/android-legacy.toolchain.cmake:415 (message):
C/C++: withRemotePCAPRelease|arm64-v8a :  An old version of CMake is being used that cannot automatically detect
C/C++: withRemotePCAPRelease|arm64-v8a :  compiler attributes.  Compiler identification is being bypassed.  Some
C/C++: withRemotePCAPRelease|arm64-v8a :  values may be wrong or missing.  Update to CMake 3.19 or newer to use
C/C++: withRemotePCAPRelease|arm64-v8a :  CMake's built-in compiler identification.
C/C++: withRemotePCAPRelease|arm64-v8a :Call Stack (most recent call first):
C/C++: withRemotePCAPRelease|arm64-v8a :  /opt/android-sdk-linux/ndk/24.0.8215888/build/cmake/android.toolchain.cmake:54 (include)
C/C++: withRemotePCAPRelease|arm64-v8a :  /mnt/sdd1/opt/android-sdk-linux/cmake/3.18.1/share/cmake-3.18/Modules/CMakeDetermineSystem.cmake:93 (include)
C/C++: withRemotePCAPRelease|arm64-v8a :CMake Warning at /opt/android-sdk-linux/ndk/24.0.8215888/build/cmake/android-legacy.toolchain.cmake:415 (message):
C/C++: withRemotePCAPRelease|arm64-v8a :  An old version of CMake is being used that cannot automatically detect
C/C++: withRemotePCAPRelease|arm64-v8a :  compiler attributes.  Compiler identification is being bypassed.  Some
C/C++: withRemotePCAPRelease|arm64-v8a :  values may be wrong or missing.  Update to CMake 3.19 or newer to use
C/C++: withRemotePCAPRelease|arm64-v8a :  CMake's built-in compiler identification.
C/C++: withRemotePCAPRelease|arm64-v8a :Call Stack (most recent call first):
C/C++: withRemotePCAPRelease|arm64-v8a :  /opt/android-sdk-linux/ndk/24.0.8215888/build/cmake/android.toolchain.cmake:54 (include)
C/C++: withRemotePCAPRelease|arm64-v8a :  /var/lib/jenkins/jobs/ANONdroidVPN-snapshot/workspace/app/.cxx/RelWithDebInfo/16g6n3y1/arm64-v8a/CMakeFiles/3.18.1-g262b901/CMakeSystem.cmake:6 (include)
C/C++: withRemotePCAPRelease|arm64-v8a :  /var/lib/jenkins/jobs/ANONdroidVPN-snapshot/workspace/app/.cxx/RelWithDebInfo/16g6n3y1/arm64-v8a/CMakeFiles/CMakeTmp/CMakeLists.txt:2 (project)
C/C++: withRemotePCAPRelease|arm64-v8a :CMake Warning at /opt/android-sdk-linux/ndk/24.0.8215888/build/cmake/android-legacy.toolchain.cmake:415 (message):
C/C++: withRemotePCAPRelease|arm64-v8a :  An old version of CMake is being used that cannot automatically detect
C/C++: withRemotePCAPRelease|arm64-v8a :  compiler attributes.  Compiler identification is being bypassed.  Some
C/C++: withRemotePCAPRelease|arm64-v8a :  values may be wrong or missing.  Update to CMake 3.19 or newer to use
C/C++: withRemotePCAPRelease|arm64-v8a :  CMake's built-in compiler identification.
C/C++: withRemotePCAPRelease|arm64-v8a :Call Stack (most recent call first):
C/C++: withRemotePCAPRelease|arm64-v8a :  /opt/android-sdk-linux/ndk/24.0.8215888/build/cmake/android.toolchain.cmake:54 (include)
C/C++: withRemotePCAPRelease|arm64-v8a :  /var/lib/jenkins/jobs/ANONdroidVPN-snapshot/workspace/app/.cxx/RelWithDebInfo/16g6n3y1/arm64-v8a/CMakeFiles/3.18.1-g262b901/CMakeSystem.cmake:6 (include)
C/C++: withRemotePCAPRelease|arm64-v8a :  /var/lib/jenkins/jobs/ANONdroidVPN-snapshot/workspace/app/.cxx/RelWithDebInfo/16g6n3y1/arm64-v8a/CMakeFiles/CMakeTmp/CMakeLists.txt:2 (project)

> Task :app:buildCMakeRelWithDebInfo[arm64-v8a]-2
> Task :app:mergeWithRemotePCAPReleaseResources

> Task :app:configureCMakeRelWithDebInfo[armeabi-v7a]-2
C/C++: withRemotePCAPRelease|armeabi-v7a :CMake Warning (dev) in CMakeLists.txt:
C/C++: withRemotePCAPRelease|armeabi-v7a :  No project() command is present.  The top-level CMakeLists.txt file must
C/C++: withRemotePCAPRelease|armeabi-v7a :  contain a literal, direct call to the project() command.  Add a line of
C/C++: withRemotePCAPRelease|armeabi-v7a :  code such as
C/C++: withRemotePCAPRelease|armeabi-v7a :    project(ProjectName)
C/C++: withRemotePCAPRelease|armeabi-v7a :  near the top of the file, but after cmake_minimum_required().
C/C++: withRemotePCAPRelease|armeabi-v7a :  CMake is pretending there is a "project(Project)" command on the first
C/C++: withRemotePCAPRelease|armeabi-v7a :  line.
C/C++: withRemotePCAPRelease|armeabi-v7a :This warning is for project developers.  Use -Wno-dev to suppress it.
C/C++: withRemotePCAPRelease|armeabi-v7a :CMake Warning at /opt/android-sdk-linux/ndk/24.0.8215888/build/cmake/android-legacy.toolchain.cmake:415 (message):
C/C++: withRemotePCAPRelease|armeabi-v7a :  An old version of CMake is being used that cannot automatically detect
C/C++: withRemotePCAPRelease|armeabi-v7a :  compiler attributes.  Compiler identification is being bypassed.  Some
C/C++: withRemotePCAPRelease|armeabi-v7a :  values may be wrong or missing.  Update to CMake 3.19 or newer to use
C/C++: withRemotePCAPRelease|armeabi-v7a :  CMake's built-in compiler identification.
C/C++: withRemotePCAPRelease|armeabi-v7a :Call Stack (most recent call first):
C/C++: withRemotePCAPRelease|armeabi-v7a :  /opt/android-sdk-linux/ndk/24.0.8215888/build/cmake/android.toolchain.cmake:54 (include)
C/C++: withRemotePCAPRelease|armeabi-v7a :  /mnt/sdd1/opt/android-sdk-linux/cmake/3.18.1/share/cmake-3.18/Modules/CMakeDetermineSystem.cmake:93 (include)
C/C++: withRemotePCAPRelease|armeabi-v7a :CMake Warning at /opt/android-sdk-linux/ndk/24.0.8215888/build/cmake/android-legacy.toolchain.cmake:415 (message):
C/C++: withRemotePCAPRelease|armeabi-v7a :  An old version of CMake is being used that cannot automatically detect
C/C++: withRemotePCAPRelease|armeabi-v7a :  compiler attributes.  Compiler identification is being bypassed.  Some
C/C++: withRemotePCAPRelease|armeabi-v7a :  values may be wrong or missing.  Update to CMake 3.19 or newer to use
C/C++: withRemotePCAPRelease|armeabi-v7a :  CMake's built-in compiler identification.
C/C++: withRemotePCAPRelease|armeabi-v7a :Call Stack (most recent call first):
C/C++: withRemotePCAPRelease|armeabi-v7a :  /opt/android-sdk-linux/ndk/24.0.8215888/build/cmake/android.toolchain.cmake:54 (include)
C/C++: withRemotePCAPRelease|armeabi-v7a :  /var/lib/jenkins/jobs/ANONdroidVPN-snapshot/workspace/app/.cxx/RelWithDebInfo/16g6n3y1/armeabi-v7a/CMakeFiles/3.18.1-g262b901/CMakeSystem.cmake:6 (include)
C/C++: withRemotePCAPRelease|armeabi-v7a :  /var/lib/jenkins/jobs/ANONdroidVPN-snapshot/workspace/app/.cxx/RelWithDebInfo/16g6n3y1/armeabi-v7a/CMakeFiles/CMakeTmp/CMakeLists.txt:2 (project)
C/C++: withRemotePCAPRelease|armeabi-v7a :CMake Warning at /opt/android-sdk-linux/ndk/24.0.8215888/build/cmake/android-legacy.toolchain.cmake:415 (message):
C/C++: withRemotePCAPRelease|armeabi-v7a :  An old version of CMake is being used that cannot automatically detect
C/C++: withRemotePCAPRelease|armeabi-v7a :  compiler attributes.  Compiler identification is being bypassed.  Some
C/C++: withRemotePCAPRelease|armeabi-v7a :  values may be wrong or missing.  Update to CMake 3.19 or newer to use
C/C++: withRemotePCAPRelease|armeabi-v7a :  CMake's built-in compiler identification.
C/C++: withRemotePCAPRelease|armeabi-v7a :Call Stack (most recent call first):
C/C++: withRemotePCAPRelease|armeabi-v7a :  /opt/android-sdk-linux/ndk/24.0.8215888/build/cmake/android.toolchain.cmake:54 (include)
C/C++: withRemotePCAPRelease|armeabi-v7a :  /var/lib/jenkins/jobs/ANONdroidVPN-snapshot/workspace/app/.cxx/RelWithDebInfo/16g6n3y1/armeabi-v7a/CMakeFiles/3.18.1-g262b901/CMakeSystem.cmake:6 (include)
C/C++: withRemotePCAPRelease|armeabi-v7a :  /var/lib/jenkins/jobs/ANONdroidVPN-snapshot/workspace/app/.cxx/RelWithDebInfo/16g6n3y1/armeabi-v7a/CMakeFiles/CMakeTmp/CMakeLists.txt:2 (project)

> Task :app:mapWithRemotePCAPReleaseSourceSetPaths
> Task :app:buildCMakeRelWithDebInfo[armeabi-v7a]-2

> Task :app:configureCMakeRelWithDebInfo[x86]-2
C/C++: withRemotePCAPRelease|x86 :CMake Warning (dev) in CMakeLists.txt:
C/C++: withRemotePCAPRelease|x86 :  No project() command is present.  The top-level CMakeLists.txt file must
C/C++: withRemotePCAPRelease|x86 :  contain a literal, direct call to the project() command.  Add a line of
C/C++: withRemotePCAPRelease|x86 :  code such as
C/C++: withRemotePCAPRelease|x86 :    project(ProjectName)
C/C++: withRemotePCAPRelease|x86 :  near the top of the file, but after cmake_minimum_required().
C/C++: withRemotePCAPRelease|x86 :  CMake is pretending there is a "project(Project)" command on the first
C/C++: withRemotePCAPRelease|x86 :  line.
C/C++: withRemotePCAPRelease|x86 :This warning is for project developers.  Use -Wno-dev to suppress it.
C/C++: withRemotePCAPRelease|x86 :CMake Warning at /opt/android-sdk-linux/ndk/24.0.8215888/build/cmake/android-legacy.toolchain.cmake:415 (message):
C/C++: withRemotePCAPRelease|x86 :  An old version of CMake is being used that cannot automatically detect
C/C++: withRemotePCAPRelease|x86 :  compiler attributes.  Compiler identification is being bypassed.  Some
C/C++: withRemotePCAPRelease|x86 :  values may be wrong or missing.  Update to CMake 3.19 or newer to use
C/C++: withRemotePCAPRelease|x86 :  CMake's built-in compiler identification.
C/C++: withRemotePCAPRelease|x86 :Call Stack (most recent call first):
C/C++: withRemotePCAPRelease|x86 :  /opt/android-sdk-linux/ndk/24.0.8215888/build/cmake/android.toolchain.cmake:54 (include)
C/C++: withRemotePCAPRelease|x86 :  /mnt/sdd1/opt/android-sdk-linux/cmake/3.18.1/share/cmake-3.18/Modules/CMakeDetermineSystem.cmake:93 (include)
C/C++: withRemotePCAPRelease|x86 :CMake Warning at /opt/android-sdk-linux/ndk/24.0.8215888/build/cmake/android-legacy.toolchain.cmake:415 (message):
C/C++: withRemotePCAPRelease|x86 :  An old version of CMake is being used that cannot automatically detect
C/C++: withRemotePCAPRelease|x86 :  compiler attributes.  Compiler identification is being bypassed.  Some
C/C++: withRemotePCAPRelease|x86 :  values may be wrong or missing.  Update to CMake 3.19 or newer to use
C/C++: withRemotePCAPRelease|x86 :  CMake's built-in compiler identification.
C/C++: withRemotePCAPRelease|x86 :Call Stack (most recent call first):
C/C++: withRemotePCAPRelease|x86 :  /opt/android-sdk-linux/ndk/24.0.8215888/build/cmake/android.toolchain.cmake:54 (include)
C/C++: withRemotePCAPRelease|x86 :  /var/lib/jenkins/jobs/ANONdroidVPN-snapshot/workspace/app/.cxx/RelWithDebInfo/16g6n3y1/x86/CMakeFiles/3.18.1-g262b901/CMakeSystem.cmake:6 (include)
C/C++: withRemotePCAPRelease|x86 :  /var/lib/jenkins/jobs/ANONdroidVPN-snapshot/workspace/app/.cxx/RelWithDebInfo/16g6n3y1/x86/CMakeFiles/CMakeTmp/CMakeLists.txt:2 (project)
C/C++: withRemotePCAPRelease|x86 :CMake Warning at /opt/android-sdk-linux/ndk/24.0.8215888/build/cmake/android-legacy.toolchain.cmake:415 (message):
C/C++: withRemotePCAPRelease|x86 :  An old version of CMake is being used that cannot automatically detect
C/C++: withRemotePCAPRelease|x86 :  compiler attributes.  Compiler identification is being bypassed.  Some
C/C++: withRemotePCAPRelease|x86 :  values may be wrong or missing.  Update to CMake 3.19 or newer to use
C/C++: withRemotePCAPRelease|x86 :  CMake's built-in compiler identification.
C/C++: withRemotePCAPRelease|x86 :Call Stack (most recent call first):
C/C++: withRemotePCAPRelease|x86 :  /opt/android-sdk-linux/ndk/24.0.8215888/build/cmake/android.toolchain.cmake:54 (include)
C/C++: withRemotePCAPRelease|x86 :  /var/lib/jenkins/jobs/ANONdroidVPN-snapshot/workspace/app/.cxx/RelWithDebInfo/16g6n3y1/x86/CMakeFiles/3.18.1-g262b901/CMakeSystem.cmake:6 (include)
C/C++: withRemotePCAPRelease|x86 :  /var/lib/jenkins/jobs/ANONdroidVPN-snapshot/workspace/app/.cxx/RelWithDebInfo/16g6n3y1/x86/CMakeFiles/CMakeTmp/CMakeLists.txt:2 (project)

> Task :app:buildCMakeRelWithDebInfo[x86]-2

> Task :app:configureCMakeRelWithDebInfo[x86_64]-2
C/C++: withRemotePCAPRelease|x86_64 :CMake Warning (dev) in CMakeLists.txt:
C/C++: withRemotePCAPRelease|x86_64 :  No project() command is present.  The top-level CMakeLists.txt file must
C/C++: withRemotePCAPRelease|x86_64 :  contain a literal, direct call to the project() command.  Add a line of
C/C++: withRemotePCAPRelease|x86_64 :  code such as
C/C++: withRemotePCAPRelease|x86_64 :    project(ProjectName)
C/C++: withRemotePCAPRelease|x86_64 :  near the top of the file, but after cmake_minimum_required().
C/C++: withRemotePCAPRelease|x86_64 :  CMake is pretending there is a "project(Project)" command on the first
C/C++: withRemotePCAPRelease|x86_64 :  line.
C/C++: withRemotePCAPRelease|x86_64 :This warning is for project developers.  Use -Wno-dev to suppress it.
C/C++: withRemotePCAPRelease|x86_64 :CMake Warning at /opt/android-sdk-linux/ndk/24.0.8215888/build/cmake/android-legacy.toolchain.cmake:415 (message):
C/C++: withRemotePCAPRelease|x86_64 :  An old version of CMake is being used that cannot automatically detect
C/C++: withRemotePCAPRelease|x86_64 :  compiler attributes.  Compiler identification is being bypassed.  Some
C/C++: withRemotePCAPRelease|x86_64 :  values may be wrong or missing.  Update to CMake 3.19 or newer to use
C/C++: withRemotePCAPRelease|x86_64 :  CMake's built-in compiler identification.
C/C++: withRemotePCAPRelease|x86_64 :Call Stack (most recent call first):
C/C++: withRemotePCAPRelease|x86_64 :  /opt/android-sdk-linux/ndk/24.0.8215888/build/cmake/android.toolchain.cmake:54 (include)
C/C++: withRemotePCAPRelease|x86_64 :  /mnt/sdd1/opt/android-sdk-linux/cmake/3.18.1/share/cmake-3.18/Modules/CMakeDetermineSystem.cmake:93 (include)
C/C++: withRemotePCAPRelease|x86_64 :CMake Warning at /opt/android-sdk-linux/ndk/24.0.8215888/build/cmake/android-legacy.toolchain.cmake:415 (message):
C/C++: withRemotePCAPRelease|x86_64 :  An old version of CMake is being used that cannot automatically detect
C/C++: withRemotePCAPRelease|x86_64 :  compiler attributes.  Compiler identification is being bypassed.  Some
C/C++: withRemotePCAPRelease|x86_64 :  values may be wrong or missing.  Update to CMake 3.19 or newer to use
C/C++: withRemotePCAPRelease|x86_64 :  CMake's built-in compiler identification.
C/C++: withRemotePCAPRelease|x86_64 :Call Stack (most recent call first):
C/C++: withRemotePCAPRelease|x86_64 :  /opt/android-sdk-linux/ndk/24.0.8215888/build/cmake/android.toolchain.cmake:54 (include)
C/C++: withRemotePCAPRelease|x86_64 :  /var/lib/jenkins/jobs/ANONdroidVPN-snapshot/workspace/app/.cxx/RelWithDebInfo/16g6n3y1/x86_64/CMakeFiles/3.18.1-g262b901/CMakeSystem.cmake:6 (include)
C/C++: withRemotePCAPRelease|x86_64 :  /var/lib/jenkins/jobs/ANONdroidVPN-snapshot/workspace/app/.cxx/RelWithDebInfo/16g6n3y1/x86_64/CMakeFiles/CMakeTmp/CMakeLists.txt:2 (project)
C/C++: withRemotePCAPRelease|x86_64 :CMake Warning at /opt/android-sdk-linux/ndk/24.0.8215888/build/cmake/android-legacy.toolchain.cmake:415 (message):
C/C++: withRemotePCAPRelease|x86_64 :  An old version of CMake is being used that cannot automatically detect
C/C++: withRemotePCAPRelease|x86_64 :  compiler attributes.  Compiler identification is being bypassed.  Some
C/C++: withRemotePCAPRelease|x86_64 :  values may be wrong or missing.  Update to CMake 3.19 or newer to use
C/C++: withRemotePCAPRelease|x86_64 :  CMake's built-in compiler identification.
C/C++: withRemotePCAPRelease|x86_64 :Call Stack (most recent call first):
C/C++: withRemotePCAPRelease|x86_64 :  /opt/android-sdk-linux/ndk/24.0.8215888/build/cmake/android.toolchain.cmake:54 (include)
C/C++: withRemotePCAPRelease|x86_64 :  /var/lib/jenkins/jobs/ANONdroidVPN-snapshot/workspace/app/.cxx/RelWithDebInfo/16g6n3y1/x86_64/CMakeFiles/3.18.1-g262b901/CMakeSystem.cmake:6 (include)
C/C++: withRemotePCAPRelease|x86_64 :  /var/lib/jenkins/jobs/ANONdroidVPN-snapshot/workspace/app/.cxx/RelWithDebInfo/16g6n3y1/x86_64/CMakeFiles/CMakeTmp/CMakeLists.txt:2 (project)

> Task :app:buildCMakeRelWithDebInfo[x86_64]-2
> Task :app:externalNativeBuildWithRemotePCAPRelease
> Task :app:mergeWithRemotePCAPReleaseJniLibFolders
> Task :app:mergeWithRemotePCAPReleaseNativeLibs
> Task :app:stripWithRemotePCAPReleaseDebugSymbols
> Task :app:processWithRemotePCAPReleaseManifestForPackage
> Task :app:extractWithRemotePCAPReleaseNativeSymbolTables
> Task :app:checkWithRemotePCAPReleaseDuplicateClasses
> Task :app:mergeWithRemotePCAPReleaseNativeDebugMetadata
> Task :app:desugarWithRemotePCAPReleaseFileDependencies
> Task :app:processWithRemotePCAPReleaseResources
> Task :app:mergeExtDexWithRemotePCAPRelease
> Task :app:compileNoRemotePCAPReleaseArtProfile

> Task :app:compileWithRemotePCAPReleaseJavaWithJavac
/var/lib/jenkins/jobs/ANONdroidVPN-snapshot/workspace/app/src/main/java/anonvpn/anon_next/android/util/AndroidResourceLoaderHelper.java:91: warning: [unchecked] unchecked call to put(K,V) as a member of the raw type Hashtable
														a_loadedResources.put(entry, object);
														                     ^
  where K,V are type-variables:
    K extends Object declared in class Hashtable
    V extends Object declared in class Hashtable
/var/lib/jenkins/jobs/ANONdroidVPN-snapshot/workspace/app/src/withRemotePCAP/java/wiresharksshdumpserver/WiresharkSSHdumpServer.java:65: warning: [unchecked] unchecked conversion
			return (List) NamedFactory.setUpBuiltinFactories(ignoreUnsupported, DEFAULT_COMPRESSION_FACTORIES);
			       ^
  required: List<NamedFactory<Compression>>
  found:    List
/var/lib/jenkins/jobs/ANONdroidVPN-snapshot/workspace/app/src/withRemotePCAP/java/wiresharksshdumpserver/WiresharkSSHdumpServer.java:94: warning: [unchecked] unchecked conversion
       return (List) NamedFactory.setUpBuiltinFactories(ignoreUnsupported, DEFAULT_SIGNATURE_PREFERENCE);
              ^
  required: List<NamedFactory<Signature>>
  found:    List
Note: Some input files use or override a deprecated API.
Note: Recompile with -Xlint:deprecation for details.
3 warnings

> Task :app:dexBuilderWithRemotePCAPRelease
> Task :app:mergeWithRemotePCAPReleaseArtProfile
> Task :app:packageNoRemotePCAPRelease FAILED
> Task :app:lintVitalAnalyzeWithRemotePCAPRelease

FAILURE: Build failed with an exception.

* What went wrong:
Execution failed for task ':app:packageNoRemotePCAPRelease'.
> A failure occurred while executing com.android.build.gradle.tasks.PackageAndroidArtifact$IncrementalSplitterRunnable
   > SigningConfig "JAPTeam_release" is missing required property "storeFile".

* Try:
> Run with --stacktrace option to get the stack trace.
> Run with --info or --debug option to get more log output.
> Run with --scan to get full insights.

* Get more help at https://help.gradle.org

Deprecated Gradle features were used in this build, making it incompatible with Gradle 8.0.

You can use '--warning-mode all' to show the individual deprecation warnings and determine if they come from your own scripts or plugins.

See https://docs.gradle.org/7.4.2/userguide/command_line_interface.html#sec:command_line_warnings

BUILD FAILED in 3m 58s
80 actionable tasks: 80 executed
Build step 'Gradle ausführen' changed build result to FAILURE
Build step 'Gradle ausführen' marked build as failure
Finished: FAILURE