Console Output

Gestartet durch vorgelagertes Projekt „ANONVPNlib“, Build 5
Ursprünglich gestartet durch:
 Build wurde durch eine SCM-Änderung ausgelöst.
[EnvInject] - Loading node environment variables.
Baue in Arbeitsbereich /var/lib/jenkins/jobs/ANONVPNlib/workspace/MAVEN_PROFILE/anon-cc-dev-android
Cleaning local Directory .
Checking out https://anon.inf.tu-dresden.de/svn/ANONVPNlib/ANONVPNlib/trunk at revision '2017-10-04T17:49:08.537 +0200'
A         src
A         src/main
A         src/main/java
A         src/main/java/anonvpn
A         src/main/java/anonvpn/anon_next
A         src/main/java/anonvpn/anon_next/core
A         src/main/java/anonvpn/anon_next/core/entities
A         src/main/java/anonvpn/anon_next/core/entities/IPv4Packet.java
A         src/main/java/anonvpn/anon_next/core/gui
A         src/main/java/anonvpn/anon_next/core/gui/IVPNInterface.java
A         src/main/java/anonvpn/anon_next/core/gui/IVPNInterfaceFactory.java
A         src/main/java/anonvpn/anon_next/core/networking
A         src/main/java/anonvpn/anon_next/core/networking/TcpSocks
A         src/main/java/anonvpn/anon_next/core/networking/TcpSocks/AnonTcpChannelDummy.java
A         src/main/java/anonvpn/anon_next/core/networking/TcpSocks/BitUtils.java
A         src/main/java/anonvpn/anon_next/core/networking/TcpSocks/DNSResolver.java
A         src/main/java/anonvpn/anon_next/core/networking/TcpSocks/Packet.java
A         src/main/java/anonvpn/anon_next/core/networking/TcpSocks/TcpStream.java
A         src/main/java/anonvpn/anon_next/core/networking/TcpSocks/TcpStreamManager.java
A         src/main/java/anonvpn/anon_next/core/networking/TcpSocks/UdpStream.java
A         src/main/java/anonvpn/anon_next/core/networking/TcpSocks/UdpStreamManager.java
A         src/main/java/anonvpn/anon_next/core/networking/TcpSocks/UdpTimer.java
A         src/main/java/anonvpn/anon_next/core/networking/IInternetSocket.java
A         src/main/java/anonvpn/anon_next/core/networking/INetworkFactory.java
A         src/main/java/anonvpn/anon_next/core/networking/ITunneling.java
A         src/main/java/anonvpn/anon_next/core/networking/ReceiverThread.java
A         src/main/java/anonvpn/anon_next/core/networking/RegularHTTPClientSocketFactory.java
A         src/main/java/anonvpn/anon_next/core/networking/SenderThread.java
A         src/main/java/anonvpn/anon_next/core/notification
A         src/main/java/anonvpn/anon_next/core/notification/Event.java
A         src/main/java/anonvpn/anon_next/core/notification/Notification.java
A         src/main/java/anonvpn/anon_next/core/notification/NotificationDispatcher.java
A         src/main/java/anonvpn/anon_next/core/notification/Observer.java
A         src/main/java/anonvpn/anon_next/core/persistence
A         src/main/java/anonvpn/anon_next/core/persistence/IConfig.java
A         src/main/java/anonvpn/anon_next/core/persistence/IPersistenceFactory.java
A         src/main/java/anonvpn/anon_next/core/ANONVPNService.java
A         src/main/java/anonvpn/anon_next/core/CascadeConnectionManager.java
A         src/main/java/anonvpn/anon_next/core/CoreBuildConfig.java
A         src/main/java/anonvpn/anon_next/core/InfoService.java
A         src/main/java/anonvpn/anon_next/core/Statistics.java
A         src/test
A         src/test/java
A         src/test/java/anonvpn
A         src/test/java/anonvpn/anon_next
A         src/test/java/anonvpn/anon_next/networking
A         src/test/java/anonvpn/anon_next/networking/mocks
A         src/test/java/anonvpn/anon_next/networking/mocks/TestConfig.java
A         src/test/java/anonvpn/anon_next/networking/mocks/TestHTTPClientSocketFactory.java
A         src/test/java/anonvpn/anon_next/networking/mocks/TestInternetSocket.java
A         src/test/java/anonvpn/anon_next/networking/mocks/TestNetworkFactory.java
A         src/test/java/anonvpn/anon_next/networking/mocks/TestSocket.java
A         src/test/java/anonvpn/anon_next/networking/mocks/TestTunnelingInterface.java
A         src/test/java/anonvpn/anon_next/networking/mocks/TestVPNInterface.java
A         src/test/java/anonvpn/anon_next/networking/mocks/TestVPNInterfaceFactory.java
A         src/test/java/anonvpn/anon_next/networking/ANONVPNServiceTest.java
A         src/test/java/anonvpn/anon_next/networking/CascadeConnectionManagerTest.java
A         src/test/java/anonvpn/anon_next/networking/InfoServiceTest.java
A         src/test/java/anonvpn/anon_next/networking/SenderThreadTest.java
A         .classpath
A         .project
A         pom.xml
 U        .
At revision 10
[anon-cc-dev-android] $ /opt/maven/bin/mvn -DMAVEN_PROFILE=anon-cc-dev-android -Panon-cc-dev-android deploy
[INFO] Scanning for projects...
[INFO]                                                                         
[INFO] ------------------------------------------------------------------------
[INFO] Building ANONVPNlib 00.01.001-SNAPSHOT
[INFO] ------------------------------------------------------------------------
Downloading: http://svn.jondos.de/maven/repos/anon/BouncyCastleLightForAN.ON/01.56.002-SNAPSHOT/maven-metadata.xml

[WARNING] Could not transfer metadata anon:BouncyCastleLightForAN.ON:01.56.002-SNAPSHOT/maven-metadata.xml from/to jondos.repos.http (http://svn.jondos.de/maven/repos): Connect to svn.jondos.de:80 [svn.jondos.de/78.129.167.102] failed: Verbindungsaufbau abgelehnt (Connection refused)
[WARNING] Failure to transfer anon:BouncyCastleLightForAN.ON:01.56.002-SNAPSHOT/maven-metadata.xml from http://svn.jondos.de/maven/repos was cached in the local repository, resolution will not be reattempted until the update interval of jondos.repos.http has elapsed or updates are forced. Original error: Could not transfer metadata anon:BouncyCastleLightForAN.ON:01.56.002-SNAPSHOT/maven-metadata.xml from/to jondos.repos.http (http://svn.jondos.de/maven/repos): Connect to svn.jondos.de:80 [svn.jondos.de/78.129.167.102] failed: Verbindungsaufbau abgelehnt (Connection refused)
Downloading: http://svn.jondos.de/maven/repos/anon/HTTPClient/00.04.013-SNAPSHOT/maven-metadata.xml

[WARNING] Could not transfer metadata anon:HTTPClient:00.04.013-SNAPSHOT/maven-metadata.xml from/to jondos.repos.http (http://svn.jondos.de/maven/repos): Connect to svn.jondos.de:80 [svn.jondos.de/78.129.167.102] failed: Verbindungsaufbau abgelehnt (Connection refused)
[WARNING] Failure to transfer anon:HTTPClient:00.04.013-SNAPSHOT/maven-metadata.xml from http://svn.jondos.de/maven/repos was cached in the local repository, resolution will not be reattempted until the update interval of jondos.repos.http has elapsed or updates are forced. Original error: Could not transfer metadata anon:HTTPClient:00.04.013-SNAPSHOT/maven-metadata.xml from/to jondos.repos.http (http://svn.jondos.de/maven/repos): Connect to svn.jondos.de:80 [svn.jondos.de/78.129.167.102] failed: Verbindungsaufbau abgelehnt (Connection refused)
Downloading: http://svn.jondos.de/maven/repos/anon/SkypeForANON/0.0.13-SNAPSHOT/maven-metadata.xml

[WARNING] Could not transfer metadata anon:SkypeForANON:0.0.13-SNAPSHOT/maven-metadata.xml from/to jondos.repos.http (http://svn.jondos.de/maven/repos): Connect to svn.jondos.de:80 [svn.jondos.de/78.129.167.102] failed: Verbindungsaufbau abgelehnt (Connection refused)
[WARNING] Failure to transfer anon:SkypeForANON:0.0.13-SNAPSHOT/maven-metadata.xml from http://svn.jondos.de/maven/repos was cached in the local repository, resolution will not be reattempted until the update interval of jondos.repos.http has elapsed or updates are forced. Original error: Could not transfer metadata anon:SkypeForANON:0.0.13-SNAPSHOT/maven-metadata.xml from/to jondos.repos.http (http://svn.jondos.de/maven/repos): Connect to svn.jondos.de:80 [svn.jondos.de/78.129.167.102] failed: Verbindungsaufbau abgelehnt (Connection refused)
Downloading: http://svn.jondos.de/maven/repos/anon/ApacheFTPClient/0.0.2-SNAPSHOT/maven-metadata.xml

[WARNING] Could not transfer metadata anon:ApacheFTPClient:0.0.2-SNAPSHOT/maven-metadata.xml from/to jondos.repos.http (http://svn.jondos.de/maven/repos): Connect to svn.jondos.de:80 [svn.jondos.de/78.129.167.102] failed: Verbindungsaufbau abgelehnt (Connection refused)
[WARNING] Failure to transfer anon:ApacheFTPClient:0.0.2-SNAPSHOT/maven-metadata.xml from http://svn.jondos.de/maven/repos was cached in the local repository, resolution will not be reattempted until the update interval of jondos.repos.http has elapsed or updates are forced. Original error: Could not transfer metadata anon:ApacheFTPClient:0.0.2-SNAPSHOT/maven-metadata.xml from/to jondos.repos.http (http://svn.jondos.de/maven/repos): Connect to svn.jondos.de:80 [svn.jondos.de/78.129.167.102] failed: Verbindungsaufbau abgelehnt (Connection refused)
Downloading: http://svn.jondos.de/maven/repos/anon/logging/0.1.9-SNAPSHOT/maven-metadata.xml

[WARNING] Could not transfer metadata anon:logging:0.1.9-SNAPSHOT/maven-metadata.xml from/to jondos.repos.http (http://svn.jondos.de/maven/repos): Connect to svn.jondos.de:80 [svn.jondos.de/78.129.167.102] failed: Verbindungsaufbau abgelehnt (Connection refused)
[WARNING] Failure to transfer anon:logging:0.1.9-SNAPSHOT/maven-metadata.xml from http://svn.jondos.de/maven/repos was cached in the local repository, resolution will not be reattempted until the update interval of jondos.repos.http has elapsed or updates are forced. Original error: Could not transfer metadata anon:logging:0.1.9-SNAPSHOT/maven-metadata.xml from/to jondos.repos.http (http://svn.jondos.de/maven/repos): Connect to svn.jondos.de:80 [svn.jondos.de/78.129.167.102] failed: Verbindungsaufbau abgelehnt (Connection refused)
Downloading: http://svn.jondos.de/maven/repos/anon/log4jForANON/0.0.4-SNAPSHOT/maven-metadata.xml

[WARNING] Could not transfer metadata anon:log4jForANON:0.0.4-SNAPSHOT/maven-metadata.xml from/to jondos.repos.http (http://svn.jondos.de/maven/repos): Connect to svn.jondos.de:80 [svn.jondos.de/78.129.167.102] failed: Verbindungsaufbau abgelehnt (Connection refused)
[WARNING] Failure to transfer anon:log4jForANON:0.0.4-SNAPSHOT/maven-metadata.xml from http://svn.jondos.de/maven/repos was cached in the local repository, resolution will not be reattempted until the update interval of jondos.repos.http has elapsed or updates are forced. Original error: Could not transfer metadata anon:log4jForANON:0.0.4-SNAPSHOT/maven-metadata.xml from/to jondos.repos.http (http://svn.jondos.de/maven/repos): Connect to svn.jondos.de:80 [svn.jondos.de/78.129.167.102] failed: Verbindungsaufbau abgelehnt (Connection refused)
[INFO] 
[INFO] --- maven-resources-plugin:2.6:resources (default-resources) @ ANONVPNlib ---
[WARNING] Using platform encoding (UTF-8 actually) to copy filtered resources, i.e. build is platform dependent!
[INFO] skip non existing resourceDirectory /var/lib/jenkins/jobs/ANONVPNlib/workspace/MAVEN_PROFILE/anon-cc-dev-android/src/main/resources
[INFO] 
[INFO] --- maven-compiler-plugin:3.1:compile (default-compile) @ ANONVPNlib ---
[INFO] Changes detected - recompiling the module!
[WARNING] File encoding has not been set, using platform encoding UTF-8, i.e. build is platform dependent!
[INFO] Compiling 29 source files to /var/lib/jenkins/jobs/ANONVPNlib/workspace/MAVEN_PROFILE/anon-cc-dev-android/target/classes
[INFO] 
[INFO] --- maven-resources-plugin:2.6:testResources (default-testResources) @ ANONVPNlib ---
[WARNING] Using platform encoding (UTF-8 actually) to copy filtered resources, i.e. build is platform dependent!
[INFO] skip non existing resourceDirectory /var/lib/jenkins/jobs/ANONVPNlib/workspace/MAVEN_PROFILE/anon-cc-dev-android/src/test/resources
[INFO] 
[INFO] --- maven-compiler-plugin:3.1:testCompile (default-testCompile) @ ANONVPNlib ---
[INFO] Changes detected - recompiling the module!
[WARNING] File encoding has not been set, using platform encoding UTF-8, i.e. build is platform dependent!
[INFO] Compiling 12 source files to /var/lib/jenkins/jobs/ANONVPNlib/workspace/MAVEN_PROFILE/anon-cc-dev-android/target/test-classes
[INFO] -------------------------------------------------------------
[WARNING] COMPILATION WARNING : 
[INFO] -------------------------------------------------------------
[WARNING] /var/lib/jenkins/jobs/ANONVPNlib/workspace/MAVEN_PROFILE/anon-cc-dev-android/src/test/java/anonvpn/anon_next/networking/CascadeConnectionManagerTest.java: /var/lib/jenkins/jobs/ANONVPNlib/workspace/MAVEN_PROFILE/anon-cc-dev-android/src/test/java/anonvpn/anon_next/networking/CascadeConnectionManagerTest.java uses or overrides a deprecated API.
[WARNING] /var/lib/jenkins/jobs/ANONVPNlib/workspace/MAVEN_PROFILE/anon-cc-dev-android/src/test/java/anonvpn/anon_next/networking/CascadeConnectionManagerTest.java: Recompile with -Xlint:deprecation for details.
[INFO] 2 warnings 
[INFO] -------------------------------------------------------------
[INFO] -------------------------------------------------------------
[ERROR] COMPILATION ERROR : 
[INFO] -------------------------------------------------------------
[ERROR] /var/lib/jenkins/jobs/ANONVPNlib/workspace/MAVEN_PROFILE/anon-cc-dev-android/src/test/java/anonvpn/anon_next/networking/mocks/TestNetworkFactory.java:[3,36] cannot find symbol
  symbol:   class IInternetSocket
  location: package anonvpn.anon_next.networking
[ERROR] /var/lib/jenkins/jobs/ANONVPNlib/workspace/MAVEN_PROFILE/anon-cc-dev-android/src/test/java/anonvpn/anon_next/networking/mocks/TestNetworkFactory.java:[4,36] cannot find symbol
  symbol:   class INetworkFactory
  location: package anonvpn.anon_next.networking
[ERROR] /var/lib/jenkins/jobs/ANONVPNlib/workspace/MAVEN_PROFILE/anon-cc-dev-android/src/test/java/anonvpn/anon_next/networking/mocks/TestNetworkFactory.java:[5,36] cannot find symbol
  symbol:   class ITunneling
  location: package anonvpn.anon_next.networking
[ERROR] /var/lib/jenkins/jobs/ANONVPNlib/workspace/MAVEN_PROFILE/anon-cc-dev-android/src/test/java/anonvpn/anon_next/networking/mocks/TestNetworkFactory.java:[11,44] cannot find symbol
  symbol: class INetworkFactory
[ERROR] /var/lib/jenkins/jobs/ANONVPNlib/workspace/MAVEN_PROFILE/anon-cc-dev-android/src/test/java/anonvpn/anon_next/networking/mocks/TestTunnelingInterface.java:[5,34] package anonvpn.anon_next.entities does not exist
[ERROR] /var/lib/jenkins/jobs/ANONVPNlib/workspace/MAVEN_PROFILE/anon-cc-dev-android/src/test/java/anonvpn/anon_next/networking/mocks/TestTunnelingInterface.java:[6,36] cannot find symbol
  symbol:   class ITunneling
  location: package anonvpn.anon_next.networking
[ERROR] /var/lib/jenkins/jobs/ANONVPNlib/workspace/MAVEN_PROFILE/anon-cc-dev-android/src/test/java/anonvpn/anon_next/networking/mocks/TestTunnelingInterface.java:[12,48] cannot find symbol
  symbol: class ITunneling
[ERROR] /var/lib/jenkins/jobs/ANONVPNlib/workspace/MAVEN_PROFILE/anon-cc-dev-android/src/test/java/anonvpn/anon_next/networking/mocks/TestInternetSocket.java:[8,36] cannot find symbol
  symbol:   class IInternetSocket
  location: package anonvpn.anon_next.networking
[ERROR] /var/lib/jenkins/jobs/ANONVPNlib/workspace/MAVEN_PROFILE/anon-cc-dev-android/src/test/java/anonvpn/anon_next/networking/mocks/TestInternetSocket.java:[14,44] cannot find symbol
  symbol: class IInternetSocket
[ERROR] /var/lib/jenkins/jobs/ANONVPNlib/workspace/MAVEN_PROFILE/anon-cc-dev-android/src/test/java/anonvpn/anon_next/networking/mocks/TestNetworkFactory.java:[23,12] cannot find symbol
  symbol:   class ITunneling
  location: class anonvpn.anon_next.networking.mocks.TestNetworkFactory
[ERROR] /var/lib/jenkins/jobs/ANONVPNlib/workspace/MAVEN_PROFILE/anon-cc-dev-android/src/test/java/anonvpn/anon_next/networking/mocks/TestNetworkFactory.java:[28,12] cannot find symbol
  symbol:   class IInternetSocket
  location: class anonvpn.anon_next.networking.mocks.TestNetworkFactory
[ERROR] /var/lib/jenkins/jobs/ANONVPNlib/workspace/MAVEN_PROFILE/anon-cc-dev-android/src/test/java/anonvpn/anon_next/networking/mocks/TestTunnelingInterface.java:[15,29] cannot find symbol
  symbol:   class IPv4Packet
  location: class anonvpn.anon_next.networking.mocks.TestTunnelingInterface
[ERROR] /var/lib/jenkins/jobs/ANONVPNlib/workspace/MAVEN_PROFILE/anon-cc-dev-android/src/test/java/anonvpn/anon_next/networking/mocks/TestTunnelingInterface.java:[25,12] cannot find symbol
  symbol:   class IPv4Packet
  location: class anonvpn.anon_next.networking.mocks.TestTunnelingInterface
[ERROR] /var/lib/jenkins/jobs/ANONVPNlib/workspace/MAVEN_PROFILE/anon-cc-dev-android/src/test/java/anonvpn/anon_next/networking/mocks/TestConfig.java:[6,37] package anonvpn.anon_next.persistence does not exist
[ERROR] /var/lib/jenkins/jobs/ANONVPNlib/workspace/MAVEN_PROFILE/anon-cc-dev-android/src/test/java/anonvpn/anon_next/networking/mocks/TestConfig.java:[12,36] cannot find symbol
  symbol: class IConfig
[ERROR] /var/lib/jenkins/jobs/ANONVPNlib/workspace/MAVEN_PROFILE/anon-cc-dev-android/src/test/java/anonvpn/anon_next/networking/CascadeConnectionManagerTest.java:[23,25] cannot find symbol
  symbol:   class CascadeConnectionManager
  location: package anonvpn.anon_next
[ERROR] /var/lib/jenkins/jobs/ANONVPNlib/workspace/MAVEN_PROFILE/anon-cc-dev-android/src/test/java/anonvpn/anon_next/networking/CascadeConnectionManagerTest.java:[27,38] package anonvpn.anon_next.notification does not exist
[ERROR] /var/lib/jenkins/jobs/ANONVPNlib/workspace/MAVEN_PROFILE/anon-cc-dev-android/src/test/java/anonvpn/anon_next/networking/CascadeConnectionManagerTest.java:[28,38] package anonvpn.anon_next.notification does not exist
[ERROR] /var/lib/jenkins/jobs/ANONVPNlib/workspace/MAVEN_PROFILE/anon-cc-dev-android/src/test/java/anonvpn/anon_next/networking/CascadeConnectionManagerTest.java:[29,37] package anonvpn.anon_next.persistence does not exist
[ERROR] /var/lib/jenkins/jobs/ANONVPNlib/workspace/MAVEN_PROFILE/anon-cc-dev-android/src/test/java/anonvpn/anon_next/networking/CascadeConnectionManagerTest.java:[105,48] cannot find symbol
  symbol:   class CascadeConnectionManager
  location: class anonvpn.anon_next.networking.CascadeConnectionManagerTest
[ERROR] /var/lib/jenkins/jobs/ANONVPNlib/workspace/MAVEN_PROFILE/anon-cc-dev-android/src/test/java/anonvpn/anon_next/networking/CascadeConnectionManagerTest.java:[112,45] cannot find symbol
  symbol:   class NotificationDispatcher
  location: class anonvpn.anon_next.networking.CascadeConnectionManagerTest.TestCascadeConnectionManager
[ERROR] /var/lib/jenkins/jobs/ANONVPNlib/workspace/MAVEN_PROFILE/anon-cc-dev-android/src/test/java/anonvpn/anon_next/networking/CascadeConnectionManagerTest.java:[113,45] cannot find symbol
  symbol:   class INetworkFactory
  location: class anonvpn.anon_next.networking.CascadeConnectionManagerTest.TestCascadeConnectionManager
[ERROR] /var/lib/jenkins/jobs/ANONVPNlib/workspace/MAVEN_PROFILE/anon-cc-dev-android/src/test/java/anonvpn/anon_next/networking/CascadeConnectionManagerTest.java:[114,45] cannot find symbol
  symbol:   class IConfig
  location: class anonvpn.anon_next.networking.CascadeConnectionManagerTest.TestCascadeConnectionManager
[ERROR] /var/lib/jenkins/jobs/ANONVPNlib/workspace/MAVEN_PROFILE/anon-cc-dev-android/src/test/java/anonvpn/anon_next/networking/InfoServiceTest.java:[9,25] cannot find symbol
  symbol:   class InfoService
  location: package anonvpn.anon_next
[ERROR] /var/lib/jenkins/jobs/ANONVPNlib/workspace/MAVEN_PROFILE/anon-cc-dev-android/src/test/java/anonvpn/anon_next/networking/InfoServiceTest.java:[12,38] package anonvpn.anon_next.notification does not exist
[ERROR] /var/lib/jenkins/jobs/ANONVPNlib/workspace/MAVEN_PROFILE/anon-cc-dev-android/src/test/java/anonvpn/anon_next/networking/InfoServiceTest.java:[13,38] package anonvpn.anon_next.notification does not exist
[ERROR] /var/lib/jenkins/jobs/ANONVPNlib/workspace/MAVEN_PROFILE/anon-cc-dev-android/src/test/java/anonvpn/anon_next/networking/mocks/TestVPNInterface.java:[7,29] package anonvpn.anon_next.gui does not exist
[ERROR] /var/lib/jenkins/jobs/ANONVPNlib/workspace/MAVEN_PROFILE/anon-cc-dev-android/src/test/java/anonvpn/anon_next/networking/mocks/TestVPNInterface.java:[13,42] cannot find symbol
  symbol: class IVPNInterface
[ERROR] /var/lib/jenkins/jobs/ANONVPNlib/workspace/MAVEN_PROFILE/anon-cc-dev-android/src/test/java/anonvpn/anon_next/networking/mocks/TestVPNInterfaceFactory.java:[3,25] cannot find symbol
  symbol:   class InfoService
  location: package anonvpn.anon_next
[ERROR] /var/lib/jenkins/jobs/ANONVPNlib/workspace/MAVEN_PROFILE/anon-cc-dev-android/src/test/java/anonvpn/anon_next/networking/mocks/TestVPNInterfaceFactory.java:[4,29] package anonvpn.anon_next.gui does not exist
[ERROR] /var/lib/jenkins/jobs/ANONVPNlib/workspace/MAVEN_PROFILE/anon-cc-dev-android/src/test/java/anonvpn/anon_next/networking/mocks/TestVPNInterfaceFactory.java:[5,29] package anonvpn.anon_next.gui does not exist
[ERROR] /var/lib/jenkins/jobs/ANONVPNlib/workspace/MAVEN_PROFILE/anon-cc-dev-android/src/test/java/anonvpn/anon_next/networking/mocks/TestVPNInterfaceFactory.java:[6,38] package anonvpn.anon_next.notification does not exist
[ERROR] /var/lib/jenkins/jobs/ANONVPNlib/workspace/MAVEN_PROFILE/anon-cc-dev-android/src/test/java/anonvpn/anon_next/networking/mocks/TestVPNInterfaceFactory.java:[7,37] package anonvpn.anon_next.persistence does not exist
[ERROR] /var/lib/jenkins/jobs/ANONVPNlib/workspace/MAVEN_PROFILE/anon-cc-dev-android/src/test/java/anonvpn/anon_next/networking/mocks/TestVPNInterfaceFactory.java:[13,49] cannot find symbol
  symbol: class IVPNInterfaceFactory
[ERROR] /var/lib/jenkins/jobs/ANONVPNlib/workspace/MAVEN_PROFILE/anon-cc-dev-android/src/test/java/anonvpn/anon_next/networking/mocks/TestVPNInterfaceFactory.java:[22,42] cannot find symbol
  symbol:   class NotificationDispatcher
  location: class anonvpn.anon_next.networking.mocks.TestVPNInterfaceFactory
[ERROR] /var/lib/jenkins/jobs/ANONVPNlib/workspace/MAVEN_PROFILE/anon-cc-dev-android/src/test/java/anonvpn/anon_next/networking/mocks/TestVPNInterfaceFactory.java:[22,77] cannot find symbol
  symbol:   class IConfig
  location: class anonvpn.anon_next.networking.mocks.TestVPNInterfaceFactory
[ERROR] /var/lib/jenkins/jobs/ANONVPNlib/workspace/MAVEN_PROFILE/anon-cc-dev-android/src/test/java/anonvpn/anon_next/networking/mocks/TestVPNInterfaceFactory.java:[22,93] cannot find symbol
  symbol:   class InfoService
  location: class anonvpn.anon_next.networking.mocks.TestVPNInterfaceFactory
[ERROR] /var/lib/jenkins/jobs/ANONVPNlib/workspace/MAVEN_PROFILE/anon-cc-dev-android/src/test/java/anonvpn/anon_next/networking/mocks/TestVPNInterfaceFactory.java:[22,12] cannot find symbol
  symbol:   class IVPNInterface
  location: class anonvpn.anon_next.networking.mocks.TestVPNInterfaceFactory
[ERROR] /var/lib/jenkins/jobs/ANONVPNlib/workspace/MAVEN_PROFILE/anon-cc-dev-android/src/test/java/anonvpn/anon_next/networking/mocks/TestNetworkFactory.java:[22,5] method does not override or implement a method from a supertype
[ERROR] /var/lib/jenkins/jobs/ANONVPNlib/workspace/MAVEN_PROFILE/anon-cc-dev-android/src/test/java/anonvpn/anon_next/networking/mocks/TestNetworkFactory.java:[27,5] method does not override or implement a method from a supertype
[ERROR] /var/lib/jenkins/jobs/ANONVPNlib/workspace/MAVEN_PROFILE/anon-cc-dev-android/src/test/java/anonvpn/anon_next/networking/mocks/TestTunnelingInterface.java:[14,5] method does not override or implement a method from a supertype
[ERROR] /var/lib/jenkins/jobs/ANONVPNlib/workspace/MAVEN_PROFILE/anon-cc-dev-android/src/test/java/anonvpn/anon_next/networking/mocks/TestTunnelingInterface.java:[19,5] method does not override or implement a method from a supertype
[ERROR] /var/lib/jenkins/jobs/ANONVPNlib/workspace/MAVEN_PROFILE/anon-cc-dev-android/src/test/java/anonvpn/anon_next/networking/mocks/TestTunnelingInterface.java:[24,5] method does not override or implement a method from a supertype
[ERROR] /var/lib/jenkins/jobs/ANONVPNlib/workspace/MAVEN_PROFILE/anon-cc-dev-android/src/test/java/anonvpn/anon_next/networking/mocks/TestTunnelingInterface.java:[29,5] method does not override or implement a method from a supertype
[ERROR] /var/lib/jenkins/jobs/ANONVPNlib/workspace/MAVEN_PROFILE/anon-cc-dev-android/src/test/java/anonvpn/anon_next/networking/mocks/TestInternetSocket.java:[24,5] method does not override or implement a method from a supertype
[ERROR] /var/lib/jenkins/jobs/ANONVPNlib/workspace/MAVEN_PROFILE/anon-cc-dev-android/src/test/java/anonvpn/anon_next/networking/mocks/TestInternetSocket.java:[29,5] method does not override or implement a method from a supertype
[ERROR] /var/lib/jenkins/jobs/ANONVPNlib/workspace/MAVEN_PROFILE/anon-cc-dev-android/src/test/java/anonvpn/anon_next/networking/mocks/TestInternetSocket.java:[34,5] method does not override or implement a method from a supertype
[ERROR] /var/lib/jenkins/jobs/ANONVPNlib/workspace/MAVEN_PROFILE/anon-cc-dev-android/src/test/java/anonvpn/anon_next/networking/mocks/TestConfig.java:[19,5] method does not override or implement a method from a supertype
[ERROR] /var/lib/jenkins/jobs/ANONVPNlib/workspace/MAVEN_PROFILE/anon-cc-dev-android/src/test/java/anonvpn/anon_next/networking/mocks/TestConfig.java:[24,5] method does not override or implement a method from a supertype
[ERROR] /var/lib/jenkins/jobs/ANONVPNlib/workspace/MAVEN_PROFILE/anon-cc-dev-android/src/test/java/anonvpn/anon_next/networking/mocks/TestConfig.java:[29,5] method does not override or implement a method from a supertype
[ERROR] /var/lib/jenkins/jobs/ANONVPNlib/workspace/MAVEN_PROFILE/anon-cc-dev-android/src/test/java/anonvpn/anon_next/networking/mocks/TestConfig.java:[38,5] method does not override or implement a method from a supertype
[ERROR] /var/lib/jenkins/jobs/ANONVPNlib/workspace/MAVEN_PROFILE/anon-cc-dev-android/src/test/java/anonvpn/anon_next/networking/mocks/TestConfig.java:[47,5] method does not override or implement a method from a supertype
[ERROR] /var/lib/jenkins/jobs/ANONVPNlib/workspace/MAVEN_PROFILE/anon-cc-dev-android/src/test/java/anonvpn/anon_next/networking/mocks/TestConfig.java:[52,5] method does not override or implement a method from a supertype
[ERROR] /var/lib/jenkins/jobs/ANONVPNlib/workspace/MAVEN_PROFILE/anon-cc-dev-android/src/test/java/anonvpn/anon_next/networking/mocks/TestConfig.java:[57,5] method does not override or implement a method from a supertype
[ERROR] /var/lib/jenkins/jobs/ANONVPNlib/workspace/MAVEN_PROFILE/anon-cc-dev-android/src/test/java/anonvpn/anon_next/networking/mocks/TestConfig.java:[62,5] method does not override or implement a method from a supertype
[ERROR] /var/lib/jenkins/jobs/ANONVPNlib/workspace/MAVEN_PROFILE/anon-cc-dev-android/src/test/java/anonvpn/anon_next/networking/mocks/TestConfig.java:[67,5] method does not override or implement a method from a supertype
[ERROR] /var/lib/jenkins/jobs/ANONVPNlib/workspace/MAVEN_PROFILE/anon-cc-dev-android/src/test/java/anonvpn/anon_next/networking/mocks/TestConfig.java:[72,5] method does not override or implement a method from a supertype
[ERROR] /var/lib/jenkins/jobs/ANONVPNlib/workspace/MAVEN_PROFILE/anon-cc-dev-android/src/test/java/anonvpn/anon_next/networking/mocks/TestConfig.java:[77,5] method does not override or implement a method from a supertype
[ERROR] /var/lib/jenkins/jobs/ANONVPNlib/workspace/MAVEN_PROFILE/anon-cc-dev-android/src/test/java/anonvpn/anon_next/networking/mocks/TestConfig.java:[82,5] method does not override or implement a method from a supertype
[ERROR] /var/lib/jenkins/jobs/ANONVPNlib/workspace/MAVEN_PROFILE/anon-cc-dev-android/src/test/java/anonvpn/anon_next/networking/CascadeConnectionManagerTest.java:[119,9] method does not override or implement a method from a supertype
[ERROR] /var/lib/jenkins/jobs/ANONVPNlib/workspace/MAVEN_PROFILE/anon-cc-dev-android/src/test/java/anonvpn/anon_next/networking/CascadeConnectionManagerTest.java:[127,9] method does not override or implement a method from a supertype
[ERROR] /var/lib/jenkins/jobs/ANONVPNlib/workspace/MAVEN_PROFILE/anon-cc-dev-android/src/test/java/anonvpn/anon_next/networking/CascadeConnectionManagerTest.java:[132,9] method does not override or implement a method from a supertype
[ERROR] /var/lib/jenkins/jobs/ANONVPNlib/workspace/MAVEN_PROFILE/anon-cc-dev-android/src/test/java/anonvpn/anon_next/networking/CascadeConnectionManagerTest.java:[137,9] method does not override or implement a method from a supertype
[ERROR] /var/lib/jenkins/jobs/ANONVPNlib/workspace/MAVEN_PROFILE/anon-cc-dev-android/src/test/java/anonvpn/anon_next/networking/CascadeConnectionManagerTest.java:[142,9] method does not override or implement a method from a supertype
[ERROR] /var/lib/jenkins/jobs/ANONVPNlib/workspace/MAVEN_PROFILE/anon-cc-dev-android/src/test/java/anonvpn/anon_next/networking/CascadeConnectionManagerTest.java:[151,9] cannot find symbol
  symbol:   class NotificationDispatcher
  location: class anonvpn.anon_next.networking.CascadeConnectionManagerTest
[ERROR] /var/lib/jenkins/jobs/ANONVPNlib/workspace/MAVEN_PROFILE/anon-cc-dev-android/src/test/java/anonvpn/anon_next/networking/CascadeConnectionManagerTest.java:[151,51] cannot find symbol
  symbol:   class NotificationDispatcher
  location: class anonvpn.anon_next.networking.CascadeConnectionManagerTest
[ERROR] /var/lib/jenkins/jobs/ANONVPNlib/workspace/MAVEN_PROFILE/anon-cc-dev-android/src/test/java/anonvpn/anon_next/networking/CascadeConnectionManagerTest.java:[166,9] cannot find symbol
  symbol:   class INetworkFactory
  location: class anonvpn.anon_next.networking.CascadeConnectionManagerTest
[ERROR] /var/lib/jenkins/jobs/ANONVPNlib/workspace/MAVEN_PROFILE/anon-cc-dev-android/src/test/java/anonvpn/anon_next/networking/CascadeConnectionManagerTest.java:[204,9] cannot find symbol
  symbol:   class NotificationDispatcher
  location: class anonvpn.anon_next.networking.CascadeConnectionManagerTest
[ERROR] /var/lib/jenkins/jobs/ANONVPNlib/workspace/MAVEN_PROFILE/anon-cc-dev-android/src/test/java/anonvpn/anon_next/networking/CascadeConnectionManagerTest.java:[204,51] cannot find symbol
  symbol:   class NotificationDispatcher
  location: class anonvpn.anon_next.networking.CascadeConnectionManagerTest
[ERROR] /var/lib/jenkins/jobs/ANONVPNlib/workspace/MAVEN_PROFILE/anon-cc-dev-android/src/test/java/anonvpn/anon_next/networking/CascadeConnectionManagerTest.java:[219,9] cannot find symbol
  symbol:   class INetworkFactory
  location: class anonvpn.anon_next.networking.CascadeConnectionManagerTest
[ERROR] /var/lib/jenkins/jobs/ANONVPNlib/workspace/MAVEN_PROFILE/anon-cc-dev-android/src/test/java/anonvpn/anon_next/networking/CascadeConnectionManagerTest.java:[242,30] cannot find symbol
  symbol:   method connectionEstablished(anon.infoservice.MixCascade)
  location: variable connectionManager of type anonvpn.anon_next.networking.CascadeConnectionManagerTest.TestCascadeConnectionManager
[ERROR] /var/lib/jenkins/jobs/ANONVPNlib/workspace/MAVEN_PROFILE/anon-cc-dev-android/src/test/java/anonvpn/anon_next/networking/CascadeConnectionManagerTest.java:[248,33] cannot find symbol
  symbol:   variable Event
  location: class anonvpn.anon_next.networking.CascadeConnectionManagerTest
[ERROR] /var/lib/jenkins/jobs/ANONVPNlib/workspace/MAVEN_PROFILE/anon-cc-dev-android/src/test/java/anonvpn/anon_next/networking/InfoServiceTest.java:[24,9] cannot find symbol
  symbol:   class NotificationDispatcher
  location: class anonvpn.anon_next.networking.InfoServiceTest
[ERROR] /var/lib/jenkins/jobs/ANONVPNlib/workspace/MAVEN_PROFILE/anon-cc-dev-android/src/test/java/anonvpn/anon_next/networking/InfoServiceTest.java:[24,49] cannot find symbol
  symbol:   class NotificationDispatcher
  location: class anonvpn.anon_next.networking.InfoServiceTest
[ERROR] /var/lib/jenkins/jobs/ANONVPNlib/workspace/MAVEN_PROFILE/anon-cc-dev-android/src/test/java/anonvpn/anon_next/networking/InfoServiceTest.java:[30,9] cannot find symbol
  symbol:   class InfoService
  location: class anonvpn.anon_next.networking.InfoServiceTest
[ERROR] /var/lib/jenkins/jobs/ANONVPNlib/workspace/MAVEN_PROFILE/anon-cc-dev-android/src/test/java/anonvpn/anon_next/networking/InfoServiceTest.java:[30,39] cannot find symbol
  symbol:   class InfoService
  location: class anonvpn.anon_next.networking.InfoServiceTest
[ERROR] /var/lib/jenkins/jobs/ANONVPNlib/workspace/MAVEN_PROFILE/anon-cc-dev-android/src/test/java/anonvpn/anon_next/networking/InfoServiceTest.java:[41,27] cannot find symbol
  symbol:   variable Event
  location: class anonvpn.anon_next.networking.InfoServiceTest
[ERROR] /var/lib/jenkins/jobs/ANONVPNlib/workspace/MAVEN_PROFILE/anon-cc-dev-android/src/test/java/anonvpn/anon_next/networking/InfoServiceTest.java:[42,27] cannot find symbol
  symbol:   variable Event
  location: class anonvpn.anon_next.networking.InfoServiceTest
[ERROR] /var/lib/jenkins/jobs/ANONVPNlib/workspace/MAVEN_PROFILE/anon-cc-dev-android/src/test/java/anonvpn/anon_next/networking/InfoServiceTest.java:[52,9] cannot find symbol
  symbol:   class NotificationDispatcher
  location: class anonvpn.anon_next.networking.InfoServiceTest
[ERROR] /var/lib/jenkins/jobs/ANONVPNlib/workspace/MAVEN_PROFILE/anon-cc-dev-android/src/test/java/anonvpn/anon_next/networking/InfoServiceTest.java:[52,49] cannot find symbol
  symbol:   class NotificationDispatcher
  location: class anonvpn.anon_next.networking.InfoServiceTest
[ERROR] /var/lib/jenkins/jobs/ANONVPNlib/workspace/MAVEN_PROFILE/anon-cc-dev-android/src/test/java/anonvpn/anon_next/networking/InfoServiceTest.java:[58,9] cannot find symbol
  symbol:   class InfoService
  location: class anonvpn.anon_next.networking.InfoServiceTest
[ERROR] /var/lib/jenkins/jobs/ANONVPNlib/workspace/MAVEN_PROFILE/anon-cc-dev-android/src/test/java/anonvpn/anon_next/networking/InfoServiceTest.java:[58,39] cannot find symbol
  symbol:   class InfoService
  location: class anonvpn.anon_next.networking.InfoServiceTest
[ERROR] /var/lib/jenkins/jobs/ANONVPNlib/workspace/MAVEN_PROFILE/anon-cc-dev-android/src/test/java/anonvpn/anon_next/networking/InfoServiceTest.java:[63,27] cannot find symbol
  symbol:   variable Event
  location: class anonvpn.anon_next.networking.InfoServiceTest
[ERROR] /var/lib/jenkins/jobs/ANONVPNlib/workspace/MAVEN_PROFILE/anon-cc-dev-android/src/test/java/anonvpn/anon_next/networking/InfoServiceTest.java:[69,27] cannot find symbol
  symbol:   variable Event
  location: class anonvpn.anon_next.networking.InfoServiceTest
[ERROR] /var/lib/jenkins/jobs/ANONVPNlib/workspace/MAVEN_PROFILE/anon-cc-dev-android/src/test/java/anonvpn/anon_next/networking/InfoServiceTest.java:[75,27] cannot find symbol
  symbol:   variable Event
  location: class anonvpn.anon_next.networking.InfoServiceTest
[ERROR] /var/lib/jenkins/jobs/ANONVPNlib/workspace/MAVEN_PROFILE/anon-cc-dev-android/src/test/java/anonvpn/anon_next/networking/InfoServiceTest.java:[81,27] cannot find symbol
  symbol:   variable Event
  location: class anonvpn.anon_next.networking.InfoServiceTest
[ERROR] /var/lib/jenkins/jobs/ANONVPNlib/workspace/MAVEN_PROFILE/anon-cc-dev-android/src/test/java/anonvpn/anon_next/networking/mocks/TestVPNInterface.java:[21,5] method does not override or implement a method from a supertype
[ERROR] /var/lib/jenkins/jobs/ANONVPNlib/workspace/MAVEN_PROFILE/anon-cc-dev-android/src/test/java/anonvpn/anon_next/networking/mocks/TestVPNInterface.java:[26,5] method does not override or implement a method from a supertype
[ERROR] /var/lib/jenkins/jobs/ANONVPNlib/workspace/MAVEN_PROFILE/anon-cc-dev-android/src/test/java/anonvpn/anon_next/networking/mocks/TestVPNInterface.java:[31,5] method does not override or implement a method from a supertype
[ERROR] /var/lib/jenkins/jobs/ANONVPNlib/workspace/MAVEN_PROFILE/anon-cc-dev-android/src/test/java/anonvpn/anon_next/networking/mocks/TestVPNInterface.java:[36,5] method does not override or implement a method from a supertype
[ERROR] /var/lib/jenkins/jobs/ANONVPNlib/workspace/MAVEN_PROFILE/anon-cc-dev-android/src/test/java/anonvpn/anon_next/networking/mocks/TestVPNInterface.java:[42,5] method does not override or implement a method from a supertype
[ERROR] /var/lib/jenkins/jobs/ANONVPNlib/workspace/MAVEN_PROFILE/anon-cc-dev-android/src/test/java/anonvpn/anon_next/networking/mocks/TestVPNInterface.java:[47,5] method does not override or implement a method from a supertype
[ERROR] /var/lib/jenkins/jobs/ANONVPNlib/workspace/MAVEN_PROFILE/anon-cc-dev-android/src/test/java/anonvpn/anon_next/networking/mocks/TestVPNInterface.java:[52,5] method does not override or implement a method from a supertype
[ERROR] /var/lib/jenkins/jobs/ANONVPNlib/workspace/MAVEN_PROFILE/anon-cc-dev-android/src/test/java/anonvpn/anon_next/networking/mocks/TestVPNInterface.java:[57,5] method does not override or implement a method from a supertype
[ERROR] /var/lib/jenkins/jobs/ANONVPNlib/workspace/MAVEN_PROFILE/anon-cc-dev-android/src/test/java/anonvpn/anon_next/networking/mocks/TestVPNInterface.java:[62,5] method does not override or implement a method from a supertype
[ERROR] /var/lib/jenkins/jobs/ANONVPNlib/workspace/MAVEN_PROFILE/anon-cc-dev-android/src/test/java/anonvpn/anon_next/networking/mocks/TestVPNInterface.java:[67,5] method does not override or implement a method from a supertype
[ERROR] /var/lib/jenkins/jobs/ANONVPNlib/workspace/MAVEN_PROFILE/anon-cc-dev-android/src/test/java/anonvpn/anon_next/networking/mocks/TestVPNInterfaceFactory.java:[21,5] method does not override or implement a method from a supertype
[INFO] 97 errors 
[INFO] -------------------------------------------------------------
[INFO] ------------------------------------------------------------------------
[INFO] BUILD FAILURE
[INFO] ------------------------------------------------------------------------
[INFO] Total time: 6.600 s
[INFO] Finished at: 2017-10-04T17:49:33+02:00
[INFO] Final Memory: 16M/181M
[INFO] ------------------------------------------------------------------------
[ERROR] Failed to execute goal org.apache.maven.plugins:maven-compiler-plugin:3.1:testCompile (default-testCompile) on project ANONVPNlib: Compilation failure: Compilation failure:
[ERROR] /var/lib/jenkins/jobs/ANONVPNlib/workspace/MAVEN_PROFILE/anon-cc-dev-android/src/test/java/anonvpn/anon_next/networking/mocks/TestNetworkFactory.java:[3,36] cannot find symbol
[ERROR] symbol:   class IInternetSocket
[ERROR] location: package anonvpn.anon_next.networking
[ERROR] /var/lib/jenkins/jobs/ANONVPNlib/workspace/MAVEN_PROFILE/anon-cc-dev-android/src/test/java/anonvpn/anon_next/networking/mocks/TestNetworkFactory.java:[4,36] cannot find symbol
[ERROR] symbol:   class INetworkFactory
[ERROR] location: package anonvpn.anon_next.networking
[ERROR] /var/lib/jenkins/jobs/ANONVPNlib/workspace/MAVEN_PROFILE/anon-cc-dev-android/src/test/java/anonvpn/anon_next/networking/mocks/TestNetworkFactory.java:[5,36] cannot find symbol
[ERROR] symbol:   class ITunneling
[ERROR] location: package anonvpn.anon_next.networking
[ERROR] /var/lib/jenkins/jobs/ANONVPNlib/workspace/MAVEN_PROFILE/anon-cc-dev-android/src/test/java/anonvpn/anon_next/networking/mocks/TestNetworkFactory.java:[11,44] cannot find symbol
[ERROR] symbol: class INetworkFactory
[ERROR] /var/lib/jenkins/jobs/ANONVPNlib/workspace/MAVEN_PROFILE/anon-cc-dev-android/src/test/java/anonvpn/anon_next/networking/mocks/TestTunnelingInterface.java:[5,34] package anonvpn.anon_next.entities does not exist
[ERROR] /var/lib/jenkins/jobs/ANONVPNlib/workspace/MAVEN_PROFILE/anon-cc-dev-android/src/test/java/anonvpn/anon_next/networking/mocks/TestTunnelingInterface.java:[6,36] cannot find symbol
[ERROR] symbol:   class ITunneling
[ERROR] location: package anonvpn.anon_next.networking
[ERROR] /var/lib/jenkins/jobs/ANONVPNlib/workspace/MAVEN_PROFILE/anon-cc-dev-android/src/test/java/anonvpn/anon_next/networking/mocks/TestTunnelingInterface.java:[12,48] cannot find symbol
[ERROR] symbol: class ITunneling
[ERROR] /var/lib/jenkins/jobs/ANONVPNlib/workspace/MAVEN_PROFILE/anon-cc-dev-android/src/test/java/anonvpn/anon_next/networking/mocks/TestInternetSocket.java:[8,36] cannot find symbol
[ERROR] symbol:   class IInternetSocket
[ERROR] location: package anonvpn.anon_next.networking
[ERROR] /var/lib/jenkins/jobs/ANONVPNlib/workspace/MAVEN_PROFILE/anon-cc-dev-android/src/test/java/anonvpn/anon_next/networking/mocks/TestInternetSocket.java:[14,44] cannot find symbol
[ERROR] symbol: class IInternetSocket
[ERROR] /var/lib/jenkins/jobs/ANONVPNlib/workspace/MAVEN_PROFILE/anon-cc-dev-android/src/test/java/anonvpn/anon_next/networking/mocks/TestNetworkFactory.java:[23,12] cannot find symbol
[ERROR] symbol:   class ITunneling
[ERROR] location: class anonvpn.anon_next.networking.mocks.TestNetworkFactory
[ERROR] /var/lib/jenkins/jobs/ANONVPNlib/workspace/MAVEN_PROFILE/anon-cc-dev-android/src/test/java/anonvpn/anon_next/networking/mocks/TestNetworkFactory.java:[28,12] cannot find symbol
[ERROR] symbol:   class IInternetSocket
[ERROR] location: class anonvpn.anon_next.networking.mocks.TestNetworkFactory
[ERROR] /var/lib/jenkins/jobs/ANONVPNlib/workspace/MAVEN_PROFILE/anon-cc-dev-android/src/test/java/anonvpn/anon_next/networking/mocks/TestTunnelingInterface.java:[15,29] cannot find symbol
[ERROR] symbol:   class IPv4Packet
[ERROR] location: class anonvpn.anon_next.networking.mocks.TestTunnelingInterface
[ERROR] /var/lib/jenkins/jobs/ANONVPNlib/workspace/MAVEN_PROFILE/anon-cc-dev-android/src/test/java/anonvpn/anon_next/networking/mocks/TestTunnelingInterface.java:[25,12] cannot find symbol
[ERROR] symbol:   class IPv4Packet
[ERROR] location: class anonvpn.anon_next.networking.mocks.TestTunnelingInterface
[ERROR] /var/lib/jenkins/jobs/ANONVPNlib/workspace/MAVEN_PROFILE/anon-cc-dev-android/src/test/java/anonvpn/anon_next/networking/mocks/TestConfig.java:[6,37] package anonvpn.anon_next.persistence does not exist
[ERROR] /var/lib/jenkins/jobs/ANONVPNlib/workspace/MAVEN_PROFILE/anon-cc-dev-android/src/test/java/anonvpn/anon_next/networking/mocks/TestConfig.java:[12,36] cannot find symbol
[ERROR] symbol: class IConfig
[ERROR] /var/lib/jenkins/jobs/ANONVPNlib/workspace/MAVEN_PROFILE/anon-cc-dev-android/src/test/java/anonvpn/anon_next/networking/CascadeConnectionManagerTest.java:[23,25] cannot find symbol
[ERROR] symbol:   class CascadeConnectionManager
[ERROR] location: package anonvpn.anon_next
[ERROR] /var/lib/jenkins/jobs/ANONVPNlib/workspace/MAVEN_PROFILE/anon-cc-dev-android/src/test/java/anonvpn/anon_next/networking/CascadeConnectionManagerTest.java:[27,38] package anonvpn.anon_next.notification does not exist
[ERROR] /var/lib/jenkins/jobs/ANONVPNlib/workspace/MAVEN_PROFILE/anon-cc-dev-android/src/test/java/anonvpn/anon_next/networking/CascadeConnectionManagerTest.java:[28,38] package anonvpn.anon_next.notification does not exist
[ERROR] /var/lib/jenkins/jobs/ANONVPNlib/workspace/MAVEN_PROFILE/anon-cc-dev-android/src/test/java/anonvpn/anon_next/networking/CascadeConnectionManagerTest.java:[29,37] package anonvpn.anon_next.persistence does not exist
[ERROR] /var/lib/jenkins/jobs/ANONVPNlib/workspace/MAVEN_PROFILE/anon-cc-dev-android/src/test/java/anonvpn/anon_next/networking/CascadeConnectionManagerTest.java:[105,48] cannot find symbol
[ERROR] symbol:   class CascadeConnectionManager
[ERROR] location: class anonvpn.anon_next.networking.CascadeConnectionManagerTest
[ERROR] /var/lib/jenkins/jobs/ANONVPNlib/workspace/MAVEN_PROFILE/anon-cc-dev-android/src/test/java/anonvpn/anon_next/networking/CascadeConnectionManagerTest.java:[112,45] cannot find symbol
[ERROR] symbol:   class NotificationDispatcher
[ERROR] location: class anonvpn.anon_next.networking.CascadeConnectionManagerTest.TestCascadeConnectionManager
[ERROR] /var/lib/jenkins/jobs/ANONVPNlib/workspace/MAVEN_PROFILE/anon-cc-dev-android/src/test/java/anonvpn/anon_next/networking/CascadeConnectionManagerTest.java:[113,45] cannot find symbol
[ERROR] symbol:   class INetworkFactory
[ERROR] location: class anonvpn.anon_next.networking.CascadeConnectionManagerTest.TestCascadeConnectionManager
[ERROR] /var/lib/jenkins/jobs/ANONVPNlib/workspace/MAVEN_PROFILE/anon-cc-dev-android/src/test/java/anonvpn/anon_next/networking/CascadeConnectionManagerTest.java:[114,45] cannot find symbol
[ERROR] symbol:   class IConfig
[ERROR] location: class anonvpn.anon_next.networking.CascadeConnectionManagerTest.TestCascadeConnectionManager
[ERROR] /var/lib/jenkins/jobs/ANONVPNlib/workspace/MAVEN_PROFILE/anon-cc-dev-android/src/test/java/anonvpn/anon_next/networking/InfoServiceTest.java:[9,25] cannot find symbol
[ERROR] symbol:   class InfoService
[ERROR] location: package anonvpn.anon_next
[ERROR] /var/lib/jenkins/jobs/ANONVPNlib/workspace/MAVEN_PROFILE/anon-cc-dev-android/src/test/java/anonvpn/anon_next/networking/InfoServiceTest.java:[12,38] package anonvpn.anon_next.notification does not exist
[ERROR] /var/lib/jenkins/jobs/ANONVPNlib/workspace/MAVEN_PROFILE/anon-cc-dev-android/src/test/java/anonvpn/anon_next/networking/InfoServiceTest.java:[13,38] package anonvpn.anon_next.notification does not exist
[ERROR] /var/lib/jenkins/jobs/ANONVPNlib/workspace/MAVEN_PROFILE/anon-cc-dev-android/src/test/java/anonvpn/anon_next/networking/mocks/TestVPNInterface.java:[7,29] package anonvpn.anon_next.gui does not exist
[ERROR] /var/lib/jenkins/jobs/ANONVPNlib/workspace/MAVEN_PROFILE/anon-cc-dev-android/src/test/java/anonvpn/anon_next/networking/mocks/TestVPNInterface.java:[13,42] cannot find symbol
[ERROR] symbol: class IVPNInterface
[ERROR] /var/lib/jenkins/jobs/ANONVPNlib/workspace/MAVEN_PROFILE/anon-cc-dev-android/src/test/java/anonvpn/anon_next/networking/mocks/TestVPNInterfaceFactory.java:[3,25] cannot find symbol
[ERROR] symbol:   class InfoService
[ERROR] location: package anonvpn.anon_next
[ERROR] /var/lib/jenkins/jobs/ANONVPNlib/workspace/MAVEN_PROFILE/anon-cc-dev-android/src/test/java/anonvpn/anon_next/networking/mocks/TestVPNInterfaceFactory.java:[4,29] package anonvpn.anon_next.gui does not exist
[ERROR] /var/lib/jenkins/jobs/ANONVPNlib/workspace/MAVEN_PROFILE/anon-cc-dev-android/src/test/java/anonvpn/anon_next/networking/mocks/TestVPNInterfaceFactory.java:[5,29] package anonvpn.anon_next.gui does not exist
[ERROR] /var/lib/jenkins/jobs/ANONVPNlib/workspace/MAVEN_PROFILE/anon-cc-dev-android/src/test/java/anonvpn/anon_next/networking/mocks/TestVPNInterfaceFactory.java:[6,38] package anonvpn.anon_next.notification does not exist
[ERROR] /var/lib/jenkins/jobs/ANONVPNlib/workspace/MAVEN_PROFILE/anon-cc-dev-android/src/test/java/anonvpn/anon_next/networking/mocks/TestVPNInterfaceFactory.java:[7,37] package anonvpn.anon_next.persistence does not exist
[ERROR] /var/lib/jenkins/jobs/ANONVPNlib/workspace/MAVEN_PROFILE/anon-cc-dev-android/src/test/java/anonvpn/anon_next/networking/mocks/TestVPNInterfaceFactory.java:[13,49] cannot find symbol
[ERROR] symbol: class IVPNInterfaceFactory
[ERROR] /var/lib/jenkins/jobs/ANONVPNlib/workspace/MAVEN_PROFILE/anon-cc-dev-android/src/test/java/anonvpn/anon_next/networking/mocks/TestVPNInterfaceFactory.java:[22,42] cannot find symbol
[ERROR] symbol:   class NotificationDispatcher
[ERROR] location: class anonvpn.anon_next.networking.mocks.TestVPNInterfaceFactory
[ERROR] /var/lib/jenkins/jobs/ANONVPNlib/workspace/MAVEN_PROFILE/anon-cc-dev-android/src/test/java/anonvpn/anon_next/networking/mocks/TestVPNInterfaceFactory.java:[22,77] cannot find symbol
[ERROR] symbol:   class IConfig
[ERROR] location: class anonvpn.anon_next.networking.mocks.TestVPNInterfaceFactory
[ERROR] /var/lib/jenkins/jobs/ANONVPNlib/workspace/MAVEN_PROFILE/anon-cc-dev-android/src/test/java/anonvpn/anon_next/networking/mocks/TestVPNInterfaceFactory.java:[22,93] cannot find symbol
[ERROR] symbol:   class InfoService
[ERROR] location: class anonvpn.anon_next.networking.mocks.TestVPNInterfaceFactory
[ERROR] /var/lib/jenkins/jobs/ANONVPNlib/workspace/MAVEN_PROFILE/anon-cc-dev-android/src/test/java/anonvpn/anon_next/networking/mocks/TestVPNInterfaceFactory.java:[22,12] cannot find symbol
[ERROR] symbol:   class IVPNInterface
[ERROR] location: class anonvpn.anon_next.networking.mocks.TestVPNInterfaceFactory
[ERROR] /var/lib/jenkins/jobs/ANONVPNlib/workspace/MAVEN_PROFILE/anon-cc-dev-android/src/test/java/anonvpn/anon_next/networking/mocks/TestNetworkFactory.java:[22,5] method does not override or implement a method from a supertype
[ERROR] /var/lib/jenkins/jobs/ANONVPNlib/workspace/MAVEN_PROFILE/anon-cc-dev-android/src/test/java/anonvpn/anon_next/networking/mocks/TestNetworkFactory.java:[27,5] method does not override or implement a method from a supertype
[ERROR] /var/lib/jenkins/jobs/ANONVPNlib/workspace/MAVEN_PROFILE/anon-cc-dev-android/src/test/java/anonvpn/anon_next/networking/mocks/TestTunnelingInterface.java:[14,5] method does not override or implement a method from a supertype
[ERROR] /var/lib/jenkins/jobs/ANONVPNlib/workspace/MAVEN_PROFILE/anon-cc-dev-android/src/test/java/anonvpn/anon_next/networking/mocks/TestTunnelingInterface.java:[19,5] method does not override or implement a method from a supertype
[ERROR] /var/lib/jenkins/jobs/ANONVPNlib/workspace/MAVEN_PROFILE/anon-cc-dev-android/src/test/java/anonvpn/anon_next/networking/mocks/TestTunnelingInterface.java:[24,5] method does not override or implement a method from a supertype
[ERROR] /var/lib/jenkins/jobs/ANONVPNlib/workspace/MAVEN_PROFILE/anon-cc-dev-android/src/test/java/anonvpn/anon_next/networking/mocks/TestTunnelingInterface.java:[29,5] method does not override or implement a method from a supertype
[ERROR] /var/lib/jenkins/jobs/ANONVPNlib/workspace/MAVEN_PROFILE/anon-cc-dev-android/src/test/java/anonvpn/anon_next/networking/mocks/TestInternetSocket.java:[24,5] method does not override or implement a method from a supertype
[ERROR] /var/lib/jenkins/jobs/ANONVPNlib/workspace/MAVEN_PROFILE/anon-cc-dev-android/src/test/java/anonvpn/anon_next/networking/mocks/TestInternetSocket.java:[29,5] method does not override or implement a method from a supertype
[ERROR] /var/lib/jenkins/jobs/ANONVPNlib/workspace/MAVEN_PROFILE/anon-cc-dev-android/src/test/java/anonvpn/anon_next/networking/mocks/TestInternetSocket.java:[34,5] method does not override or implement a method from a supertype
[ERROR] /var/lib/jenkins/jobs/ANONVPNlib/workspace/MAVEN_PROFILE/anon-cc-dev-android/src/test/java/anonvpn/anon_next/networking/mocks/TestConfig.java:[19,5] method does not override or implement a method from a supertype
[ERROR] /var/lib/jenkins/jobs/ANONVPNlib/workspace/MAVEN_PROFILE/anon-cc-dev-android/src/test/java/anonvpn/anon_next/networking/mocks/TestConfig.java:[24,5] method does not override or implement a method from a supertype
[ERROR] /var/lib/jenkins/jobs/ANONVPNlib/workspace/MAVEN_PROFILE/anon-cc-dev-android/src/test/java/anonvpn/anon_next/networking/mocks/TestConfig.java:[29,5] method does not override or implement a method from a supertype
[ERROR] /var/lib/jenkins/jobs/ANONVPNlib/workspace/MAVEN_PROFILE/anon-cc-dev-android/src/test/java/anonvpn/anon_next/networking/mocks/TestConfig.java:[38,5] method does not override or implement a method from a supertype
[ERROR] /var/lib/jenkins/jobs/ANONVPNlib/workspace/MAVEN_PROFILE/anon-cc-dev-android/src/test/java/anonvpn/anon_next/networking/mocks/TestConfig.java:[47,5] method does not override or implement a method from a supertype
[ERROR] /var/lib/jenkins/jobs/ANONVPNlib/workspace/MAVEN_PROFILE/anon-cc-dev-android/src/test/java/anonvpn/anon_next/networking/mocks/TestConfig.java:[52,5] method does not override or implement a method from a supertype
[ERROR] /var/lib/jenkins/jobs/ANONVPNlib/workspace/MAVEN_PROFILE/anon-cc-dev-android/src/test/java/anonvpn/anon_next/networking/mocks/TestConfig.java:[57,5] method does not override or implement a method from a supertype
[ERROR] /var/lib/jenkins/jobs/ANONVPNlib/workspace/MAVEN_PROFILE/anon-cc-dev-android/src/test/java/anonvpn/anon_next/networking/mocks/TestConfig.java:[62,5] method does not override or implement a method from a supertype
[ERROR] /var/lib/jenkins/jobs/ANONVPNlib/workspace/MAVEN_PROFILE/anon-cc-dev-android/src/test/java/anonvpn/anon_next/networking/mocks/TestConfig.java:[67,5] method does not override or implement a method from a supertype
[ERROR] /var/lib/jenkins/jobs/ANONVPNlib/workspace/MAVEN_PROFILE/anon-cc-dev-android/src/test/java/anonvpn/anon_next/networking/mocks/TestConfig.java:[72,5] method does not override or implement a method from a supertype
[ERROR] /var/lib/jenkins/jobs/ANONVPNlib/workspace/MAVEN_PROFILE/anon-cc-dev-android/src/test/java/anonvpn/anon_next/networking/mocks/TestConfig.java:[77,5] method does not override or implement a method from a supertype
[ERROR] /var/lib/jenkins/jobs/ANONVPNlib/workspace/MAVEN_PROFILE/anon-cc-dev-android/src/test/java/anonvpn/anon_next/networking/mocks/TestConfig.java:[82,5] method does not override or implement a method from a supertype
[ERROR] /var/lib/jenkins/jobs/ANONVPNlib/workspace/MAVEN_PROFILE/anon-cc-dev-android/src/test/java/anonvpn/anon_next/networking/CascadeConnectionManagerTest.java:[119,9] method does not override or implement a method from a supertype
[ERROR] /var/lib/jenkins/jobs/ANONVPNlib/workspace/MAVEN_PROFILE/anon-cc-dev-android/src/test/java/anonvpn/anon_next/networking/CascadeConnectionManagerTest.java:[127,9] method does not override or implement a method from a supertype
[ERROR] /var/lib/jenkins/jobs/ANONVPNlib/workspace/MAVEN_PROFILE/anon-cc-dev-android/src/test/java/anonvpn/anon_next/networking/CascadeConnectionManagerTest.java:[132,9] method does not override or implement a method from a supertype
[ERROR] /var/lib/jenkins/jobs/ANONVPNlib/workspace/MAVEN_PROFILE/anon-cc-dev-android/src/test/java/anonvpn/anon_next/networking/CascadeConnectionManagerTest.java:[137,9] method does not override or implement a method from a supertype
[ERROR] /var/lib/jenkins/jobs/ANONVPNlib/workspace/MAVEN_PROFILE/anon-cc-dev-android/src/test/java/anonvpn/anon_next/networking/CascadeConnectionManagerTest.java:[142,9] method does not override or implement a method from a supertype
[ERROR] /var/lib/jenkins/jobs/ANONVPNlib/workspace/MAVEN_PROFILE/anon-cc-dev-android/src/test/java/anonvpn/anon_next/networking/CascadeConnectionManagerTest.java:[151,9] cannot find symbol
[ERROR] symbol:   class NotificationDispatcher
[ERROR] location: class anonvpn.anon_next.networking.CascadeConnectionManagerTest
[ERROR] /var/lib/jenkins/jobs/ANONVPNlib/workspace/MAVEN_PROFILE/anon-cc-dev-android/src/test/java/anonvpn/anon_next/networking/CascadeConnectionManagerTest.java:[151,51] cannot find symbol
[ERROR] symbol:   class NotificationDispatcher
[ERROR] location: class anonvpn.anon_next.networking.CascadeConnectionManagerTest
[ERROR] /var/lib/jenkins/jobs/ANONVPNlib/workspace/MAVEN_PROFILE/anon-cc-dev-android/src/test/java/anonvpn/anon_next/networking/CascadeConnectionManagerTest.java:[166,9] cannot find symbol
[ERROR] symbol:   class INetworkFactory
[ERROR] location: class anonvpn.anon_next.networking.CascadeConnectionManagerTest
[ERROR] /var/lib/jenkins/jobs/ANONVPNlib/workspace/MAVEN_PROFILE/anon-cc-dev-android/src/test/java/anonvpn/anon_next/networking/CascadeConnectionManagerTest.java:[204,9] cannot find symbol
[ERROR] symbol:   class NotificationDispatcher
[ERROR] location: class anonvpn.anon_next.networking.CascadeConnectionManagerTest
[ERROR] /var/lib/jenkins/jobs/ANONVPNlib/workspace/MAVEN_PROFILE/anon-cc-dev-android/src/test/java/anonvpn/anon_next/networking/CascadeConnectionManagerTest.java:[204,51] cannot find symbol
[ERROR] symbol:   class NotificationDispatcher
[ERROR] location: class anonvpn.anon_next.networking.CascadeConnectionManagerTest
[ERROR] /var/lib/jenkins/jobs/ANONVPNlib/workspace/MAVEN_PROFILE/anon-cc-dev-android/src/test/java/anonvpn/anon_next/networking/CascadeConnectionManagerTest.java:[219,9] cannot find symbol
[ERROR] symbol:   class INetworkFactory
[ERROR] location: class anonvpn.anon_next.networking.CascadeConnectionManagerTest
[ERROR] /var/lib/jenkins/jobs/ANONVPNlib/workspace/MAVEN_PROFILE/anon-cc-dev-android/src/test/java/anonvpn/anon_next/networking/CascadeConnectionManagerTest.java:[242,30] cannot find symbol
[ERROR] symbol:   method connectionEstablished(anon.infoservice.MixCascade)
[ERROR] location: variable connectionManager of type anonvpn.anon_next.networking.CascadeConnectionManagerTest.TestCascadeConnectionManager
[ERROR] /var/lib/jenkins/jobs/ANONVPNlib/workspace/MAVEN_PROFILE/anon-cc-dev-android/src/test/java/anonvpn/anon_next/networking/CascadeConnectionManagerTest.java:[248,33] cannot find symbol
[ERROR] symbol:   variable Event
[ERROR] location: class anonvpn.anon_next.networking.CascadeConnectionManagerTest
[ERROR] /var/lib/jenkins/jobs/ANONVPNlib/workspace/MAVEN_PROFILE/anon-cc-dev-android/src/test/java/anonvpn/anon_next/networking/InfoServiceTest.java:[24,9] cannot find symbol
[ERROR] symbol:   class NotificationDispatcher
[ERROR] location: class anonvpn.anon_next.networking.InfoServiceTest
[ERROR] /var/lib/jenkins/jobs/ANONVPNlib/workspace/MAVEN_PROFILE/anon-cc-dev-android/src/test/java/anonvpn/anon_next/networking/InfoServiceTest.java:[24,49] cannot find symbol
[ERROR] symbol:   class NotificationDispatcher
[ERROR] location: class anonvpn.anon_next.networking.InfoServiceTest
[ERROR] /var/lib/jenkins/jobs/ANONVPNlib/workspace/MAVEN_PROFILE/anon-cc-dev-android/src/test/java/anonvpn/anon_next/networking/InfoServiceTest.java:[30,9] cannot find symbol
[ERROR] symbol:   class InfoService
[ERROR] location: class anonvpn.anon_next.networking.InfoServiceTest
[ERROR] /var/lib/jenkins/jobs/ANONVPNlib/workspace/MAVEN_PROFILE/anon-cc-dev-android/src/test/java/anonvpn/anon_next/networking/InfoServiceTest.java:[30,39] cannot find symbol
[ERROR] symbol:   class InfoService
[ERROR] location: class anonvpn.anon_next.networking.InfoServiceTest
[ERROR] /var/lib/jenkins/jobs/ANONVPNlib/workspace/MAVEN_PROFILE/anon-cc-dev-android/src/test/java/anonvpn/anon_next/networking/InfoServiceTest.java:[41,27] cannot find symbol
[ERROR] symbol:   variable Event
[ERROR] location: class anonvpn.anon_next.networking.InfoServiceTest
[ERROR] /var/lib/jenkins/jobs/ANONVPNlib/workspace/MAVEN_PROFILE/anon-cc-dev-android/src/test/java/anonvpn/anon_next/networking/InfoServiceTest.java:[42,27] cannot find symbol
[ERROR] symbol:   variable Event
[ERROR] location: class anonvpn.anon_next.networking.InfoServiceTest
[ERROR] /var/lib/jenkins/jobs/ANONVPNlib/workspace/MAVEN_PROFILE/anon-cc-dev-android/src/test/java/anonvpn/anon_next/networking/InfoServiceTest.java:[52,9] cannot find symbol
[ERROR] symbol:   class NotificationDispatcher
[ERROR] location: class anonvpn.anon_next.networking.InfoServiceTest
[ERROR] /var/lib/jenkins/jobs/ANONVPNlib/workspace/MAVEN_PROFILE/anon-cc-dev-android/src/test/java/anonvpn/anon_next/networking/InfoServiceTest.java:[52,49] cannot find symbol
[ERROR] symbol:   class NotificationDispatcher
[ERROR] location: class anonvpn.anon_next.networking.InfoServiceTest
[ERROR] /var/lib/jenkins/jobs/ANONVPNlib/workspace/MAVEN_PROFILE/anon-cc-dev-android/src/test/java/anonvpn/anon_next/networking/InfoServiceTest.java:[58,9] cannot find symbol
[ERROR] symbol:   class InfoService
[ERROR] location: class anonvpn.anon_next.networking.InfoServiceTest
[ERROR] /var/lib/jenkins/jobs/ANONVPNlib/workspace/MAVEN_PROFILE/anon-cc-dev-android/src/test/java/anonvpn/anon_next/networking/InfoServiceTest.java:[58,39] cannot find symbol
[ERROR] symbol:   class InfoService
[ERROR] location: class anonvpn.anon_next.networking.InfoServiceTest
[ERROR] /var/lib/jenkins/jobs/ANONVPNlib/workspace/MAVEN_PROFILE/anon-cc-dev-android/src/test/java/anonvpn/anon_next/networking/InfoServiceTest.java:[63,27] cannot find symbol
[ERROR] symbol:   variable Event
[ERROR] location: class anonvpn.anon_next.networking.InfoServiceTest
[ERROR] /var/lib/jenkins/jobs/ANONVPNlib/workspace/MAVEN_PROFILE/anon-cc-dev-android/src/test/java/anonvpn/anon_next/networking/InfoServiceTest.java:[69,27] cannot find symbol
[ERROR] symbol:   variable Event
[ERROR] location: class anonvpn.anon_next.networking.InfoServiceTest
[ERROR] /var/lib/jenkins/jobs/ANONVPNlib/workspace/MAVEN_PROFILE/anon-cc-dev-android/src/test/java/anonvpn/anon_next/networking/InfoServiceTest.java:[75,27] cannot find symbol
[ERROR] symbol:   variable Event
[ERROR] location: class anonvpn.anon_next.networking.InfoServiceTest
[ERROR] /var/lib/jenkins/jobs/ANONVPNlib/workspace/MAVEN_PROFILE/anon-cc-dev-android/src/test/java/anonvpn/anon_next/networking/InfoServiceTest.java:[81,27] cannot find symbol
[ERROR] symbol:   variable Event
[ERROR] location: class anonvpn.anon_next.networking.InfoServiceTest
[ERROR] /var/lib/jenkins/jobs/ANONVPNlib/workspace/MAVEN_PROFILE/anon-cc-dev-android/src/test/java/anonvpn/anon_next/networking/mocks/TestVPNInterface.java:[21,5] method does not override or implement a method from a supertype
[ERROR] /var/lib/jenkins/jobs/ANONVPNlib/workspace/MAVEN_PROFILE/anon-cc-dev-android/src/test/java/anonvpn/anon_next/networking/mocks/TestVPNInterface.java:[26,5] method does not override or implement a method from a supertype
[ERROR] /var/lib/jenkins/jobs/ANONVPNlib/workspace/MAVEN_PROFILE/anon-cc-dev-android/src/test/java/anonvpn/anon_next/networking/mocks/TestVPNInterface.java:[31,5] method does not override or implement a method from a supertype
[ERROR] /var/lib/jenkins/jobs/ANONVPNlib/workspace/MAVEN_PROFILE/anon-cc-dev-android/src/test/java/anonvpn/anon_next/networking/mocks/TestVPNInterface.java:[36,5] method does not override or implement a method from a supertype
[ERROR] /var/lib/jenkins/jobs/ANONVPNlib/workspace/MAVEN_PROFILE/anon-cc-dev-android/src/test/java/anonvpn/anon_next/networking/mocks/TestVPNInterface.java:[42,5] method does not override or implement a method from a supertype
[ERROR] /var/lib/jenkins/jobs/ANONVPNlib/workspace/MAVEN_PROFILE/anon-cc-dev-android/src/test/java/anonvpn/anon_next/networking/mocks/TestVPNInterface.java:[47,5] method does not override or implement a method from a supertype
[ERROR] /var/lib/jenkins/jobs/ANONVPNlib/workspace/MAVEN_PROFILE/anon-cc-dev-android/src/test/java/anonvpn/anon_next/networking/mocks/TestVPNInterface.java:[52,5] method does not override or implement a method from a supertype
[ERROR] /var/lib/jenkins/jobs/ANONVPNlib/workspace/MAVEN_PROFILE/anon-cc-dev-android/src/test/java/anonvpn/anon_next/networking/mocks/TestVPNInterface.java:[57,5] method does not override or implement a method from a supertype
[ERROR] /var/lib/jenkins/jobs/ANONVPNlib/workspace/MAVEN_PROFILE/anon-cc-dev-android/src/test/java/anonvpn/anon_next/networking/mocks/TestVPNInterface.java:[62,5] method does not override or implement a method from a supertype
[ERROR] /var/lib/jenkins/jobs/ANONVPNlib/workspace/MAVEN_PROFILE/anon-cc-dev-android/src/test/java/anonvpn/anon_next/networking/mocks/TestVPNInterface.java:[67,5] method does not override or implement a method from a supertype
[ERROR] /var/lib/jenkins/jobs/ANONVPNlib/workspace/MAVEN_PROFILE/anon-cc-dev-android/src/test/java/anonvpn/anon_next/networking/mocks/TestVPNInterfaceFactory.java:[21,5] method does not override or implement a method from a supertype
[ERROR] -> [Help 1]
[ERROR] 
[ERROR] To see the full stack trace of the errors, re-run Maven with the -e switch.
[ERROR] Re-run Maven using the -X switch to enable full debug logging.
[ERROR] 
[ERROR] For more information about the errors and possible solutions, please read the following articles:
[ERROR] [Help 1] http://cwiki.apache.org/confluence/display/MAVEN/MojoFailureException
Build step 'Maven Goals aufrufen' marked build as failure
Finished: FAILURE