Console Output

Gestartet durch vorgelagertes Projekt „ANONVPNlib“, Build 37
Ursprünglich gestartet durch:
 Gestartet durch Benutzer sk13
[EnvInject] - Loading node environment variables.
Baue in Arbeitsbereich /var/lib/jenkins/jobs/ANONVPNlib/workspace/MAVEN_PROFILE/anon-cc-dev-android
Cleaning local Directory .
Checking out https://anon.inf.tu-dresden.de/svn/ANONVPNlib/ANONVPNlib/trunk at revision '2017-10-24T08:32:05.408 +0200'
A         src
A         src/main
A         src/main/java
A         src/main/java/anonvpn
A         src/main/java/anonvpn/anon_next
A         src/main/java/anonvpn/anon_next/core
A         src/main/java/anonvpn/anon_next/core/entities
A         src/main/java/anonvpn/anon_next/core/entities/IPv4Packet.java
A         src/main/java/anonvpn/anon_next/core/gui
A         src/main/java/anonvpn/anon_next/core/gui/IVPNInterface.java
A         src/main/java/anonvpn/anon_next/core/gui/IVPNInterfaceFactory.java
A         src/main/java/anonvpn/anon_next/core/networking
A         src/main/java/anonvpn/anon_next/core/networking/TcpSocks
A         src/main/java/anonvpn/anon_next/core/networking/TcpSocks/AnonTcpChannelDummy.java
A         src/main/java/anonvpn/anon_next/core/networking/TcpSocks/BitUtils.java
A         src/main/java/anonvpn/anon_next/core/networking/TcpSocks/DNSResolver.java
A         src/main/java/anonvpn/anon_next/core/networking/TcpSocks/Packet.java
A         src/main/java/anonvpn/anon_next/core/networking/TcpSocks/TcpStream.java
A         src/main/java/anonvpn/anon_next/core/networking/TcpSocks/TcpStreamManager.java
A         src/main/java/anonvpn/anon_next/core/networking/TcpSocks/UdpStream.java
A         src/main/java/anonvpn/anon_next/core/networking/TcpSocks/UdpStreamManager.java
A         src/main/java/anonvpn/anon_next/core/networking/TcpSocks/UdpTimer.java
A         src/main/java/anonvpn/anon_next/core/networking/AbstractTunnelingDevice.java
A         src/main/java/anonvpn/anon_next/core/networking/IInternetSocket.java
A         src/main/java/anonvpn/anon_next/core/networking/INetworkFactory.java
A         src/main/java/anonvpn/anon_next/core/networking/ITunneling.java
A         src/main/java/anonvpn/anon_next/core/networking/ReceiverThread.java
A         src/main/java/anonvpn/anon_next/core/networking/RegularHTTPClientSocketFactory.java
A         src/main/java/anonvpn/anon_next/core/networking/SenderThread.java
A         src/main/java/anonvpn/anon_next/core/notification
A         src/main/java/anonvpn/anon_next/core/notification/Event.java
A         src/main/java/anonvpn/anon_next/core/notification/Notification.java
A         src/main/java/anonvpn/anon_next/core/notification/NotificationDispatcher.java
A         src/main/java/anonvpn/anon_next/core/notification/Observer.java
A         src/main/java/anonvpn/anon_next/core/persistence
A         src/main/java/anonvpn/anon_next/core/persistence/IConfig.java
A         src/main/java/anonvpn/anon_next/core/persistence/IPersistenceFactory.java
A         src/main/java/anonvpn/anon_next/core/ANONVPNService.java
A         src/main/java/anonvpn/anon_next/core/CascadeConnectionManager.java
A         src/main/java/anonvpn/anon_next/core/CoreBuildConfig.java
A         src/main/java/anonvpn/anon_next/core/InfoService.java
A         src/main/java/anonvpn/anon_next/core/Statistics.java
A         src/main/java/pcap
A         src/main/java/pcap/PCAPTUNDevice.java
A         src/main/java/pcap/PCAPWriter.java
A         src/test
A         src/test/java
A         src/test/java/anonvpn
A         src/test/java/anonvpn/anon_next
A         src/test/java/anonvpn/anon_next/networking
A         src/test/java/anonvpn/anon_next/networking/mocks
A         src/test/java/anonvpn/anon_next/networking/mocks/TestConfig.java
A         src/test/java/anonvpn/anon_next/networking/mocks/TestHTTPClientSocketFactory.java
A         src/test/java/anonvpn/anon_next/networking/mocks/TestInternetSocket.java
A         src/test/java/anonvpn/anon_next/networking/mocks/TestNetworkFactory.java
A         src/test/java/anonvpn/anon_next/networking/mocks/TestSocket.java
A         src/test/java/anonvpn/anon_next/networking/mocks/TestTunnelingInterface.java
A         src/test/java/anonvpn/anon_next/networking/mocks/TestVPNInterface.java
A         src/test/java/anonvpn/anon_next/networking/mocks/TestVPNInterfaceFactory.java
A         src/test/java/anonvpn/anon_next/networking/ANONVPNServiceTest.java
A         src/test/java/anonvpn/anon_next/networking/CascadeConnectionManagerTest.java
A         src/test/java/anonvpn/anon_next/networking/InfoServiceTest.java
A         src/test/java/anonvpn/anon_next/networking/SenderThreadTest.java
A         .classpath
A         .project
A         pom.xml
 U        .
At revision 41
[anon-cc-dev-android] $ /opt/maven/bin/mvn -DMAVEN_PROFILE=anon-cc-dev-android -Panon-cc-dev-android deploy
[INFO] Scanning for projects...
[INFO]                                                                         
[INFO] ------------------------------------------------------------------------
[INFO] Building ANONVPNlib 00.01.023-SNAPSHOT
[INFO] ------------------------------------------------------------------------
Downloading: http://svn.jondos.de/maven/repos/anon/BouncyCastleLightForAN.ON/01.56.002-SNAPSHOT/maven-metadata.xml

[WARNING] Could not transfer metadata anon:BouncyCastleLightForAN.ON:01.56.002-SNAPSHOT/maven-metadata.xml from/to jondos.repos.http (http://svn.jondos.de/maven/repos): Connect to svn.jondos.de:80 [svn.jondos.de/78.129.167.102] failed: Verbindungsaufbau abgelehnt (Connection refused)
[WARNING] Failure to transfer anon:BouncyCastleLightForAN.ON:01.56.002-SNAPSHOT/maven-metadata.xml from http://svn.jondos.de/maven/repos was cached in the local repository, resolution will not be reattempted until the update interval of jondos.repos.http has elapsed or updates are forced. Original error: Could not transfer metadata anon:BouncyCastleLightForAN.ON:01.56.002-SNAPSHOT/maven-metadata.xml from/to jondos.repos.http (http://svn.jondos.de/maven/repos): Connect to svn.jondos.de:80 [svn.jondos.de/78.129.167.102] failed: Verbindungsaufbau abgelehnt (Connection refused)
Downloading: http://svn.jondos.de/maven/repos/anon/HTTPClient/00.04.013-SNAPSHOT/maven-metadata.xml

[WARNING] Could not transfer metadata anon:HTTPClient:00.04.013-SNAPSHOT/maven-metadata.xml from/to jondos.repos.http (http://svn.jondos.de/maven/repos): Connect to svn.jondos.de:80 [svn.jondos.de/78.129.167.102] failed: Verbindungsaufbau abgelehnt (Connection refused)
[WARNING] Failure to transfer anon:HTTPClient:00.04.013-SNAPSHOT/maven-metadata.xml from http://svn.jondos.de/maven/repos was cached in the local repository, resolution will not be reattempted until the update interval of jondos.repos.http has elapsed or updates are forced. Original error: Could not transfer metadata anon:HTTPClient:00.04.013-SNAPSHOT/maven-metadata.xml from/to jondos.repos.http (http://svn.jondos.de/maven/repos): Connect to svn.jondos.de:80 [svn.jondos.de/78.129.167.102] failed: Verbindungsaufbau abgelehnt (Connection refused)
Downloading: http://svn.jondos.de/maven/repos/anon/SkypeForANON/0.0.13-SNAPSHOT/maven-metadata.xml

[WARNING] Could not transfer metadata anon:SkypeForANON:0.0.13-SNAPSHOT/maven-metadata.xml from/to jondos.repos.http (http://svn.jondos.de/maven/repos): Connect to svn.jondos.de:80 [svn.jondos.de/78.129.167.102] failed: Verbindungsaufbau abgelehnt (Connection refused)
[WARNING] Failure to transfer anon:SkypeForANON:0.0.13-SNAPSHOT/maven-metadata.xml from http://svn.jondos.de/maven/repos was cached in the local repository, resolution will not be reattempted until the update interval of jondos.repos.http has elapsed or updates are forced. Original error: Could not transfer metadata anon:SkypeForANON:0.0.13-SNAPSHOT/maven-metadata.xml from/to jondos.repos.http (http://svn.jondos.de/maven/repos): Connect to svn.jondos.de:80 [svn.jondos.de/78.129.167.102] failed: Verbindungsaufbau abgelehnt (Connection refused)
Downloading: http://svn.jondos.de/maven/repos/anon/ApacheFTPClient/0.0.2-SNAPSHOT/maven-metadata.xml

[WARNING] Could not transfer metadata anon:ApacheFTPClient:0.0.2-SNAPSHOT/maven-metadata.xml from/to jondos.repos.http (http://svn.jondos.de/maven/repos): Connect to svn.jondos.de:80 [svn.jondos.de/78.129.167.102] failed: Verbindungsaufbau abgelehnt (Connection refused)
[WARNING] Failure to transfer anon:ApacheFTPClient:0.0.2-SNAPSHOT/maven-metadata.xml from http://svn.jondos.de/maven/repos was cached in the local repository, resolution will not be reattempted until the update interval of jondos.repos.http has elapsed or updates are forced. Original error: Could not transfer metadata anon:ApacheFTPClient:0.0.2-SNAPSHOT/maven-metadata.xml from/to jondos.repos.http (http://svn.jondos.de/maven/repos): Connect to svn.jondos.de:80 [svn.jondos.de/78.129.167.102] failed: Verbindungsaufbau abgelehnt (Connection refused)
Downloading: http://svn.jondos.de/maven/repos/anon/logging/0.1.9-SNAPSHOT/maven-metadata.xml

[WARNING] Could not transfer metadata anon:logging:0.1.9-SNAPSHOT/maven-metadata.xml from/to jondos.repos.http (http://svn.jondos.de/maven/repos): Connect to svn.jondos.de:80 [svn.jondos.de/78.129.167.102] failed: Verbindungsaufbau abgelehnt (Connection refused)
[WARNING] Failure to transfer anon:logging:0.1.9-SNAPSHOT/maven-metadata.xml from http://svn.jondos.de/maven/repos was cached in the local repository, resolution will not be reattempted until the update interval of jondos.repos.http has elapsed or updates are forced. Original error: Could not transfer metadata anon:logging:0.1.9-SNAPSHOT/maven-metadata.xml from/to jondos.repos.http (http://svn.jondos.de/maven/repos): Connect to svn.jondos.de:80 [svn.jondos.de/78.129.167.102] failed: Verbindungsaufbau abgelehnt (Connection refused)
Downloading: http://svn.jondos.de/maven/repos/anon/log4jForANON/0.0.4-SNAPSHOT/maven-metadata.xml

[WARNING] Could not transfer metadata anon:log4jForANON:0.0.4-SNAPSHOT/maven-metadata.xml from/to jondos.repos.http (http://svn.jondos.de/maven/repos): Connect to svn.jondos.de:80 [svn.jondos.de/78.129.167.102] failed: Verbindungsaufbau abgelehnt (Connection refused)
[WARNING] Failure to transfer anon:log4jForANON:0.0.4-SNAPSHOT/maven-metadata.xml from http://svn.jondos.de/maven/repos was cached in the local repository, resolution will not be reattempted until the update interval of jondos.repos.http has elapsed or updates are forced. Original error: Could not transfer metadata anon:log4jForANON:0.0.4-SNAPSHOT/maven-metadata.xml from/to jondos.repos.http (http://svn.jondos.de/maven/repos): Connect to svn.jondos.de:80 [svn.jondos.de/78.129.167.102] failed: Verbindungsaufbau abgelehnt (Connection refused)
[INFO] 
[INFO] --- maven-resources-plugin:2.6:resources (default-resources) @ ANONVPNlib ---
[WARNING] Using platform encoding (UTF-8 actually) to copy filtered resources, i.e. build is platform dependent!
[INFO] skip non existing resourceDirectory /var/lib/jenkins/jobs/ANONVPNlib/workspace/MAVEN_PROFILE/anon-cc-dev-android/src/main/resources
[INFO] 
[INFO] --- maven-compiler-plugin:3.1:compile (default-compile) @ ANONVPNlib ---
[INFO] Changes detected - recompiling the module!
[WARNING] File encoding has not been set, using platform encoding UTF-8, i.e. build is platform dependent!
[INFO] Compiling 32 source files to /var/lib/jenkins/jobs/ANONVPNlib/workspace/MAVEN_PROFILE/anon-cc-dev-android/target/classes
[INFO] 
[INFO] --- maven-resources-plugin:2.6:testResources (default-testResources) @ ANONVPNlib ---
[WARNING] Using platform encoding (UTF-8 actually) to copy filtered resources, i.e. build is platform dependent!
[INFO] skip non existing resourceDirectory /var/lib/jenkins/jobs/ANONVPNlib/workspace/MAVEN_PROFILE/anon-cc-dev-android/src/test/resources
[INFO] 
[INFO] --- maven-compiler-plugin:3.1:testCompile (default-testCompile) @ ANONVPNlib ---
[INFO] Changes detected - recompiling the module!
[WARNING] File encoding has not been set, using platform encoding UTF-8, i.e. build is platform dependent!
[INFO] Compiling 12 source files to /var/lib/jenkins/jobs/ANONVPNlib/workspace/MAVEN_PROFILE/anon-cc-dev-android/target/test-classes
[INFO] -------------------------------------------------------------
[WARNING] COMPILATION WARNING : 
[INFO] -------------------------------------------------------------
[WARNING] /var/lib/jenkins/jobs/ANONVPNlib/workspace/MAVEN_PROFILE/anon-cc-dev-android/src/test/java/anonvpn/anon_next/networking/CascadeConnectionManagerTest.java: /var/lib/jenkins/jobs/ANONVPNlib/workspace/MAVEN_PROFILE/anon-cc-dev-android/src/test/java/anonvpn/anon_next/networking/CascadeConnectionManagerTest.java uses or overrides a deprecated API.
[WARNING] /var/lib/jenkins/jobs/ANONVPNlib/workspace/MAVEN_PROFILE/anon-cc-dev-android/src/test/java/anonvpn/anon_next/networking/CascadeConnectionManagerTest.java: Recompile with -Xlint:deprecation for details.
[INFO] 2 warnings 
[INFO] -------------------------------------------------------------
[INFO] -------------------------------------------------------------
[ERROR] COMPILATION ERROR : 
[INFO] -------------------------------------------------------------
[ERROR] /var/lib/jenkins/jobs/ANONVPNlib/workspace/MAVEN_PROFILE/anon-cc-dev-android/src/test/java/anonvpn/anon_next/networking/mocks/TestVPNInterface.java:[13,8] anonvpn.anon_next.networking.mocks.TestVPNInterface is not abstract and does not override abstract method getRxTxBytesPerSecond() in anonvpn.anon_next.core.gui.IVPNInterface
[ERROR] /var/lib/jenkins/jobs/ANONVPNlib/workspace/MAVEN_PROFILE/anon-cc-dev-android/src/test/java/anonvpn/anon_next/networking/mocks/TestVPNInterface.java:[21,5] method does not override or implement a method from a supertype
[ERROR] /var/lib/jenkins/jobs/ANONVPNlib/workspace/MAVEN_PROFILE/anon-cc-dev-android/src/test/java/anonvpn/anon_next/networking/mocks/TestVPNInterface.java:[26,5] method does not override or implement a method from a supertype
[INFO] 3 errors 
[INFO] -------------------------------------------------------------
[INFO] ------------------------------------------------------------------------
[INFO] BUILD FAILURE
[INFO] ------------------------------------------------------------------------
[INFO] Total time: 4.110 s
[INFO] Finished at: 2017-10-24T08:32:27+02:00
[INFO] Final Memory: 15M/180M
[INFO] ------------------------------------------------------------------------
[ERROR] Failed to execute goal org.apache.maven.plugins:maven-compiler-plugin:3.1:testCompile (default-testCompile) on project ANONVPNlib: Compilation failure: Compilation failure:
[ERROR] /var/lib/jenkins/jobs/ANONVPNlib/workspace/MAVEN_PROFILE/anon-cc-dev-android/src/test/java/anonvpn/anon_next/networking/mocks/TestVPNInterface.java:[13,8] anonvpn.anon_next.networking.mocks.TestVPNInterface is not abstract and does not override abstract method getRxTxBytesPerSecond() in anonvpn.anon_next.core.gui.IVPNInterface
[ERROR] /var/lib/jenkins/jobs/ANONVPNlib/workspace/MAVEN_PROFILE/anon-cc-dev-android/src/test/java/anonvpn/anon_next/networking/mocks/TestVPNInterface.java:[21,5] method does not override or implement a method from a supertype
[ERROR] /var/lib/jenkins/jobs/ANONVPNlib/workspace/MAVEN_PROFILE/anon-cc-dev-android/src/test/java/anonvpn/anon_next/networking/mocks/TestVPNInterface.java:[26,5] method does not override or implement a method from a supertype
[ERROR] -> [Help 1]
[ERROR] 
[ERROR] To see the full stack trace of the errors, re-run Maven with the -e switch.
[ERROR] Re-run Maven using the -X switch to enable full debug logging.
[ERROR] 
[ERROR] For more information about the errors and possible solutions, please read the following articles:
[ERROR] [Help 1] http://cwiki.apache.org/confluence/display/MAVEN/MojoFailureException
Build step 'Maven Goals aufrufen' marked build as failure
Finished: FAILURE