Console Output

Gestartet durch vorgelagertes Projekt „ANONVPNlib“, Build 20
Ursprünglich gestartet durch:
 Build wurde durch eine SCM-Änderung ausgelöst.
[EnvInject] - Loading node environment variables.
Baue in Arbeitsbereich /var/lib/jenkins/jobs/ANONVPNlib/workspace/MAVEN_PROFILE/anon-cc-dev-android
Cleaning local Directory .
Checking out https://anon.inf.tu-dresden.de/svn/ANONVPNlib/ANONVPNlib/trunk at revision '2017-10-16T09:09:07.569 +0200'
A         src
A         src/main
A         src/main/java
A         src/main/java/anonvpn
A         src/main/java/anonvpn/anon_next
A         src/main/java/anonvpn/anon_next/core
A         src/main/java/anonvpn/anon_next/core/entities
A         src/main/java/anonvpn/anon_next/core/entities/IPv4Packet.java
A         src/main/java/anonvpn/anon_next/core/gui
A         src/main/java/anonvpn/anon_next/core/gui/IVPNInterface.java
A         src/main/java/anonvpn/anon_next/core/gui/IVPNInterfaceFactory.java
A         src/main/java/anonvpn/anon_next/core/networking
A         src/main/java/anonvpn/anon_next/core/networking/TcpSocks
A         src/main/java/anonvpn/anon_next/core/networking/TcpSocks/AnonTcpChannelDummy.java
A         src/main/java/anonvpn/anon_next/core/networking/TcpSocks/BitUtils.java
A         src/main/java/anonvpn/anon_next/core/networking/TcpSocks/DNSResolver.java
A         src/main/java/anonvpn/anon_next/core/networking/TcpSocks/Packet.java
A         src/main/java/anonvpn/anon_next/core/networking/TcpSocks/TcpStream.java
A         src/main/java/anonvpn/anon_next/core/networking/TcpSocks/TcpStreamManager.java
A         src/main/java/anonvpn/anon_next/core/networking/TcpSocks/UdpStream.java
A         src/main/java/anonvpn/anon_next/core/networking/TcpSocks/UdpStreamManager.java
A         src/main/java/anonvpn/anon_next/core/networking/TcpSocks/UdpTimer.java
A         src/main/java/anonvpn/anon_next/core/networking/IInternetSocket.java
A         src/main/java/anonvpn/anon_next/core/networking/INetworkFactory.java
A         src/main/java/anonvpn/anon_next/core/networking/ITunneling.java
A         src/main/java/anonvpn/anon_next/core/networking/ReceiverThread.java
A         src/main/java/anonvpn/anon_next/core/networking/RegularHTTPClientSocketFactory.java
A         src/main/java/anonvpn/anon_next/core/networking/SenderThread.java
A         src/main/java/anonvpn/anon_next/core/notification
A         src/main/java/anonvpn/anon_next/core/notification/Event.java
A         src/main/java/anonvpn/anon_next/core/notification/Notification.java
A         src/main/java/anonvpn/anon_next/core/notification/NotificationDispatcher.java
A         src/main/java/anonvpn/anon_next/core/notification/Observer.java
A         src/main/java/anonvpn/anon_next/core/persistence
A         src/main/java/anonvpn/anon_next/core/persistence/IConfig.java
A         src/main/java/anonvpn/anon_next/core/persistence/IPersistenceFactory.java
A         src/main/java/anonvpn/anon_next/core/ANONVPNService.java
A         src/main/java/anonvpn/anon_next/core/CascadeConnectionManager.java
A         src/main/java/anonvpn/anon_next/core/CoreBuildConfig.java
A         src/main/java/anonvpn/anon_next/core/InfoService.java
A         src/main/java/anonvpn/anon_next/core/Statistics.java
A         src/test
A         src/test/java
A         src/test/java/anonvpn
A         src/test/java/anonvpn/anon_next
A         src/test/java/anonvpn/anon_next/networking
A         src/test/java/anonvpn/anon_next/networking/mocks
A         src/test/java/anonvpn/anon_next/networking/mocks/TestConfig.java
A         src/test/java/anonvpn/anon_next/networking/mocks/TestHTTPClientSocketFactory.java
A         src/test/java/anonvpn/anon_next/networking/mocks/TestInternetSocket.java
A         src/test/java/anonvpn/anon_next/networking/mocks/TestNetworkFactory.java
A         src/test/java/anonvpn/anon_next/networking/mocks/TestSocket.java
A         src/test/java/anonvpn/anon_next/networking/mocks/TestTunnelingInterface.java
A         src/test/java/anonvpn/anon_next/networking/mocks/TestVPNInterface.java
A         src/test/java/anonvpn/anon_next/networking/mocks/TestVPNInterfaceFactory.java
A         src/test/java/anonvpn/anon_next/networking/ANONVPNServiceTest.java
A         src/test/java/anonvpn/anon_next/networking/CascadeConnectionManagerTest.java
A         src/test/java/anonvpn/anon_next/networking/InfoServiceTest.java
A         src/test/java/anonvpn/anon_next/networking/SenderThreadTest.java
A         .classpath
A         .project
A         pom.xml
 U        .
At revision 24
[anon-cc-dev-android] $ /opt/maven/bin/mvn -DMAVEN_PROFILE=anon-cc-dev-android -Panon-cc-dev-android deploy
[INFO] Scanning for projects...
[INFO]                                                                         
[INFO] ------------------------------------------------------------------------
[INFO] Building ANONVPNlib 00.01.011-SNAPSHOT
[INFO] ------------------------------------------------------------------------
[WARNING] The POM for anon:anonlib:jar:android:00.20.024-SNAPSHOT is missing, no dependency information available
Downloading: http://anon.inf.tu-dresden.de/artifactory/repo/anon/anonlib/00.20.024-SNAPSHOT/anonlib-00.20.024-SNAPSHOT-android.jar

[INFO] ------------------------------------------------------------------------
[INFO] BUILD FAILURE
[INFO] ------------------------------------------------------------------------
[INFO] Total time: 1.191 s
[INFO] Finished at: 2017-10-16T09:09:47+02:00
[INFO] Final Memory: 11M/138M
[INFO] ------------------------------------------------------------------------
[ERROR] Failed to execute goal on project ANONVPNlib: Could not resolve dependencies for project anon:ANONVPNlib:jar:00.01.011-SNAPSHOT: Could not find artifact anon:anonlib:jar:android:00.20.024-SNAPSHOT in anon.inf.tu-dresden.de (http://anon.inf.tu-dresden.de/artifactory/repo) -> [Help 1]
[ERROR] 
[ERROR] To see the full stack trace of the errors, re-run Maven with the -e switch.
[ERROR] Re-run Maven using the -X switch to enable full debug logging.
[ERROR] 
[ERROR] For more information about the errors and possible solutions, please read the following articles:
[ERROR] [Help 1] http://cwiki.apache.org/confluence/display/MAVEN/DependencyResolutionException
Build step 'Maven Goals aufrufen' marked build as failure
Finished: FAILURE