Console Output

Skipping 388 KB.. Full Log
23:17.90 /opt/FirefoxSource/mozilla-release/media/omx-plugin/include/ics/stagefright/MetaData.h:41:20: warning: multi-character character constant [-Wmultichar]
23:17.90 Warning: -Wmultichar in /opt/FirefoxSource/mozilla-release/media/omx-plugin/include/ics/stagefright/MetaData.h: multi-character character constant
23:17.90 /opt/FirefoxSource/mozilla-release/media/omx-plugin/include/ics/stagefright/MetaData.h:42:27: warning: multi-character character constant [-Wmultichar]
23:17.90 Warning: -Wmultichar in /opt/FirefoxSource/mozilla-release/media/omx-plugin/include/ics/stagefright/MetaData.h: multi-character character constant
23:17.90 /opt/FirefoxSource/mozilla-release/media/omx-plugin/include/ics/stagefright/MetaData.h:43:18: warning: multi-character character constant [-Wmultichar]
23:17.90 Warning: -Wmultichar in /opt/FirefoxSource/mozilla-release/media/omx-plugin/include/ics/stagefright/MetaData.h: multi-character character constant
23:17.90 /opt/FirefoxSource/mozilla-release/media/omx-plugin/include/ics/stagefright/MetaData.h:44:23: warning: multi-character character constant [-Wmultichar]
23:17.90 Warning: -Wmultichar in /opt/FirefoxSource/mozilla-release/media/omx-plugin/include/ics/stagefright/MetaData.h: multi-character character constant
23:17.90 /opt/FirefoxSource/mozilla-release/media/omx-plugin/include/ics/stagefright/MetaData.h:45:24: warning: multi-character character constant [-Wmultichar]
23:17.90 Warning: -Wmultichar in /opt/FirefoxSource/mozilla-release/media/omx-plugin/include/ics/stagefright/MetaData.h: multi-character character constant
23:17.90 /opt/FirefoxSource/mozilla-release/media/omx-plugin/include/ics/stagefright/MetaData.h:46:22: warning: multi-character character constant [-Wmultichar]
23:17.90 Warning: -Wmultichar in /opt/FirefoxSource/mozilla-release/media/omx-plugin/include/ics/stagefright/MetaData.h: multi-character character constant
23:17.90 /opt/FirefoxSource/mozilla-release/media/omx-plugin/include/ics/stagefright/MetaData.h:47:21: warning: multi-character character constant [-Wmultichar]
23:17.90 Warning: -Wmultichar in /opt/FirefoxSource/mozilla-release/media/omx-plugin/include/ics/stagefright/MetaData.h: multi-character character constant
23:17.90 /opt/FirefoxSource/mozilla-release/media/omx-plugin/include/ics/stagefright/MetaData.h:48:19: warning: multi-character character constant [-Wmultichar]
23:17.90 Warning: -Wmultichar in /opt/FirefoxSource/mozilla-release/media/omx-plugin/include/ics/stagefright/MetaData.h: multi-character character constant
23:17.90 /opt/FirefoxSource/mozilla-release/media/omx-plugin/include/ics/stagefright/MetaData.h:49:16: warning: multi-character character constant [-Wmultichar]
23:17.90 Warning: -Wmultichar in /opt/FirefoxSource/mozilla-release/media/omx-plugin/include/ics/stagefright/MetaData.h: multi-character character constant
23:17.90 /opt/FirefoxSource/mozilla-release/media/omx-plugin/include/ics/stagefright/MetaData.h:50:16: warning: multi-character character constant [-Wmultichar]
23:17.90 Warning: -Wmultichar in /opt/FirefoxSource/mozilla-release/media/omx-plugin/include/ics/stagefright/MetaData.h: multi-character character constant
23:17.90 /opt/FirefoxSource/mozilla-release/media/omx-plugin/include/ics/stagefright/MetaData.h:51:16: warning: multi-character character constant [-Wmultichar]
23:17.90 Warning: -Wmultichar in /opt/FirefoxSource/mozilla-release/media/omx-plugin/include/ics/stagefright/MetaData.h: multi-character character constant
23:17.90 /opt/FirefoxSource/mozilla-release/media/omx-plugin/include/ics/stagefright/MetaData.h:52:22: warning: multi-character character constant [-Wmultichar]
23:17.90 Warning: -Wmultichar in /opt/FirefoxSource/mozilla-release/media/omx-plugin/include/ics/stagefright/MetaData.h: multi-character character constant
23:17.90 /opt/FirefoxSource/mozilla-release/media/omx-plugin/include/ics/stagefright/MetaData.h:53:23: warning: multi-character character constant [-Wmultichar]
23:17.90 Warning: -Wmultichar in /opt/FirefoxSource/mozilla-release/media/omx-plugin/include/ics/stagefright/MetaData.h: multi-character character constant
23:17.90 /opt/FirefoxSource/mozilla-release/media/omx-plugin/include/ics/stagefright/MetaData.h:54:29: warning: multi-character character constant [-Wmultichar]
23:17.90 Warning: -Wmultichar in /opt/FirefoxSource/mozilla-release/media/omx-plugin/include/ics/stagefright/MetaData.h: multi-character character constant
23:17.90 /opt/FirefoxSource/mozilla-release/media/omx-plugin/include/ics/stagefright/MetaData.h:55:23: warning: multi-character character constant [-Wmultichar]
23:17.90 Warning: -Wmultichar in /opt/FirefoxSource/mozilla-release/media/omx-plugin/include/ics/stagefright/MetaData.h: multi-character character constant
23:17.90 /opt/FirefoxSource/mozilla-release/media/omx-plugin/include/ics/stagefright/MetaData.h:56:25: warning: multi-character character constant [-Wmultichar]
23:17.91 Warning: -Wmultichar in /opt/FirefoxSource/mozilla-release/media/omx-plugin/include/ics/stagefright/MetaData.h: multi-character character constant
23:17.91 /opt/FirefoxSource/mozilla-release/media/omx-plugin/include/ics/stagefright/MetaData.h:57:16: warning: multi-character character constant [-Wmultichar]
23:17.91 Warning: -Wmultichar in /opt/FirefoxSource/mozilla-release/media/omx-plugin/include/ics/stagefright/MetaData.h: multi-character character constant
23:17.91 /opt/FirefoxSource/mozilla-release/media/omx-plugin/include/ics/stagefright/MetaData.h:58:24: warning: multi-character character constant [-Wmultichar]
23:17.91 Warning: -Wmultichar in /opt/FirefoxSource/mozilla-release/media/omx-plugin/include/ics/stagefright/MetaData.h: multi-character character constant
23:17.91 /opt/FirefoxSource/mozilla-release/media/omx-plugin/include/ics/stagefright/MetaData.h:59:19: warning: multi-character character constant [-Wmultichar]
23:17.91 Warning: -Wmultichar in /opt/FirefoxSource/mozilla-release/media/omx-plugin/include/ics/stagefright/MetaData.h: multi-character character constant
23:17.91 /opt/FirefoxSource/mozilla-release/media/omx-plugin/include/ics/stagefright/MetaData.h:60:22: warning: multi-character character constant [-Wmultichar]
23:17.91 Warning: -Wmultichar in /opt/FirefoxSource/mozilla-release/media/omx-plugin/include/ics/stagefright/MetaData.h: multi-character character constant
23:17.91 /opt/FirefoxSource/mozilla-release/media/omx-plugin/include/ics/stagefright/MetaData.h:61:21: warning: multi-character character constant [-Wmultichar]
23:17.91 Warning: -Wmultichar in /opt/FirefoxSource/mozilla-release/media/omx-plugin/include/ics/stagefright/MetaData.h: multi-character character constant
23:17.91 /opt/FirefoxSource/mozilla-release/media/omx-plugin/include/ics/stagefright/MetaData.h:62:22: warning: multi-character character constant [-Wmultichar]
23:17.91 Warning: -Wmultichar in /opt/FirefoxSource/mozilla-release/media/omx-plugin/include/ics/stagefright/MetaData.h: multi-character character constant
23:17.91 /opt/FirefoxSource/mozilla-release/media/omx-plugin/include/ics/stagefright/MetaData.h:63:20: warning: multi-character character constant [-Wmultichar]
23:17.91 Warning: -Wmultichar in /opt/FirefoxSource/mozilla-release/media/omx-plugin/include/ics/stagefright/MetaData.h: multi-character character constant
23:17.91 /opt/FirefoxSource/mozilla-release/media/omx-plugin/include/ics/stagefright/MetaData.h:64:23: warning: multi-character character constant [-Wmultichar]
23:17.91 Warning: -Wmultichar in /opt/FirefoxSource/mozilla-release/media/omx-plugin/include/ics/stagefright/MetaData.h: multi-character character constant
23:17.91 /opt/FirefoxSource/mozilla-release/media/omx-plugin/include/ics/stagefright/MetaData.h:65:27: warning: multi-character character constant [-Wmultichar]
23:17.91 Warning: -Wmultichar in /opt/FirefoxSource/mozilla-release/media/omx-plugin/include/ics/stagefright/MetaData.h: multi-character character constant
23:17.91 /opt/FirefoxSource/mozilla-release/media/omx-plugin/include/ics/stagefright/MetaData.h:66:28: warning: multi-character character constant [-Wmultichar]
23:17.91 Warning: -Wmultichar in /opt/FirefoxSource/mozilla-release/media/omx-plugin/include/ics/stagefright/MetaData.h: multi-character character constant
23:17.91 /opt/FirefoxSource/mozilla-release/media/omx-plugin/include/ics/stagefright/MetaData.h:67:20: warning: multi-character character constant [-Wmultichar]
23:17.91 Warning: -Wmultichar in /opt/FirefoxSource/mozilla-release/media/omx-plugin/include/ics/stagefright/MetaData.h: multi-character character constant
23:17.91 /opt/FirefoxSource/mozilla-release/media/omx-plugin/include/ics/stagefright/MetaData.h:68:24: warning: multi-character character constant [-Wmultichar]
23:17.91 Warning: -Wmultichar in /opt/FirefoxSource/mozilla-release/media/omx-plugin/include/ics/stagefright/MetaData.h: multi-character character constant
23:17.91 /opt/FirefoxSource/mozilla-release/media/omx-plugin/include/ics/stagefright/MetaData.h:69:25: warning: multi-character character constant [-Wmultichar]
23:17.91 Warning: -Wmultichar in /opt/FirefoxSource/mozilla-release/media/omx-plugin/include/ics/stagefright/MetaData.h: multi-character character constant
23:17.91 /opt/FirefoxSource/mozilla-release/media/omx-plugin/include/ics/stagefright/MetaData.h:70:19: warning: multi-character character constant [-Wmultichar]
23:17.91 Warning: -Wmultichar in /opt/FirefoxSource/mozilla-release/media/omx-plugin/include/ics/stagefright/MetaData.h: multi-character character constant
23:17.91 /opt/FirefoxSource/mozilla-release/media/omx-plugin/include/ics/stagefright/MetaData.h:71:17: warning: multi-character character constant [-Wmultichar]
23:17.91 Warning: -Wmultichar in /opt/FirefoxSource/mozilla-release/media/omx-plugin/include/ics/stagefright/MetaData.h: multi-character character constant
23:17.91 /opt/FirefoxSource/mozilla-release/media/omx-plugin/include/ics/stagefright/MetaData.h:73:17: warning: multi-character character constant [-Wmultichar]
23:17.91 Warning: -Wmultichar in /opt/FirefoxSource/mozilla-release/media/omx-plugin/include/ics/stagefright/MetaData.h: multi-character character constant
23:17.91 /opt/FirefoxSource/mozilla-release/media/omx-plugin/include/ics/stagefright/MetaData.h:74:18: warning: multi-character character constant [-Wmultichar]
23:17.91 Warning: -Wmultichar in /opt/FirefoxSource/mozilla-release/media/omx-plugin/include/ics/stagefright/MetaData.h: multi-character character constant
23:17.91 /opt/FirefoxSource/mozilla-release/media/omx-plugin/include/ics/stagefright/MetaData.h:75:23: warning: multi-character character constant [-Wmultichar]
23:17.91 Warning: -Wmultichar in /opt/FirefoxSource/mozilla-release/media/omx-plugin/include/ics/stagefright/MetaData.h: multi-character character constant
23:17.92 /opt/FirefoxSource/mozilla-release/media/omx-plugin/include/ics/stagefright/MetaData.h:76:20: warning: multi-character character constant [-Wmultichar]
23:17.92 Warning: -Wmultichar in /opt/FirefoxSource/mozilla-release/media/omx-plugin/include/ics/stagefright/MetaData.h: multi-character character constant
23:17.92 /opt/FirefoxSource/mozilla-release/media/omx-plugin/include/ics/stagefright/MetaData.h:77:17: warning: multi-character character constant [-Wmultichar]
23:17.92 Warning: -Wmultichar in /opt/FirefoxSource/mozilla-release/media/omx-plugin/include/ics/stagefright/MetaData.h: multi-character character constant
23:17.92 /opt/FirefoxSource/mozilla-release/media/omx-plugin/include/ics/stagefright/MetaData.h:78:17: warning: multi-character character constant [-Wmultichar]
23:17.92 Warning: -Wmultichar in /opt/FirefoxSource/mozilla-release/media/omx-plugin/include/ics/stagefright/MetaData.h: multi-character character constant
23:17.92 /opt/FirefoxSource/mozilla-release/media/omx-plugin/include/ics/stagefright/MetaData.h:79:16: warning: multi-character character constant [-Wmultichar]
23:17.92 Warning: -Wmultichar in /opt/FirefoxSource/mozilla-release/media/omx-plugin/include/ics/stagefright/MetaData.h: multi-character character constant
23:17.92 /opt/FirefoxSource/mozilla-release/media/omx-plugin/include/ics/stagefright/MetaData.h:80:20: warning: multi-character character constant [-Wmultichar]
23:17.92 Warning: -Wmultichar in /opt/FirefoxSource/mozilla-release/media/omx-plugin/include/ics/stagefright/MetaData.h: multi-character character constant
23:17.92 /opt/FirefoxSource/mozilla-release/media/omx-plugin/include/ics/stagefright/MetaData.h:81:24: warning: multi-character character constant [-Wmultichar]
23:17.92 Warning: -Wmultichar in /opt/FirefoxSource/mozilla-release/media/omx-plugin/include/ics/stagefright/MetaData.h: multi-character character constant
23:17.92 /opt/FirefoxSource/mozilla-release/media/omx-plugin/include/ics/stagefright/MetaData.h:82:18: warning: multi-character character constant [-Wmultichar]
23:17.92 Warning: -Wmultichar in /opt/FirefoxSource/mozilla-release/media/omx-plugin/include/ics/stagefright/MetaData.h: multi-character character constant
23:17.92 /opt/FirefoxSource/mozilla-release/media/omx-plugin/include/ics/stagefright/MetaData.h:83:25: warning: multi-character character constant [-Wmultichar]
23:17.92 Warning: -Wmultichar in /opt/FirefoxSource/mozilla-release/media/omx-plugin/include/ics/stagefright/MetaData.h: multi-character character constant
23:17.92 /opt/FirefoxSource/mozilla-release/media/omx-plugin/include/ics/stagefright/MetaData.h:84:22: warning: multi-character character constant [-Wmultichar]
23:17.92 Warning: -Wmultichar in /opt/FirefoxSource/mozilla-release/media/omx-plugin/include/ics/stagefright/MetaData.h: multi-character character constant
23:17.92 /opt/FirefoxSource/mozilla-release/media/omx-plugin/include/ics/stagefright/MetaData.h:85:16: warning: multi-character character constant [-Wmultichar]
23:17.92 Warning: -Wmultichar in /opt/FirefoxSource/mozilla-release/media/omx-plugin/include/ics/stagefright/MetaData.h: multi-character character constant
23:17.92 /opt/FirefoxSource/mozilla-release/media/omx-plugin/include/ics/stagefright/MetaData.h:86:18: warning: multi-character character constant [-Wmultichar]
23:17.92 Warning: -Wmultichar in /opt/FirefoxSource/mozilla-release/media/omx-plugin/include/ics/stagefright/MetaData.h: multi-character character constant
23:17.92 /opt/FirefoxSource/mozilla-release/media/omx-plugin/include/ics/stagefright/MetaData.h:87:23: warning: multi-character character constant [-Wmultichar]
23:17.92 Warning: -Wmultichar in /opt/FirefoxSource/mozilla-release/media/omx-plugin/include/ics/stagefright/MetaData.h: multi-character character constant
23:17.92 /opt/FirefoxSource/mozilla-release/media/omx-plugin/include/ics/stagefright/MetaData.h:88:20: warning: multi-character character constant [-Wmultichar]
23:17.92 Warning: -Wmultichar in /opt/FirefoxSource/mozilla-release/media/omx-plugin/include/ics/stagefright/MetaData.h: multi-character character constant
23:17.92 /opt/FirefoxSource/mozilla-release/media/omx-plugin/include/ics/stagefright/MetaData.h:89:21: warning: multi-character character constant [-Wmultichar]
23:17.92 Warning: -Wmultichar in /opt/FirefoxSource/mozilla-release/media/omx-plugin/include/ics/stagefright/MetaData.h: multi-character character constant
23:17.92 /opt/FirefoxSource/mozilla-release/media/omx-plugin/include/ics/stagefright/MetaData.h:92:24: warning: multi-character character constant [-Wmultichar]
23:17.92 Warning: -Wmultichar in /opt/FirefoxSource/mozilla-release/media/omx-plugin/include/ics/stagefright/MetaData.h: multi-character character constant
23:17.92 /opt/FirefoxSource/mozilla-release/media/omx-plugin/include/ics/stagefright/MetaData.h:93:22: warning: multi-character character constant [-Wmultichar]
23:17.92 Warning: -Wmultichar in /opt/FirefoxSource/mozilla-release/media/omx-plugin/include/ics/stagefright/MetaData.h: multi-character character constant
23:17.92 /opt/FirefoxSource/mozilla-release/media/omx-plugin/include/ics/stagefright/MetaData.h:96:27: warning: multi-character character constant [-Wmultichar]
23:17.92 Warning: -Wmultichar in /opt/FirefoxSource/mozilla-release/media/omx-plugin/include/ics/stagefright/MetaData.h: multi-character character constant
23:17.92 /opt/FirefoxSource/mozilla-release/media/omx-plugin/include/ics/stagefright/MetaData.h:97:26: warning: multi-character character constant [-Wmultichar]
23:17.92 Warning: -Wmultichar in /opt/FirefoxSource/mozilla-release/media/omx-plugin/include/ics/stagefright/MetaData.h: multi-character character constant
23:17.92 /opt/FirefoxSource/mozilla-release/media/omx-plugin/include/ics/stagefright/MetaData.h:102:20: warning: multi-character character constant [-Wmultichar]
23:17.93 Warning: -Wmultichar in /opt/FirefoxSource/mozilla-release/media/omx-plugin/include/ics/stagefright/MetaData.h: multi-character character constant
23:17.93 /opt/FirefoxSource/mozilla-release/media/omx-plugin/include/ics/stagefright/MetaData.h:106:27: warning: multi-character character constant [-Wmultichar]
23:17.93 Warning: -Wmultichar in /opt/FirefoxSource/mozilla-release/media/omx-plugin/include/ics/stagefright/MetaData.h: multi-character character constant
23:17.93 /opt/FirefoxSource/mozilla-release/media/omx-plugin/include/ics/stagefright/MetaData.h:108:23: warning: multi-character character constant [-Wmultichar]
23:17.93 Warning: -Wmultichar in /opt/FirefoxSource/mozilla-release/media/omx-plugin/include/ics/stagefright/MetaData.h: multi-character character constant
23:17.93 /opt/FirefoxSource/mozilla-release/media/omx-plugin/include/ics/stagefright/MetaData.h:111:20: warning: multi-character character constant [-Wmultichar]
23:17.93 Warning: -Wmultichar in /opt/FirefoxSource/mozilla-release/media/omx-plugin/include/ics/stagefright/MetaData.h: multi-character character constant
23:17.93 /opt/FirefoxSource/mozilla-release/media/omx-plugin/include/ics/stagefright/MetaData.h:113:24: warning: multi-character character constant [-Wmultichar]
23:17.93 Warning: -Wmultichar in /opt/FirefoxSource/mozilla-release/media/omx-plugin/include/ics/stagefright/MetaData.h: multi-character character constant
23:17.93 /opt/FirefoxSource/mozilla-release/media/omx-plugin/include/ics/stagefright/MetaData.h:115:24: warning: multi-character character constant [-Wmultichar]
23:17.93 Warning: -Wmultichar in /opt/FirefoxSource/mozilla-release/media/omx-plugin/include/ics/stagefright/MetaData.h: multi-character character constant
23:17.93 /opt/FirefoxSource/mozilla-release/media/omx-plugin/include/ics/stagefright/MetaData.h:118:20: warning: multi-character character constant [-Wmultichar]
23:17.93 Warning: -Wmultichar in /opt/FirefoxSource/mozilla-release/media/omx-plugin/include/ics/stagefright/MetaData.h: multi-character character constant
23:17.93 /opt/FirefoxSource/mozilla-release/media/omx-plugin/include/ics/stagefright/MetaData.h:121:25: warning: multi-character character constant [-Wmultichar]
23:17.93 Warning: -Wmultichar in /opt/FirefoxSource/mozilla-release/media/omx-plugin/include/ics/stagefright/MetaData.h: multi-character character constant
23:17.93 /opt/FirefoxSource/mozilla-release/media/omx-plugin/include/ics/stagefright/MetaData.h:124:26: warning: multi-character character constant [-Wmultichar]
23:17.93 Warning: -Wmultichar in /opt/FirefoxSource/mozilla-release/media/omx-plugin/include/ics/stagefright/MetaData.h: multi-character character constant
23:17.93 /opt/FirefoxSource/mozilla-release/media/omx-plugin/include/ics/stagefright/MetaData.h:126:33: warning: multi-character character constant [-Wmultichar]
23:17.93 Warning: -Wmultichar in /opt/FirefoxSource/mozilla-release/media/omx-plugin/include/ics/stagefright/MetaData.h: multi-character character constant
23:17.93 /opt/FirefoxSource/mozilla-release/media/omx-plugin/include/ics/stagefright/MetaData.h:130:17: warning: multi-character character constant [-Wmultichar]
23:17.93 Warning: -Wmultichar in /opt/FirefoxSource/mozilla-release/media/omx-plugin/include/ics/stagefright/MetaData.h: multi-character character constant
23:17.93 /opt/FirefoxSource/mozilla-release/media/omx-plugin/include/ics/stagefright/MetaData.h:131:17: warning: multi-character character constant [-Wmultichar]
23:17.93 Warning: -Wmultichar in /opt/FirefoxSource/mozilla-release/media/omx-plugin/include/ics/stagefright/MetaData.h: multi-character character constant
23:17.93 /opt/FirefoxSource/mozilla-release/media/omx-plugin/include/ics/stagefright/MetaData.h:132:17: warning: multi-character character constant [-Wmultichar]
23:17.93 Warning: -Wmultichar in /opt/FirefoxSource/mozilla-release/media/omx-plugin/include/ics/stagefright/MetaData.h: multi-character character constant
23:17.93 /opt/FirefoxSource/mozilla-release/media/omx-plugin/include/ics/stagefright/MetaData.h:141:21: warning: multi-character character constant [-Wmultichar]
23:17.93 Warning: -Wmultichar in /opt/FirefoxSource/mozilla-release/media/omx-plugin/include/ics/stagefright/MetaData.h: multi-character character constant
23:17.93 /opt/FirefoxSource/mozilla-release/media/omx-plugin/include/ics/stagefright/MetaData.h:142:25: warning: multi-character character constant [-Wmultichar]
23:17.93 Warning: -Wmultichar in /opt/FirefoxSource/mozilla-release/media/omx-plugin/include/ics/stagefright/MetaData.h: multi-character character constant
23:17.93 /opt/FirefoxSource/mozilla-release/media/omx-plugin/include/ics/stagefright/MetaData.h:143:22: warning: multi-character character constant [-Wmultichar]
23:17.93 Warning: -Wmultichar in /opt/FirefoxSource/mozilla-release/media/omx-plugin/include/ics/stagefright/MetaData.h: multi-character character constant
23:17.93 /opt/FirefoxSource/mozilla-release/media/omx-plugin/include/ics/stagefright/MetaData.h:144:22: warning: multi-character character constant [-Wmultichar]
23:17.93 Warning: -Wmultichar in /opt/FirefoxSource/mozilla-release/media/omx-plugin/include/ics/stagefright/MetaData.h: multi-character character constant
23:17.93 /opt/FirefoxSource/mozilla-release/media/omx-plugin/include/ics/stagefright/MetaData.h:145:22: warning: multi-character character constant [-Wmultichar]
23:17.93 Warning: -Wmultichar in /opt/FirefoxSource/mozilla-release/media/omx-plugin/include/ics/stagefright/MetaData.h: multi-character character constant
23:17.93 /opt/FirefoxSource/mozilla-release/media/omx-plugin/include/ics/stagefright/MetaData.h:146:24: warning: multi-character character constant [-Wmultichar]
23:17.93 Warning: -Wmultichar in /opt/FirefoxSource/mozilla-release/media/omx-plugin/include/ics/stagefright/MetaData.h: multi-character character constant
23:17.93 /opt/FirefoxSource/mozilla-release/media/omx-plugin/include/ics/stagefright/MetaData.h:147:21: warning: multi-character character constant [-Wmultichar]
23:17.93 libstagefright.so
23:17.93 vdmx.o
23:18.03 libstagefright.o
23:18.12 vorg.o
23:18.29 In file included from /opt/FirefoxSource/mozilla-release/media/omx-plugin/lib/gb235/libstagefright/../../gb/libstagefright/libstagefright.cpp:12:0,
23:18.29                  from /opt/FirefoxSource/mozilla-release/media/omx-plugin/lib/gb235/libstagefright/libstagefright.cpp:8:
23:18.29 Warning: -Wmultichar in /opt/FirefoxSource/mozilla-release/media/omx-plugin/include/gb/stagefright/MetaData.h: multi-character character constant
23:18.29 /opt/FirefoxSource/mozilla-release/media/omx-plugin/include/gb/stagefright/MetaData.h:32:20: warning: multi-character character constant [-Wmultichar]
23:18.29 Warning: -Wmultichar in /opt/FirefoxSource/mozilla-release/media/omx-plugin/include/gb/stagefright/MetaData.h: multi-character character constant
23:18.29 /opt/FirefoxSource/mozilla-release/media/omx-plugin/include/gb/stagefright/MetaData.h:33:17: warning: multi-character character constant [-Wmultichar]
23:18.29 Warning: -Wmultichar in /opt/FirefoxSource/mozilla-release/media/omx-plugin/include/gb/stagefright/MetaData.h: multi-character character constant
23:18.29 /opt/FirefoxSource/mozilla-release/media/omx-plugin/include/gb/stagefright/MetaData.h:34:18: warning: multi-character character constant [-Wmultichar]
23:18.29 Warning: -Wmultichar in /opt/FirefoxSource/mozilla-release/media/omx-plugin/include/gb/stagefright/MetaData.h: multi-character character constant
23:18.29 /opt/FirefoxSource/mozilla-release/media/omx-plugin/include/gb/stagefright/MetaData.h:35:20: warning: multi-character character constant [-Wmultichar]
23:18.29 Warning: -Wmultichar in /opt/FirefoxSource/mozilla-release/media/omx-plugin/include/gb/stagefright/MetaData.h: multi-character character constant
23:18.29 /opt/FirefoxSource/mozilla-release/media/omx-plugin/include/gb/stagefright/MetaData.h:36:27: warning: multi-character character constant [-Wmultichar]
23:18.29 Warning: -Wmultichar in /opt/FirefoxSource/mozilla-release/media/omx-plugin/include/gb/stagefright/MetaData.h: multi-character character constant
23:18.29 /opt/FirefoxSource/mozilla-release/media/omx-plugin/include/gb/stagefright/MetaData.h:37:18: warning: multi-character character constant [-Wmultichar]
23:18.29 Warning: -Wmultichar in /opt/FirefoxSource/mozilla-release/media/omx-plugin/include/gb/stagefright/MetaData.h: multi-character character constant
23:18.29 /opt/FirefoxSource/mozilla-release/media/omx-plugin/include/gb/stagefright/MetaData.h:38:23: warning: multi-character character constant [-Wmultichar]
23:18.29 Warning: -Wmultichar in /opt/FirefoxSource/mozilla-release/media/omx-plugin/include/gb/stagefright/MetaData.h: multi-character character constant
23:18.29 /opt/FirefoxSource/mozilla-release/media/omx-plugin/include/gb/stagefright/MetaData.h:39:24: warning: multi-character character constant [-Wmultichar]
23:18.29 Warning: -Wmultichar in /opt/FirefoxSource/mozilla-release/media/omx-plugin/include/gb/stagefright/MetaData.h: multi-character character constant
23:18.29 /opt/FirefoxSource/mozilla-release/media/omx-plugin/include/gb/stagefright/MetaData.h:40:22: warning: multi-character character constant [-Wmultichar]
23:18.29 Warning: -Wmultichar in /opt/FirefoxSource/mozilla-release/media/omx-plugin/include/gb/stagefright/MetaData.h: multi-character character constant
23:18.29 /opt/FirefoxSource/mozilla-release/media/omx-plugin/include/gb/stagefright/MetaData.h:41:19: warning: multi-character character constant [-Wmultichar]
23:18.29 Warning: -Wmultichar in /opt/FirefoxSource/mozilla-release/media/omx-plugin/include/gb/stagefright/MetaData.h: multi-character character constant
23:18.29 /opt/FirefoxSource/mozilla-release/media/omx-plugin/include/gb/stagefright/MetaData.h:42:16: warning: multi-character character constant [-Wmultichar]
23:18.29 Warning: -Wmultichar in /opt/FirefoxSource/mozilla-release/media/omx-plugin/include/gb/stagefright/MetaData.h: multi-character character constant
23:18.29 /opt/FirefoxSource/mozilla-release/media/omx-plugin/include/gb/stagefright/MetaData.h:43:16: warning: multi-character character constant [-Wmultichar]
23:18.29 Warning: -Wmultichar in /opt/FirefoxSource/mozilla-release/media/omx-plugin/include/gb/stagefright/MetaData.h: multi-character character constant
23:18.29 /opt/FirefoxSource/mozilla-release/media/omx-plugin/include/gb/stagefright/MetaData.h:44:22: warning: multi-character character constant [-Wmultichar]
23:18.29 Warning: -Wmultichar in /opt/FirefoxSource/mozilla-release/media/omx-plugin/include/gb/stagefright/MetaData.h: multi-character character constant
23:18.29 /opt/FirefoxSource/mozilla-release/media/omx-plugin/include/gb/stagefright/MetaData.h:45:23: warning: multi-character character constant [-Wmultichar]
23:18.29 Warning: -Wmultichar in /opt/FirefoxSource/mozilla-release/media/omx-plugin/include/gb/stagefright/MetaData.h: multi-character character constant
23:18.29 /opt/FirefoxSource/mozilla-release/media/omx-plugin/include/gb/stagefright/MetaData.h:46:29: warning: multi-character character constant [-Wmultichar]
23:18.29 Warning: -Wmultichar in /opt/FirefoxSource/mozilla-release/media/omx-plugin/include/gb/stagefright/MetaData.h: multi-character character constant
23:18.29 /opt/FirefoxSource/mozilla-release/media/omx-plugin/include/gb/stagefright/MetaData.h:47:23: warning: multi-character character constant [-Wmultichar]
23:18.29 Warning: -Wmultichar in /opt/FirefoxSource/mozilla-release/media/omx-plugin/include/gb/stagefright/MetaData.h: multi-character character constant
23:18.29 /opt/FirefoxSource/mozilla-release/media/omx-plugin/include/gb/stagefright/MetaData.h:48:25: warning: multi-character character constant [-Wmultichar]
23:18.29 Warning: -Wmultichar in /opt/FirefoxSource/mozilla-release/media/omx-plugin/include/gb/stagefright/MetaData.h: multi-character character constant
23:18.29 /opt/FirefoxSource/mozilla-release/media/omx-plugin/include/gb/stagefright/MetaData.h:49:16: warning: multi-character character constant [-Wmultichar]
23:18.29 Warning: -Wmultichar in /opt/FirefoxSource/mozilla-release/media/omx-plugin/include/gb/stagefright/MetaData.h: multi-character character constant
23:18.29 /opt/FirefoxSource/mozilla-release/media/omx-plugin/include/gb/stagefright/MetaData.h:50:19: warning: multi-character character constant [-Wmultichar]
23:18.29 Warning: -Wmultichar in /opt/FirefoxSource/mozilla-release/media/omx-plugin/include/gb/stagefright/MetaData.h: multi-character character constant
23:18.29 /opt/FirefoxSource/mozilla-release/media/omx-plugin/include/gb/stagefright/MetaData.h:51:22: warning: multi-character character constant [-Wmultichar]
23:18.29 Warning: -Wmultichar in /opt/FirefoxSource/mozilla-release/media/omx-plugin/include/gb/stagefright/MetaData.h: multi-character character constant
23:18.29 /opt/FirefoxSource/mozilla-release/media/omx-plugin/include/gb/stagefright/MetaData.h:52:21: warning: multi-character character constant [-Wmultichar]
23:18.29 Warning: -Wmultichar in /opt/FirefoxSource/mozilla-release/media/omx-plugin/include/gb/stagefright/MetaData.h: multi-character character constant
23:18.29 /opt/FirefoxSource/mozilla-release/media/omx-plugin/include/gb/stagefright/MetaData.h:53:22: warning: multi-character character constant [-Wmultichar]
23:18.29 Warning: -Wmultichar in /opt/FirefoxSource/mozilla-release/media/omx-plugin/include/gb/stagefright/MetaData.h: multi-character character constant
23:18.29 /opt/FirefoxSource/mozilla-release/media/omx-plugin/include/gb/stagefright/MetaData.h:54:20: warning: multi-character character constant [-Wmultichar]
23:18.29 Warning: -Wmultichar in /opt/FirefoxSource/mozilla-release/media/omx-plugin/include/gb/stagefright/MetaData.h: multi-character character constant
23:18.29 /opt/FirefoxSource/mozilla-release/media/omx-plugin/include/gb/stagefright/MetaData.h:55:23: warning: multi-character character constant [-Wmultichar]
23:18.29 Warning: -Wmultichar in /opt/FirefoxSource/mozilla-release/media/omx-plugin/include/gb/stagefright/MetaData.h: multi-character character constant
23:18.29 /opt/FirefoxSource/mozilla-release/media/omx-plugin/include/gb/stagefright/MetaData.h:56:27: warning: multi-character character constant [-Wmultichar]
23:18.29 Warning: -Wmultichar in /opt/FirefoxSource/mozilla-release/media/omx-plugin/include/gb/stagefright/MetaData.h: multi-character character constant
23:18.29 /opt/FirefoxSource/mozilla-release/media/omx-plugin/include/gb/stagefright/MetaData.h:57:28: warning: multi-character character constant [-Wmultichar]
23:18.29 Warning: -Wmultichar in /opt/FirefoxSource/mozilla-release/media/omx-plugin/include/gb/stagefright/MetaData.h: multi-character character constant
23:18.31 /opt/FirefoxSource/mozilla-release/media/omx-plugin/include/gb/stagefright/MetaData.h:58:20: warning: multi-character character constant [-Wmultichar]
23:18.31 Warning: -Wmultichar in /opt/FirefoxSource/mozilla-release/media/omx-plugin/include/gb/stagefright/MetaData.h: multi-character character constant
23:18.31 /opt/FirefoxSource/mozilla-release/media/omx-plugin/include/gb/stagefright/MetaData.h:59:24: warning: multi-character character constant [-Wmultichar]
23:18.31 Warning: -Wmultichar in /opt/FirefoxSource/mozilla-release/media/omx-plugin/include/gb/stagefright/MetaData.h: multi-character character constant
23:18.31 /opt/FirefoxSource/mozilla-release/media/omx-plugin/include/gb/stagefright/MetaData.h:60:25: warning: multi-character character constant [-Wmultichar]
23:18.31 Warning: -Wmultichar in /opt/FirefoxSource/mozilla-release/media/omx-plugin/include/gb/stagefright/MetaData.h: multi-character character constant
23:18.31 /opt/FirefoxSource/mozilla-release/media/omx-plugin/include/gb/stagefright/MetaData.h:62:17: warning: multi-character character constant [-Wmultichar]
23:18.31 Warning: -Wmultichar in /opt/FirefoxSource/mozilla-release/media/omx-plugin/include/gb/stagefright/MetaData.h: multi-character character constant
23:18.31 /opt/FirefoxSource/mozilla-release/media/omx-plugin/include/gb/stagefright/MetaData.h:63:18: warning: multi-character character constant [-Wmultichar]
23:18.31 Warning: -Wmultichar in /opt/FirefoxSource/mozilla-release/media/omx-plugin/include/gb/stagefright/MetaData.h: multi-character character constant
23:18.31 /opt/FirefoxSource/mozilla-release/media/omx-plugin/include/gb/stagefright/MetaData.h:64:23: warning: multi-character character constant [-Wmultichar]
23:18.31 Warning: -Wmultichar in /opt/FirefoxSource/mozilla-release/media/omx-plugin/include/gb/stagefright/MetaData.h: multi-character character constant
23:18.31 /opt/FirefoxSource/mozilla-release/media/omx-plugin/include/gb/stagefright/MetaData.h:65:20: warning: multi-character character constant [-Wmultichar]
23:18.31 Warning: -Wmultichar in /opt/FirefoxSource/mozilla-release/media/omx-plugin/include/gb/stagefright/MetaData.h: multi-character character constant
23:18.31 /opt/FirefoxSource/mozilla-release/media/omx-plugin/include/gb/stagefright/MetaData.h:66:17: warning: multi-character character constant [-Wmultichar]
23:18.31 Warning: -Wmultichar in /opt/FirefoxSource/mozilla-release/media/omx-plugin/include/gb/stagefright/MetaData.h: multi-character character constant
23:18.31 /opt/FirefoxSource/mozilla-release/media/omx-plugin/include/gb/stagefright/MetaData.h:67:17: warning: multi-character character constant [-Wmultichar]
23:18.31 Warning: -Wmultichar in /opt/FirefoxSource/mozilla-release/media/omx-plugin/include/gb/stagefright/MetaData.h: multi-character character constant
23:18.31 /opt/FirefoxSource/mozilla-release/media/omx-plugin/include/gb/stagefright/MetaData.h:68:16: warning: multi-character character constant [-Wmultichar]
23:18.31 Warning: -Wmultichar in /opt/FirefoxSource/mozilla-release/media/omx-plugin/include/gb/stagefright/MetaData.h: multi-character character constant
23:18.31 /opt/FirefoxSource/mozilla-release/media/omx-plugin/include/gb/stagefright/MetaData.h:69:20: warning: multi-character character constant [-Wmultichar]
23:18.31 Warning: -Wmultichar in /opt/FirefoxSource/mozilla-release/media/omx-plugin/include/gb/stagefright/MetaData.h: multi-character character constant
23:18.31 /opt/FirefoxSource/mozilla-release/media/omx-plugin/include/gb/stagefright/MetaData.h:70:24: warning: multi-character character constant [-Wmultichar]
23:18.31 Warning: -Wmultichar in /opt/FirefoxSource/mozilla-release/media/omx-plugin/include/gb/stagefright/MetaData.h: multi-character character constant
23:18.31 /opt/FirefoxSource/mozilla-release/media/omx-plugin/include/gb/stagefright/MetaData.h:71:18: warning: multi-character character constant [-Wmultichar]
23:18.31 Warning: -Wmultichar in /opt/FirefoxSource/mozilla-release/media/omx-plugin/include/gb/stagefright/MetaData.h: multi-character character constant
23:18.31 /opt/FirefoxSource/mozilla-release/media/omx-plugin/include/gb/stagefright/MetaData.h:72:25: warning: multi-character character constant [-Wmultichar]
23:18.31 Warning: -Wmultichar in /opt/FirefoxSource/mozilla-release/media/omx-plugin/include/gb/stagefright/MetaData.h: multi-character character constant
23:18.31 /opt/FirefoxSource/mozilla-release/media/omx-plugin/include/gb/stagefright/MetaData.h:73:22: warning: multi-character character constant [-Wmultichar]
23:18.31 Warning: -Wmultichar in /opt/FirefoxSource/mozilla-release/media/omx-plugin/include/gb/stagefright/MetaData.h: multi-character character constant
23:18.31 /opt/FirefoxSource/mozilla-release/media/omx-plugin/include/gb/stagefright/MetaData.h:74:16: warning: multi-character character constant [-Wmultichar]
23:18.31 Warning: -Wmultichar in /opt/FirefoxSource/mozilla-release/media/omx-plugin/include/gb/stagefright/MetaData.h: multi-character character constant
23:18.31 /opt/FirefoxSource/mozilla-release/media/omx-plugin/include/gb/stagefright/MetaData.h:75:18: warning: multi-character character constant [-Wmultichar]
23:18.31 Warning: -Wmultichar in /opt/FirefoxSource/mozilla-release/media/omx-plugin/include/gb/stagefright/MetaData.h: multi-character character constant
23:18.31 /opt/FirefoxSource/mozilla-release/media/omx-plugin/include/gb/stagefright/MetaData.h:76:23: warning: multi-character character constant [-Wmultichar]
23:18.31 Warning: -Wmultichar in /opt/FirefoxSource/mozilla-release/media/omx-plugin/include/gb/stagefright/MetaData.h: multi-character character constant
23:18.31 /opt/FirefoxSource/mozilla-release/media/omx-plugin/include/gb/stagefright/MetaData.h:77:21: warning: multi-character character constant [-Wmultichar]
23:18.31 Warning: -Wmultichar in /opt/FirefoxSource/mozilla-release/media/omx-plugin/include/gb/stagefright/MetaData.h: multi-character character constant
23:18.31 /opt/FirefoxSource/mozilla-release/media/omx-plugin/include/gb/stagefright/MetaData.h:80:24: warning: multi-character character constant [-Wmultichar]
23:18.32 Warning: -Wmultichar in /opt/FirefoxSource/mozilla-release/media/omx-plugin/include/gb/stagefright/MetaData.h: multi-character character constant
23:18.32 /opt/FirefoxSource/mozilla-release/media/omx-plugin/include/gb/stagefright/MetaData.h:81:22: warning: multi-character character constant [-Wmultichar]
23:18.32 Warning: -Wmultichar in /opt/FirefoxSource/mozilla-release/media/omx-plugin/include/gb/stagefright/MetaData.h: multi-character character constant
23:18.32 /opt/FirefoxSource/mozilla-release/media/omx-plugin/include/gb/stagefright/MetaData.h:84:27: warning: multi-character character constant [-Wmultichar]
23:18.32 Warning: -Wmultichar in /opt/FirefoxSource/mozilla-release/media/omx-plugin/include/gb/stagefright/MetaData.h: multi-character character constant
23:18.32 /opt/FirefoxSource/mozilla-release/media/omx-plugin/include/gb/stagefright/MetaData.h:85:26: warning: multi-character character constant [-Wmultichar]
23:18.32 Warning: -Wmultichar in /opt/FirefoxSource/mozilla-release/media/omx-plugin/include/gb/stagefright/MetaData.h: multi-character character constant
23:18.32 /opt/FirefoxSource/mozilla-release/media/omx-plugin/include/gb/stagefright/MetaData.h:90:20: warning: multi-character character constant [-Wmultichar]
23:18.32 Warning: -Wmultichar in /opt/FirefoxSource/mozilla-release/media/omx-plugin/include/gb/stagefright/MetaData.h: multi-character character constant
23:18.32 /opt/FirefoxSource/mozilla-release/media/omx-plugin/include/gb/stagefright/MetaData.h:94:27: warning: multi-character character constant [-Wmultichar]
23:18.32 Warning: -Wmultichar in /opt/FirefoxSource/mozilla-release/media/omx-plugin/include/gb/stagefright/MetaData.h: multi-character character constant
23:18.32 /opt/FirefoxSource/mozilla-release/media/omx-plugin/include/gb/stagefright/MetaData.h:95:26: warning: multi-character character constant [-Wmultichar]
23:18.32 Warning: -Wmultichar in /opt/FirefoxSource/mozilla-release/media/omx-plugin/include/gb/stagefright/MetaData.h: multi-character character constant
23:18.32 /opt/FirefoxSource/mozilla-release/media/omx-plugin/include/gb/stagefright/MetaData.h:97:23: warning: multi-character character constant [-Wmultichar]
23:18.32 Warning: -Wmultichar in /opt/FirefoxSource/mozilla-release/media/omx-plugin/include/gb/stagefright/MetaData.h: multi-character character constant
23:18.32 /opt/FirefoxSource/mozilla-release/media/omx-plugin/include/gb/stagefright/MetaData.h:100:20: warning: multi-character character constant [-Wmultichar]
23:18.32 Warning: -Wmultichar in /opt/FirefoxSource/mozilla-release/media/omx-plugin/include/gb/stagefright/MetaData.h: multi-character character constant
23:18.32 /opt/FirefoxSource/mozilla-release/media/omx-plugin/include/gb/stagefright/MetaData.h:102:24: warning: multi-character character constant [-Wmultichar]
23:18.32 Warning: -Wmultichar in /opt/FirefoxSource/mozilla-release/media/omx-plugin/include/gb/stagefright/MetaData.h: multi-character character constant
23:18.32 /opt/FirefoxSource/mozilla-release/media/omx-plugin/include/gb/stagefright/MetaData.h:104:24: warning: multi-character character constant [-Wmultichar]
23:18.32 Warning: -Wmultichar in /opt/FirefoxSource/mozilla-release/media/omx-plugin/include/gb/stagefright/MetaData.h: multi-character character constant
23:18.32 /opt/FirefoxSource/mozilla-release/media/omx-plugin/include/gb/stagefright/MetaData.h:108:17: warning: multi-character character constant [-Wmultichar]
23:18.32 Warning: -Wmultichar in /opt/FirefoxSource/mozilla-release/media/omx-plugin/include/gb/stagefright/MetaData.h: multi-character character constant
23:18.32 /opt/FirefoxSource/mozilla-release/media/omx-plugin/include/gb/stagefright/MetaData.h:109:17: warning: multi-character character constant [-Wmultichar]
23:18.32 Warning: -Wmultichar in /opt/FirefoxSource/mozilla-release/media/omx-plugin/include/gb/stagefright/MetaData.h: multi-character character constant
23:18.33 /opt/FirefoxSource/mozilla-release/media/omx-plugin/include/gb/stagefright/MetaData.h:118:21: warning: multi-character character constant [-Wmultichar]
23:18.33 Warning: -Wmultichar in /opt/FirefoxSource/mozilla-release/media/omx-plugin/include/gb/stagefright/MetaData.h: multi-character character constant
23:18.33 /opt/FirefoxSource/mozilla-release/media/omx-plugin/include/gb/stagefright/MetaData.h:119:25: warning: multi-character character constant [-Wmultichar]
23:18.33 Warning: -Wmultichar in /opt/FirefoxSource/mozilla-release/media/omx-plugin/include/gb/stagefright/MetaData.h: multi-character character constant
23:18.33 /opt/FirefoxSource/mozilla-release/media/omx-plugin/include/gb/stagefright/MetaData.h:120:22: warning: multi-character character constant [-Wmultichar]
23:18.33 Warning: -Wmultichar in /opt/FirefoxSource/mozilla-release/media/omx-plugin/include/gb/stagefright/MetaData.h: multi-character character constant
23:18.33 /opt/FirefoxSource/mozilla-release/media/omx-plugin/include/gb/stagefright/MetaData.h:121:22: warning: multi-character character constant [-Wmultichar]
23:18.33 Warning: -Wmultichar in /opt/FirefoxSource/mozilla-release/media/omx-plugin/include/gb/stagefright/MetaData.h: multi-character character constant
23:18.33 /opt/FirefoxSource/mozilla-release/media/omx-plugin/include/gb/stagefright/MetaData.h:122:22: warning: multi-character character constant [-Wmultichar]
23:18.33 Warning: -Wmultichar in /opt/FirefoxSource/mozilla-release/media/omx-plugin/include/gb/stagefright/MetaData.h: multi-character character constant
23:18.33 /opt/FirefoxSource/mozilla-release/media/omx-plugin/include/gb/stagefright/MetaData.h:123:24: warning: multi-character character constant [-Wmultichar]
23:18.33 libstagefright.so
23:18.37 Unified_cpp_gfx_ots_src0.o
23:18.41 BionicGlue.o
23:18.41 arm.o
23:18.79 OmxPlugin236.o
23:18.80 libmozglue.so
23:18.87 Unified_cpp_gfx_ots_src1.o
23:19.39 OmxPluginHoneycomb.o
23:19.55 libomxplugingb.so
23:19.65 OmxPlugin.o
23:20.30 libomxpluginhc.so
23:20.40 OmxPluginKitKat.o
23:20.44 libomxplugin.so
23:20.54 OmxPlugin235.o
23:21.21 libomxplugingb235.so
23:21.34 libomxpluginkk.so
23:21.47 Unified_cpp_memory_mozalloc0.o
23:21.66 quickder.c: In function 'DecodeItem':
23:21.66 quickder.c:666:12: warning: variable 'optional' set but not used [-Wunused-but-set-variable]
23:21.69 In file included from /opt/FirefoxSource/mozilla-release/objdir-droid/memory/mozalloc/Unified_cpp_memory_mozalloc0.cpp:11:0:
23:21.69 /opt/FirefoxSource/mozilla-release/memory/mozalloc/mozalloc_abort.cpp: In function 'void abort()':
23:21.69 Warning: enabled by default in /opt/FirefoxSource/mozilla-release/memory/mozalloc/mozalloc_abort.cpp: 'noreturn' function does return
23:21.69 /opt/FirefoxSource/mozilla-release/memory/mozalloc/mozalloc_abort.cpp:76:1: warning: 'noreturn' function does return [enabled by default]
23:21.69 libmozalloc.so
23:21.80 nsTestSample.o
23:21.95 derenc.c: In function 'der_encode':
23:21.95 derenc.c:282:22: warning: variable 'optional' set but not used [-Wunused-but-set-variable]
23:22.04 nsTestSample
23:22.72 nssb64e.c: In function 'NSSBase64_EncodeItem_Util':
23:22.72 nssb64e.c:684:15: warning: 'out_len' may be used uninitialized in this function [-Wmaybe-uninitialized]
23:23.76 ocsp.c: In function 'ocsp_RemoveCacheItem':
23:23.76 ocsp.c:562:12: warning: variable 'couldRemoveFromHashTable' set but not used [-Wunused-but-set-variable]
23:24.55 certhigh.c: In function 'CERT_MatchNickname':
23:24.55 certhigh.c:28:9: warning: variable 'len' set but not used [-Wunused-but-set-variable]
23:24.74 secoid.c: In function 'SECOID_Init':
23:24.74 secoid.c:1922:19: warning: variable 'c' set but not used [-Wunused-but-set-variable]
23:25.92 utilmod.c: In function 'nssutil_DeleteSecmodDBEntry.isra.1':
23:25.92 utilmod.c:545:12: warning: 'lib_len' may be used uninitialized in this function [-Wmaybe-uninitialized]
23:26.34 utilpars.c: In function 'nssutil_mkSlotFlags':
23:26.34 utilpars.c:679:17: warning: comparison between signed and unsigned integer expressions [-Wsign-compare]
23:26.34 utilpars.c: In function 'nssutil_mkCipherFlags':
23:26.34 utilpars.c:891:17: warning: comparison between signed and unsigned integer expressions [-Wsign-compare]
23:26.34 utilpars.c:910:17: warning: comparison between signed and unsigned integer expressions [-Wsign-compare]
23:26.66 sechash.c: In function 'HASH_ResultLen':
23:26.66 sechash.c:263:5: warning: comparison of unsigned expression < 0 is always false [-Wtype-limits]
23:26.66 sechash.c: In function 'HASH_HashBuf':
23:26.66 sechash.c:288:5: warning: comparison of unsigned expression < 0 is always false [-Wtype-limits]
23:26.66 sechash.c: In function 'HASH_Create':
23:26.66 sechash.c:310:5: warning: comparison of unsigned expression < 0 is always false [-Wtype-limits]
23:26.83 certvfypkix.c: In function 'setRevocationMethod':
23:26.83 certvfypkix.c:1422:17: warning: comparison between signed and unsigned integer expressions [-Wsign-compare]
23:27.85 pk11akey.c: In function 'pk11_get_Decoded_ECPoint':
23:27.85 pk11akey.c:406:26: warning: comparison between signed and unsigned integer expressions [-Wsign-compare]
23:27.85 pk11akey.c:420:63: warning: comparison between signed and unsigned integer expressions [-Wsign-compare]
23:27.87 libgfx_ots_src.a.desc
23:28.23 alg1485.c: In function 'cert_AVAOidTagToMaxLen':
23:28.23 alg1485.c:162:57: warning: signed and unsigned type in conditional expression [-Wsign-compare]
23:28.23 alg1485.c: In function 'AppendAVA':
23:28.23 alg1485.c:963:40: warning: signed and unsigned type in conditional expression [-Wsign-compare]
23:28.43 certificate.c: In function 'nssCertificateList_DoCallback':
23:28.43 certificate.c:898:14: warning: variable 'nssrv' set but not used [-Wunused-but-set-variable]
23:28.91 pk11cert.c: In function 'pk11_fastCert':
23:28.91 pk11cert.c:231:14: warning: variable 'status' set but not used [-Wunused-but-set-variable]
23:28.91 pk11cert.c: In function 'PK11_TraverseCertsForNicknameInSlot':
23:28.91 pk11cert.c:2008:28: warning: variable 'pk11cb' set but not used [-Wunused-but-set-variable]
23:29.05 certdb.c: In function 'CERT_ImportCerts':
23:29.05 certdb.c:2446:15: warning: variable 'rv' set but not used [-Wunused-but-set-variable]
23:29.05 certdb.c: In function 'CERT_UnlockCertRefCount':
23:29.05 certdb.c:2896:14: warning: variable 'prstat' set but not used [-Wunused-but-set-variable]
23:29.05 certdb.c: In function 'CERT_UnlockCertTrust':
23:29.05 certdb.c:2976:14: warning: variable 'prstat' set but not used [-Wunused-but-set-variable]
23:29.24 trustdomain.c: In function 'NSSTrustDomain_TraverseCertificates':
23:29.24 trustdomain.c:994:14: warning: variable 'status' set but not used [-Wunused-but-set-variable]
23:29.59 tdcache.c: In function 'add_cert_to_cache':
23:29.59 tdcache.c:779:9: warning: variable 'handle' set but not used [-Wunused-but-set-variable]
23:29.60 tdcache.c: In function 'nssTrustDomain_RemoveCertFromCacheLOCKED':
23:29.60 tdcache.c:272:16: warning: 'nickname' may be used uninitialized in this function [-Wmaybe-uninitialized]
23:29.60 tdcache.c:332:14: note: 'nickname' was declared here
23:30.21 crl.c: In function 'crl_storeCRL':
23:30.21 crl.c:630:15: warning: variable 'rv' set but not used [-Wunused-but-set-variable]
23:30.21 crl.c: In function 'cert_CheckCertRevocationStatus':
23:30.21 crl.c:2696:27: warning: unused variable 'rv2' [-Wunused-variable]
23:30.21 crl.c: In function 'cert_CacheCRLByGeneralName':
23:30.21 crl.c:3053:32: warning: variable 'rv2' set but not used [-Wunused-but-set-variable]
23:30.35 pkibase.c: In function 'nssPKIObjectCollection_Traverse':
23:30.35 pkibase.c:906:14: warning: variable 'status' set but not used [-Wunused-but-set-variable]
23:30.35 pkibase.c: In function 'nssCertificateCollection_Create':
23:30.35 pkibase.c:1060:14: warning: variable 'status' set but not used [-Wunused-but-set-variable]
23:30.35 pkibase.c: In function 'nssCRLCollection_Create':
23:30.35 pkibase.c:1167:14: warning: variable 'status' set but not used [-Wunused-but-set-variable]
23:30.84 pki3hack.c: In function 'DeleteCertTrustMatchingSlot':
23:30.84 pki3hack.c:1280:27: warning: comparison between signed and unsigned integer expressions [-Wsign-compare]
23:30.84 pki3hack.c: In function 'STAN_DeleteCertTrustMatchingSlot':
23:30.84 pki3hack.c:1340:19: warning: comparison between signed and unsigned integer expressions [-Wsign-compare]
23:30.98 In file included from pk11load.c:26:0:
23:30.98 debug_module.c: In function 'log_handle':
23:30.98 debug_module.c:339:28: warning: comparison between signed and unsigned integer expressions [-Wsign-compare]
23:30.98 debug_module.c:343:28: warning: comparison between signed and unsigned integer expressions [-Wsign-compare]
23:30.98 pk11load.c: In function 'SECMOD_UnloadModule':
23:30.98 pk11load.c:592:28: warning: unused variable 'status' [-Wunused-variable]
23:31.59 devtoken.c: In function 'nssToken_TraverseCertificates':
23:31.59 devtoken.c:1469:14: warning: variable 'status' set but not used [-Wunused-but-set-variable]
23:31.86 pk11merge.c: In function 'pk11_matchAcrossTokens':
23:31.86 pk11merge.c:100:32: warning: comparison between signed and unsigned integer expressions [-Wsign-compare]
23:32.19 ckhelper.c: In function 'nssCKObject_GetAttributes':
23:32.20 ckhelper.c:139:36: warning: comparison between signed and unsigned integer expressions [-Wsign-compare]
23:32.20 ckhelper.c: In function 'nssCryptokiTrust_GetAttributes':
23:32.20 ckhelper.c:442:36: warning: comparison between signed and unsigned integer expressions [-Wsign-compare]
23:32.90 pk11obj.c: In function 'PK11_MatchItem':
23:32.90 pk11obj.c:1799:72: warning: comparison between signed and unsigned integer expressions [-Wsign-compare]
23:32.90 pk11obj.c:1784:22: warning: variable 'parent' set but not used [-Wunused-but-set-variable]
23:33.15 list.c: In function 'nssList_Add':
23:33.15 list.c:220:14: warning: variable 'nssrv' set but not used [-Wunused-but-set-variable]
23:33.35 pk11pars.c: In function 'secmod_ParseModuleSpecForTokens':
23:33.35 pk11pars.c:364:47: warning: suggest braces around empty body in an 'else' statement [-Wempty-body]
23:33.35 pk11pars.c:366:47: warning: suggest braces around empty body in an 'else' statement [-Wempty-body]
23:33.35 pk11pars.c:375:6: warning: suggest braces around empty body in an 'else' statement [-Wempty-body]
23:33.35 pk11pars.c:384:7: warning: suggest braces around empty body in an 'else' statement [-Wempty-body]
23:33.35 pk11pars.c:393:7: warning: suggest braces around empty body in an 'else' statement [-Wempty-body]
23:33.35 pk11pars.c:402:7: warning: suggest braces around empty body in an 'else' statement [-Wempty-body]
23:33.35 pk11pars.c: In function 'secmod_MkAppendTokensList':
23:33.35 pk11pars.c:767:13: warning: comparison between signed and unsigned integer expressions [-Wsign-compare]
23:33.35 pk11pars.c:804:13: warning: comparison between signed and unsigned integer expressions [-Wsign-compare]
23:33.92 pk11pk12.c: In function 'PK11_ImportPrivateKeyInfoAndReturnKey':
23:33.92 pk11pk12.c:425:17: warning: variable 'keyType' set but not used [-Wunused-but-set-variable]
23:34.15 pk11pqg.c: In function 'PK11_PQG_ParamGenSeedLen':
23:34.15 pk11pqg.c:230:56: warning: signed and unsigned type in conditional expression [-Wsign-compare]
23:34.15 pk11pqg.c: In function 'PK11_PQG_ParamGen':
23:34.15 pk11pqg.c:241:56: warning: signed and unsigned type in conditional expression [-Wsign-compare]
23:34.15 pk11pqg.c: In function 'PK11_PQG_VerifyParams':
23:34.15 pk11pqg.c:295:19: warning: comparison between signed and unsigned integer expressions [-Wsign-compare]
23:35.21 pk11skey.c: In function 'pk11_TokenKeyGenWithFlagsAndKeyType':
23:35.21 pk11skey.c:926:17: warning: comparison between signed and unsigned integer expressions [-Wsign-compare]
23:35.21 pk11skey.c: In function 'pk11_HandUnwrap':
23:35.21 pk11skey.c:2296:40: warning: signed and unsigned type in conditional expression [-Wsign-compare]
23:35.23 pkix_revocationchecker.c: In function 'PKIX_RevocationChecker_Check':
23:35.23 pkix_revocationchecker.c:353:25: warning: comparison between signed and unsigned integer expressions [-Wsign-compare]
23:35.84 pk11util.c: In function 'SECMOD_UpdateSlotList':
23:35.84 pk11util.c:931:15: warning: comparison between signed and unsigned integer expressions [-Wsign-compare]
23:36.14 pk11slot.c: In function 'PK11_InitToken':
23:36.14 pk11slot.c:1108:11: warning: variable 'tmp' set but not used [-Wunused-but-set-variable]
23:36.14 pk11slot.c: In function 'PK11_InitSlot':
23:36.14 pk11slot.c:1352:11: warning: variable 'tmp' set but not used [-Wunused-but-set-variable]
23:36.14 pk11slot.c: In function 'PK11_GetBestSlotMultipleWithAttributes':
23:36.14 pk11slot.c:2076:17: warning: comparison between signed and unsigned integer expressions [-Wsign-compare]
23:36.14 pk11slot.c:2094:18: warning: comparison between signed and unsigned integer expressions [-Wsign-compare]
23:36.14 pk11slot.c: In function 'PK11_ResetToken':
23:36.14 pk11slot.c:2317:22: warning: comparison between signed and unsigned integer expressions [-Wsign-compare]
23:36.14 pk11slot.c:2322:22: warning: comparison between signed and unsigned integer expressions [-Wsign-compare]
23:37.28 ShowSSEConfig.o
23:37.33 ShowSSEConfig
23:37.46 libgkmedias.a.desc
23:37.49 pkix_tools.c: In function 'pkix_i2hex':
23:37.49 pkix_tools.c:482:9: warning: comparison is always true due to limited range of data type [-Wtype-limits]
23:39.13 pkix_build.c: In function 'pkix_Build_SelectCertsFromTrustAnchors':
23:39.13 pkix_build.c:1548:38: warning: comparison between signed and unsigned integer expressions [-Wsign-compare]
23:39.15 pkix_errpaths.c: In function 'PKIX_DoReturn':
23:39.15 pkix_errpaths.c:58:2: warning: suggest braces around empty body in an 'if' statement [-Wempty-body]
23:40.58 pkix_pl_cert.c: In function 'PKIX_PL_Cert_Create':
23:40.58 pkix_pl_cert.c:1518:22: warning: variable 'copyDER' set but not used [-Wunused-but-set-variable]
23:40.61 pkix_pl_lifecycle.c: In function 'pkix_pl_lifecycle_ObjectLeakCheck':
23:40.61 pkix_pl_lifecycle.c:87:55: warning: comparison between signed and unsigned integer expressions [-Wsign-compare]
23:40.61 pkix_pl_lifecycle.c: In function 'PKIX_PL_Shutdown':
23:40.61 pkix_pl_lifecycle.c:248:21: warning: variable 'numLeakedObjects' set but not used [-Wunused-but-set-variable]
23:41.41 pkix_pl_httpdefaultclient.c: In function 'pkix_pl_HttpDefaultClient_HdrCheckComplete':
23:41.41 pkix_pl_httpdefaultclient.c:268:32: warning: comparison between signed and unsigned integer expressions [-Wsign-compare]
23:41.41 pkix_pl_httpdefaultclient.c:285:41: warning: comparison between signed and unsigned integer expressions [-Wsign-compare]
23:41.41 pkix_pl_httpdefaultclient.c:293:40: warning: comparison between signed and unsigned integer expressions [-Wsign-compare]
23:41.41 pkix_pl_httpdefaultclient.c: In function 'pkix_pl_HttpDefaultClient_RecvBody':
23:41.41 pkix_pl_httpdefaultclient.c:925:39: warning: comparison between signed and unsigned integer expressions [-Wsign-compare]
23:41.41 pkix_pl_httpdefaultclient.c:940:31: warning: comparison between signed and unsigned integer expressions [-Wsign-compare]
23:41.41 pkix_pl_httpdefaultclient.c:945:31: warning: comparison between signed and unsigned integer expressions [-Wsign-compare]
23:41.41 pkix_pl_httpdefaultclient.c:951:38: warning: comparison between signed and unsigned integer expressions [-Wsign-compare]
23:41.41 pkix_pl_httpdefaultclient.c:995:39: warning: comparison between signed and unsigned integer expressions [-Wsign-compare]
23:41.41 pkix_pl_httpdefaultclient.c:1005:43: warning: comparison between signed and unsigned integer expressions [-Wsign-compare]
23:41.41 pkix_pl_httpdefaultclient.c: In function 'pkix_pl_HttpDefaultClient_KeepAliveSession':
23:41.41 pkix_pl_httpdefaultclient.c:1135:36: warning: variable 'client' set but not used [-Wunused-but-set-variable]
23:41.41 pkix_pl_httpdefaultclient.c: In function 'pkix_pl_HttpDefaultClient_TrySendAndReceive':
23:41.41 pkix_pl_httpdefaultclient.c:1429:63: warning: comparison between signed and unsigned integer expressions [-Wsign-compare]
23:41.41 pkix_pl_httpdefaultclient.c: In function 'pkix_pl_HttpDefaultClient_Cancel':
23:41.41 pkix_pl_httpdefaultclient.c:1487:36: warning: variable 'client' set but not used [-Wunused-but-set-variable]
23:41.84 pkix_pl_object.c: In function 'pkix_pl_Object_GetHeader':
23:41.84 pkix_pl_object.c:115:34: warning: comparison between signed and unsigned integer expressions [-Wsign-compare]
23:42.07 pkix_pl_crl.c: In function 'pkix_pl_CRL_ToString':
23:42.07 pkix_pl_crl.c:455:58: warning: 'crlVersion' may be used uninitialized in this function [-Wmaybe-uninitialized]
23:42.07 pkix_pl_crl.c:354:21: note: 'crlVersion' was declared here
23:42.25 libdombindings_test_s.a.desc
23:42.71 pkix_pl_ldaprequest.c: In function 'pkix_pl_LdapRequest_Destroy':
23:42.71 pkix_pl_ldaprequest.c:266:30: warning: variable 'ldapRq' set but not used [-Wunused-but-set-variable]
23:43.48 pkix_pl_ldapdefaultclient.c: In function 'pkix_pl_LdapDefaultClient_VerifyBindResponse':
23:43.48 pkix_pl_ldapdefaultclient.c:371:21: warning: '*((void *)&msg+16).resultCode.data' may be used uninitialized in this function [-Wmaybe-uninitialized]
23:43.48 pkix_pl_ldapdefaultclient.c:354:21: note: '*((void *)&msg+16).resultCode.data' was declared here
23:43.50 nssinit.c: In function 'NSS_VersionCheck':
23:43.50 nssinit.c:1250:19: warning: variable 'c' set but not used [-Wunused-but-set-variable]
23:44.02 dtlscon.c: In function 'ssl3_DisableNonDTLSSuites':
23:44.02 dtlscon.c:107:19: warning: unused variable 'rv' [-Wunused-variable]
23:44.02 dtlscon.c: In function 'dtls_HandleHandshake':
23:44.02 dtlscon.c:399:37: warning: comparison between signed and unsigned integer expressions [-Wsign-compare]
23:44.02 dtlscon.c:428:48: warning: comparison between signed and unsigned integer expressions [-Wsign-compare]
23:44.02 dtlscon.c: In function 'dtls_TransmitMessageFlight':
23:44.02 dtlscon.c:679:60: warning: comparison between signed and unsigned integer expressions [-Wsign-compare]
23:44.02 dtlscon.c:679:120: warning: signed and unsigned type in conditional expression [-Wsign-compare]
23:44.02 dtlscon.c:717:26: warning: comparison between signed and unsigned integer expressions [-Wsign-compare]
23:44.02 dtlscon.c: In function 'dtls_SetMTU':
23:44.02 dtlscon.c:952:19: warning: comparison between signed and unsigned integer expressions [-Wsign-compare]
23:44.36 pkix_pl_publickey.c: In function 'pkix_pl_PublicKey_Hashcode':
23:44.36 pkix_pl_publickey.c:214:21: warning: variable 'fullHash' set but not used [-Wunused-but-set-variable]
23:44.38 pkix_pl_pk11certstore.c: In function 'NameCacheHasFetchedCrlInfo':
23:44.38 pkix_pl_pk11certstore.c:382:22: warning: variable 'cert' set but not used [-Wunused-but-set-variable]
23:44.38 pkix_pl_pk11certstore.c: In function 'RemovePartitionedDpsFromList':
23:44.38 pkix_pl_pk11certstore.c:701:20: warning: comparison between signed and unsigned integer expressions [-Wsign-compare]
23:44.38 pkix_pl_pk11certstore.c: In function 'DownloadCrl':
23:44.38 pkix_pl_pk11certstore.c:782:16: warning: variable 'savedError' set but not used [-Wunused-but-set-variable]
23:45.13 certread.c: In function 'CERT_DecodeCertPackage':
23:45.13 certread.c:419:16: warning: comparison between signed and unsigned integer expressions [-Wsign-compare]
23:45.13 certread.c:447:13: warning: comparison between signed and unsigned integer expressions [-Wsign-compare]
23:45.61 p12e.c: In function 'sec_PKCS12CreateSafeBag':
23:45.61 p12e.c:698:12: warning: variable 'setName' set but not used [-Wunused-but-set-variable]
23:45.61 p12e.c: In function 'sec_pkcs12_encoder_start_context':
23:45.61 p12e.c:1535:12: warning: variable 'rv' set but not used [-Wunused-but-set-variable]
23:46.04 cmscipher.c: In function 'NSS_CMSCipherContext_Decrypt':
23:46.04 cmscipher.c:525:28: warning: comparison between signed and unsigned integer expressions [-Wsign-compare]
23:46.25 p7decode.c: In function 'sec_pkcs7_verify_signature':
23:46.25 p7decode.c:1293:21: warning: variable 'crls' set but not used [-Wunused-but-set-variable]
23:46.47 p12d.c: In function 'SEC_PKCS12DecoderRenameCertNicknames':
23:46.47 p12d.c:2813:5: warning: suggest parentheses around assignment used as truth value [-Wparentheses]
23:46.56 p7encode.c: In function 'sec_pkcs7_encoder_start_encrypt':
23:46.56 p7encode.c:62:18: warning: variable 'wincx' set but not used [-Wunused-but-set-variable]
23:46.68 /opt/FirefoxSource/mozilla-release/config/external/nss/nss.def: WARNING: no preprocessor directives found
23:46.82 p7local.c: In function 'sec_PKCS7Decrypt':
23:46.82 p7local.c:556:28: warning: comparison between signed and unsigned integer expressions [-Wsign-compare]
23:46.83 /opt/FirefoxSource/mozilla-release/config/external/nss/nspr-dummy.def: WARNING: no preprocessor directives found
23:46.88 cmsencode.c: In function 'nss_cms_encoder_notify':
23:46.88 cmsencode.c:125:18: warning: variable 'poolp' set but not used [-Wunused-but-set-variable]
23:46.88 cmsencode.c: In function 'nss_cms_before_data':
23:46.88 cmsencode.c:204:18: warning: variable 'poolp' set but not used [-Wunused-but-set-variable]
23:46.91 ssl3con.c: In function 'ssl3_CompressMACEncryptRecord':
23:46.91 ssl3con.c:2559:12: warning: comparison between signed and unsigned integer expressions [-Wsign-compare]
23:46.91 ssl3con.c: In function 'ssl3_FlushHandshakeMessages':
23:46.91 ssl3con.c:3122:19: warning: comparison between signed and unsigned integer expressions [-Wsign-compare]
23:46.91 ssl3con.c: In function 'ssl3_HandleClientHello':
23:46.91 ssl3con.c:7781:23: warning: comparison between signed and unsigned integer expressions [-Wsign-compare]
23:46.91 ssl3con.c:8285:28: warning: comparison between signed and unsigned integer expressions [-Wsign-compare]
23:46.92 ssl3con.c: In function 'ssl3_HandleRSAClientKeyExchange':
23:46.92 ssl3con.c:9211:13: warning: variable 'pmsItem' set but not used [-Wunused-but-set-variable]
23:46.92 ssl3con.c:9207:12: warning: variable 'isTLS' set but not used [-Wunused-but-set-variable]
23:46.92 ssl3con.c: In function 'ssl3_HandleCertificateStatus':
23:46.92 ssl3con.c:9779:13: warning: comparison between signed and unsigned integer expressions [-Wsign-compare]
23:46.92 ssl3con.c: In function 'ssl3_HandleHandshakeMessage':
23:46.92 ssl3con.c:6950:22: warning: 'preferSha1' may be used uninitialized in this function [-Wmaybe-uninitialized]
23:46.92 ssl3con.c:6916:12: note: 'preferSha1' was declared here
23:46.92 ssl3con.c: In function 'ssl3_HandleRecord':
23:46.92 ssl3con.c:11589:21: warning: 'dtls_seq_num' may be used uninitialized in this function [-Wmaybe-uninitialized]
23:46.92 ssl3con.c:11309:14: note: 'dtls_seq_num' was declared here
23:47.05 ssl3gthr.c: In function 'ssl3_GatherData':
23:47.05 ssl3gthr.c:75:9: warning: comparison between signed and unsigned integer expressions [-Wsign-compare]
23:47.11 sslauth.c: In function 'SSL_AuthCertificate':
23:47.11 sslauth.c:267:18: warning: unused variable 'error' [-Wunused-variable]
23:47.35 cmsrecinfo.c: In function 'NSS_CMSRecipientInfo_UnwrapBulkKey':
23:47.35 cmsrecinfo.c:529:21: warning: variable 'encalg' set but not used [-Wunused-but-set-variable]
23:47.90 smimeutil.c: In function 'NSSSMIME_VersionCheck':
23:47.90 smimeutil.c:772:19: warning: variable 'c' set but not used [-Wunused-but-set-variable]
23:47.97 sslcon.c: In function 'ssl2_SendClear':
23:47.98 sslcon.c:865:17: warning: comparison between signed and unsigned integer expressions [-Wsign-compare]
23:47.98 sslcon.c:894:19: warning: comparison between signed and unsigned integer expressions [-Wsign-compare]
23:47.98 sslcon.c: In function 'ssl2_SendStream':
23:47.98 sslcon.c:944:13: warning: comparison between signed and unsigned integer expressions [-Wsign-compare]
23:47.98 sslcon.c:991:19: warning: comparison between signed and unsigned integer expressions [-Wsign-compare]
23:47.98 sslcon.c: In function 'ssl2_SendBlock':
23:47.98 sslcon.c:1058:13: warning: comparison between signed and unsigned integer expressions [-Wsign-compare]
23:47.98 sslcon.c: In function 'ssl2_ServerSetupSessionCypher':
23:47.98 sslcon.c:1624:15: warning: comparison between signed and unsigned integer expressions [-Wsign-compare]
23:47.98 sslcon.c:1648:20: warning: comparison between signed and unsigned integer expressions [-Wsign-compare]
23:47.98 sslcon.c: In function 'ssl2_HandleMessage':
23:47.98 sslcon.c:2498:9: warning: variable 'rv2' set but not used [-Wunused-but-set-variable]
23:47.98 sslcon.c: In function 'ssl2_HandleServerHelloMessage':
23:47.98 sslcon.c:2802:51: warning: comparison between signed and unsigned integer expressions [-Wsign-compare]
23:47.98 sslcon.c:2813:16: warning: comparison between signed and unsigned integer expressions [-Wsign-compare]
23:47.98 sslcon.c:2815:23: warning: comparison between signed and unsigned integer expressions [-Wsign-compare]
23:47.98 sslcon.c:2815:65: warning: signed and unsigned type in conditional expression [-Wsign-compare]
23:47.98 sslcon.c: In function 'NSSSSL_VersionCheck':
23:47.98 sslcon.c:3687:19: warning: variable 'c' set but not used [-Wunused-but-set-variable]
23:48.37 crmfpop.c: In function 'CRMF_CertReqMsgSetRAVerifiedPOP':
23:48.37 crmfpop.c:36:14: warning: variable 'dummy' set but not used [-Wunused-but-set-variable]
23:48.37 crmfpop.c: In function 'crmf_generic_encoder_callback':
23:48.37 crmfpop.c:119:38: warning: comparison between signed and unsigned integer expressions [-Wsign-compare]
23:48.37 crmfpop.c: In function 'crmf_encode_popoprivkey':
23:48.37 crmfpop.c:349:33: warning: comparison between signed and unsigned integer expressions [-Wsign-compare]
23:48.65 basicutil.c: In function 'SECU_PrintPRandOSError':
23:48.65 basicutil.c:628:30: warning: comparison between signed and unsigned integer expressions [-Wsign-compare]
23:48.65 basicutil.c:632:30: warning: comparison between signed and unsigned integer expressions [-Wsign-compare]
23:48.65 basicutil.c: In function 'SECU_SECItemHexStringToBinary':
23:48.65 basicutil.c:705:16: warning: comparison between signed and unsigned integer expressions [-Wsign-compare]
23:48.65 basicutil.c:716:16: warning: comparison between signed and unsigned integer expressions [-Wsign-compare]
23:48.65 basicutil.c: In function 'SECU_PrintAsHex':
23:48.65 basicutil.c:286:13: warning: 'column' may be used uninitialized in this function [-Wmaybe-uninitialized]
23:48.73 crmfcont.c: In function 'CRMF_CreateEncryptedKeyWithEncryptedValue':
23:48.73 crmfcont.c:860:25: warning: variable 'dummy' set but not used [-Wunused-but-set-variable]
23:48.73 ssl3ext.c: In function 'arrayContainsExtension':
23:48.73 ssl3ext.c:310:19: warning: comparison between signed and unsigned integer expressions [-Wsign-compare]
23:48.73 ssl3ext.c: In function 'ssl3_HandleServerNameXtn':
23:48.73 ssl3ext.c:417:43: warning: comparison between signed and unsigned integer expressions [-Wsign-compare]
23:48.73 ssl3ext.c:425:17: warning: variable 'type' set but not used [-Wunused-but-set-variable]
23:48.73 ssl3ext.c:457:22: warning: comparison between signed and unsigned integer expressions [-Wsign-compare]
23:48.73 ssl3ext.c:458:31: warning: comparison between signed and unsigned integer expressions [-Wsign-compare]
23:48.73 ssl3ext.c: In function 'ssl3_SendSessionTicketXtn':
23:48.73 ssl3ext.c:538:28: warning: comparison between signed and unsigned integer expressions [-Wsign-compare]
23:48.73 ssl3ext.c:561:25: warning: comparison between signed and unsigned integer expressions [-Wsign-compare]
23:48.73 ssl3ext.c: In function 'ssl3_ServerHandleAppProtoXtn':
23:48.73 ssl3ext.c:681:15: warning: comparison between signed and unsigned integer expressions [-Wsign-compare]
23:48.73 ssl3ext.c: In function 'ssl3_ClientSendNextProtoNegoXtn':
23:48.73 ssl3ext.c:782:28: warning: comparison between signed and unsigned integer expressions [-Wsign-compare]
23:48.73 ssl3ext.c:792:25: warning: comparison between signed and unsigned integer expressions [-Wsign-compare]
23:48.73 ssl3ext.c: In function 'ssl3_ClientSendAppProtoXtn':
23:48.73 ssl3ext.c:817:28: warning: comparison between signed and unsigned integer expressions [-Wsign-compare]
23:48.73 ssl3ext.c:857:25: warning: comparison between signed and unsigned integer expressions [-Wsign-compare]
23:48.73 ssl3ext.c: In function 'ssl3_ServerSendAppProtoXtn':
23:48.74 ssl3ext.c:886:28: warning: comparison between signed and unsigned integer expressions [-Wsign-compare]
23:48.74 ssl3ext.c:905:25: warning: comparison between signed and unsigned integer expressions [-Wsign-compare]
23:48.74 ssl3ext.c: In function 'ssl3_ServerSendStatusRequestXtn':
23:48.74 ssl3ext.c:953:28: warning: comparison between signed and unsigned integer expressions [-Wsign-compare]
23:48.74 ssl3ext.c: In function 'ssl3_ClientSendStatusRequestXtn':
23:48.74 ssl3ext.c:986:28: warning: comparison between signed and unsigned integer expressions [-Wsign-compare]
23:48.74 ssl3ext.c:1014:25: warning: comparison between signed and unsigned integer expressions [-Wsign-compare]
23:48.74 ssl3ext.c: In function 'ssl3_SendNewSessionTicket':
23:48.74 ssl3ext.c:1250:19: warning: comparison between signed and unsigned integer expressions [-Wsign-compare]
23:48.74 ssl3ext.c: In function 'ssl3_ServerHandleSessionTicketXtn':
23:48.74 ssl3ext.c:1589:23: warning: comparison between signed and unsigned integer expressions [-Wsign-compare]
23:48.74 ssl3ext.c: In function 'ssl3_SendRenegotiationInfoXtn':
23:48.74 ssl3ext.c:1983:28: warning: comparison between signed and unsigned integer expressions [-Wsign-compare]
23:48.74 ssl3ext.c: In function 'ssl3_ClientSendSigAlgsXtn':
23:48.74 ssl3ext.c:2358:28: warning: comparison between signed and unsigned integer expressions [-Wsign-compare]
23:48.74 ssl3ext.c:2372:25: warning: comparison between signed and unsigned integer expressions [-Wsign-compare]
23:48.74 ssl3ext.c: In function 'ssl3_ClientSendDraftVersionXtn':
23:48.74 ssl3ext.c:2448:28: warning: comparison between signed and unsigned integer expressions [-Wsign-compare]
23:48.74 ssl3ext.c:2461:25: warning: comparison between signed and unsigned integer expressions [-Wsign-compare]
23:48.91 jarsign.c: In function 'jar_create_pk7':
23:48.91 jarsign.c:174:11: warning: variable 'errstring' set but not used [-Wunused-but-set-variable]
23:49.18 jar.c: In function 'JAR_find_next':
23:49.18 jar.c:423:30: warning: comparison between signed and unsigned integer expressions [-Wsign-compare]
23:49.18 jar.c: In function 'jar_find_first_cert':
23:49.18 jar.c:462:24: warning: comparison between signed and unsigned integer expressions [-Wsign-compare]
23:49.31 cmmfchal.c: In function 'cmmf_create_witness_and_challenge':
23:49.31 cmmfchal.c:33:22: warning: variable 'id' set but not used [-Wunused-but-set-variable]
23:49.62 jarfile.c: In function 'jar_physical_inflate':
23:49.62 jarfile.c:341:32: warning: comparison between signed and unsigned integer expressions [-Wsign-compare]
23:49.62 jarfile.c:356:38: warning: comparison between signed and unsigned integer expressions [-Wsign-compare]
23:49.62 jarfile.c: In function 'jar_extract_mf':
23:49.62 jarfile.c:578:14: warning: comparison between signed and unsigned integer expressions [-Wsign-compare]
23:49.63 jarfile.c: In function 'jar_listzip':
23:49.63 jarfile.c:702:47: warning: comparison between signed and unsigned integer expressions [-Wsign-compare]
23:49.63 jarfile.c:768:43: warning: comparison between signed and unsigned integer expressions [-Wsign-compare]
23:49.63 jarfile.c: In function 'jar_listtar':
23:49.63 jarfile.c:830:45: warning: comparison between signed and unsigned integer expressions [-Wsign-compare]
23:49.63 jarfile.c:824:12: warning: variable 'when' set but not used [-Wunused-but-set-variable]
23:49.63 jarfile.c:823:14: warning: variable 'mode' set but not used [-Wunused-but-set-variable]
23:49.81 secutil.c: In function 'SECU_ChangePW2':
23:49.82 secutil.c:336:15: warning: variable 'rv' set but not used [-Wunused-but-set-variable]
23:49.82 secutil.c: In function 'SECU_PrintDumpDerIssuerAndSerial':
23:49.82 secutil.c:1554:19: warning: comparison between signed and unsigned integer expressions [-Wsign-compare]
23:49.82 secutil.c: In function 'SECU_PrintCertificateBasicInfo':
23:49.82 secutil.c:2420:9: warning: unused variable 'iv' [-Wunused-variable]
23:49.82 secutil.c: In function 'secu_PrintPKCS7Signed':
23:49.82 secutil.c:2746:11: warning: passing argument 5 of 'SECU_PrintSignedData' from incompatible pointer type [enabled by default]
23:49.82 In file included from secutil.c:19:0:
23:49.82 secutil.h:263:12: note: expected 'SECU_PPFunc' but argument is of type 'int (*)(struct FILE *, const struct SECItem *, const char *, int)'
23:49.82 secutil.c: In function 'secu_PrintPKCS7SignedAndEnveloped':
23:49.82 secutil.c:2865:11: warning: passing argument 5 of 'SECU_PrintSignedData' from incompatible pointer type [enabled by default]
23:49.82 In file included from secutil.c:19:0:
23:49.82 secutil.h:263:12: note: expected 'SECU_PPFunc' but argument is of type 'int (*)(struct FILE *, const struct SECItem *, const char *, int)'
23:49.82 secutil.c: In function 'SEC_PrintCertificateAndTrust':
23:49.82 secutil.c:3195:10: warning: passing argument 5 of 'SECU_PrintSignedData' from incompatible pointer type [enabled by default]
23:49.82 secutil.c:3168:5: note: expected 'SECU_PPFunc' but argument is of type 'int (*)(struct FILE *, const struct SECItem *, const char *, int)'
23:49.82 secutil.c: In function 'SECU_StoreCRL':
23:49.82 secutil.c:3367:62: warning: comparison between signed and unsigned integer expressions [-Wsign-compare]
23:50.00 sslsecur.c: In function 'SSL_ConfigSecureServerWithCertChain':
23:50.00 sslsecur.c:847:5: warning: comparison of unsigned expression < 0 is always false [-Wtype-limits]
23:50.00 sslsecur.c: In function 'ssl_SecureRecv':
23:50.00 sslsecur.c:1180:22: warning: variable 'sec' set but not used [-Wunused-but-set-variable]
23:50.17 derprint.c: In function 'prettyPrintLength':
23:50.17 derprint.c:454:20: warning: comparison between signed and unsigned integer expressions [-Wsign-compare]
23:50.75 sslinfo.c: In function 'SSL_DisableDefaultExportCipherSuites':
23:50.75 sslinfo.c:247:15: warning: variable 'rv' set but not used [-Wunused-but-set-variable]
23:50.75 sslinfo.c: In function 'SSL_DisableExportCipherSuites':
23:50.75 sslinfo.c:268:15: warning: variable 'rv' set but not used [-Wunused-but-set-variable]
23:50.95 ssl3ecc.c: In function 'ssl3_DisableECCSuites':
23:50.95 ssl3ecc.c:969:19: warning: unused variable 'rv' [-Wunused-variable]
23:50.95 ssl3ecc.c: In function 'ssl3_SendSupportedCurvesXtn':
23:50.95 ssl3ecc.c:1130:28: warning: comparison between signed and unsigned integer expressions [-Wsign-compare]
23:50.95 ssl3ecc.c: In function 'ssl3_HandleSupportedCurvesXtn':
23:50.95 ssl3ecc.c:1238:35: warning: comparison between signed and unsigned integer expressions [-Wsign-compare]
23:51.07 sslsock.c: In function 'ssl_WriteV':
23:51.07 sslsock.c:2524:30: warning: comparison between signed and unsigned integer expressions [-Wsign-compare]
23:51.07 sslsock.c:2537:68: warning: comparison between signed and unsigned integer expressions [-Wsign-compare]
23:51.07 sslsock.c:2556:28: warning: comparison between signed and unsigned integer expressions [-Wsign-compare]
23:51.07 sslsock.c:2556:59: warning: signed and unsigned type in conditional expression [-Wsign-compare]
23:51.07 sslsock.c:2559:23: warning: comparison between signed and unsigned integer expressions [-Wsign-compare]
23:51.07 sslsock.c:2565:56: warning: comparison between signed and unsigned integer expressions [-Wsign-compare]
23:51.09 libnss3.so
23:53.95 shlibsign.c: In function 'writeItem':
23:53.95 shlibsign.c:150:22: warning: comparison between signed and unsigned integer expressions [-Wsign-compare]
23:53.95 shlibsign.c: In function 'main':
23:53.95 shlibsign.c:908:40: warning: comparison between signed and unsigned integer expressions [-Wsign-compare]
23:53.96 cd mangle; /usr/bin/make libs
23:54.52 pk12util.c: In function 'P12U_ListPKCS12File':
23:54.52 pk12util.c:759:30: warning: passing argument 5 of 'SECU_PrintSignedData' from incompatible pointer type [enabled by default]
23:54.52 In file included from pk12util.c:11:0:
23:54.52 /opt/FirefoxSource/mozilla-release/objdir-droid/dist/private/nss/secutil.h:263:12: note: expected 'SECU_PPFunc' but argument is of type 'int (*)(struct FILE *, const struct SECItem *, const char *, int)'
23:54.74 loader.c: In function 'freebl_LoadDSO':
23:54.74 loader.c:135:14: warning: variable 'status' set but not used [-Wunused-but-set-variable]
23:54.74 loader.c: In function 'BL_Unload':
23:54.74 loader.c:904:20: warning: unused variable 'status' [-Wunused-variable]
23:54.76 mkdir: das Verzeichnis „/opt/FirefoxSource/mozilla-release/objdir-droid/security/nss/lib/freebl“ kann nicht angelegt werden: Die Datei existiert bereits
23:54.77 keystuff.c: In function 'UpdateRNG':
23:54.77 keystuff.c:96:18: warning: comparison between signed and unsigned integer expressions [-Wsign-compare]
23:54.93 ldvector.c: In function 'FREEBL_GetVector':
23:54.93 ldvector.c:301:19: warning: variable 'c' set but not used [-Wunused-but-set-variable]
23:55.54 token.c: In function 'nssCKFWToken_GetUTCTime':
23:55.54 token.c:1261:27: warning: variable 'z' set but not used [-Wunused-but-set-variable]
23:56.20 pk11.c: In function 'ListModule':
23:56.20 pk11.c:612:16: warning: comparison between signed and unsigned integer expressions [-Wsign-compare]
23:56.35 ytab.c: In function 'Pk11Install_yyparse':
23:56.35 ytab.c:219:5: warning: suggest parentheses around assignment used as truth value [-Wparentheses]
23:56.44 cd builtins; /usr/bin/make libs
23:56.80 lex.Pk11Install_yy.cpp:1060:13: warning: 'Pkcs11Install_yyunput' defined but not used [-Wunused-function]
23:56.80 lex.Pk11Install_yy.cpp:1106:12: warning: 'input' defined but not used [-Wunused-function]
23:56.94 binst.c: In function 'builtins_mdInstance_GetLibraryVersion':
23:56.94 binst.c:70:17: warning: variable 'c' set but not used [-Wunused-but-set-variable]
23:56.95 bfind.c: In function 'builtins_attrmatch':
23:56.95 bfind.c:122:11: warning: comparison between signed and unsigned integer expressions [-Wsign-compare]
23:57.30 rawhash.c: In function 'HASH_GetRawHashObject':
23:57.30 rawhash.c:156:5: warning: comparison of unsigned expression < 0 is always false [-Wtype-limits]
23:57.71 sha512.c: In function 'SHA512_Compress':
23:57.71 sha512.c:933:14: warning: unused variable 't1' [-Wunused-variable]
23:57.71 sha512.c:955:18: warning: unused variable 't2' [-Wunused-variable]
23:57.71 sha512.c:955:14: warning: unused variable 't1' [-Wunused-variable]
23:57.71 sha512.c: In function 'SHA512_End':
23:57.71 sha512.c:1229:14: warning: unused variable 't1' [-Wunused-variable]
23:57.71 sha512.c: In function 'SHA512_EndRaw':
23:57.72 sha512.c:1274:14: warning: unused variable 't1' [-Wunused-variable]
23:57.92 cts.c: In function 'CTS_DecryptUpdate':
23:57.92 cts.c:226:23: warning: comparison between signed and unsigned integer expressions [-Wsign-compare]
23:58.08 gcm.c: In function 'gcm_getX':
23:58.08 gcm.c:223:13: warning: comparison between signed and unsigned integer expressions [-Wsign-compare]
23:58.31 dh.c: In function 'DH_Derive':
23:58.31 dh.c:271:13: warning: comparison between signed and unsigned integer expressions [-Wsign-compare]
23:58.44 ec.c: In function 'ec_points_mul':
23:58.44 ec.c:89:17: warning: comparison between signed and unsigned integer expressions [-Wsign-compare]
23:58.44 ec.c: In function 'EC_ValidatePublicKey':
23:58.45 ec.c:450:33: warning: comparison between signed and unsigned integer expressions [-Wsign-compare]
23:58.49 ecdecode.c: In function 'gf_populate_params':
23:58.49 ecdecode.c:120:5: warning: comparison of unsigned expression < 0 is always false [-Wtype-limits]
23:58.68 dsa.c: In function 'DSA_VerifyDigest':
23:58.68 dsa.c:518:25: warning: comparison between signed and unsigned integer expressions [-Wsign-compare]
23:58.68 dsa.c:530:27: warning: comparison between signed and unsigned integer expressions [-Wsign-compare]
23:58.92 pqg.c: In function 'makePrimefromPrimesShaweTaylor':
23:58.92 pqg.c:617:34: warning: comparison between signed and unsigned integer expressions [-Wsign-compare]
23:58.92 pqg.c:687:28: warning: comparison between signed and unsigned integer expressions [-Wsign-compare]
23:58.92 pqg.c: In function 'makePrimefromSeedShaweTaylor':
23:58.92 pqg.c:849:28: warning: comparison between signed and unsigned integer expressions [-Wsign-compare]
23:58.92 pqg.c: In function 'pqg_ParamGen':
23:58.92 pqg.c:1232:18: warning: variable 'b' set but not used [-Wunused-but-set-variable]
23:58.92 pqg.c: In function 'PQG_VerifyParams':
23:58.92 pqg.c:1614:50: warning: comparison between signed and unsigned integer expressions [-Wsign-compare]
23:58.92 pqg.c:1672:25: warning: comparison between signed and unsigned integer expressions [-Wsign-compare]
23:58.92 pqg.c:1708:18: warning: comparison between signed and unsigned integer expressions [-Wsign-compare]
23:58.92 pqg.c:1709:25: warning: comparison between signed and unsigned integer expressions [-Wsign-compare]
23:58.93 pqg.c:1710:33: warning: comparison between signed and unsigned integer expressions [-Wsign-compare]
23:58.93 pqg.c:1733:29: warning: comparison between signed and unsigned integer expressions [-Wsign-compare]
23:58.93 pqg.c:1775:27: warning: 'type' may be used uninitialized in this function [-Wmaybe-uninitialized]
23:58.93 pqg.c:1595:16: note: 'type' was declared here
23:58.93 pqg.c:1777:5: warning: 'hashtype' may be used uninitialized in this function [-Wmaybe-uninitialized]
23:58.93 pqg.c:1594:19: note: 'hashtype' was declared here
23:59.01 rsa.c: In function 'RSA_NewKey':
23:59.01 rsa.c:251:29: warning: comparison between signed and unsigned integer expressions [-Wsign-compare]
23:59.01 rsa.c: In function 'rsa_get_primes_from_exponents':
23:59.01 rsa.c:482:52: warning: comparison between signed and unsigned integer expressions [-Wsign-compare]
23:59.05 shvfy.c: In function 'readItem':
23:59.05 shvfy.c:267:19: warning: comparison between signed and unsigned integer expressions [-Wsign-compare]
23:59.23 mpi/mplogic.c: In function 'mpl_num_set':
23:59.23 mpi/mplogic.c:230:20: warning: comparison between signed and unsigned integer expressions [-Wsign-compare]
23:59.23 mpi/mplogic.c: In function 'mpl_num_clear':
23:59.23 mpi/mplogic.c:260:20: warning: comparison between signed and unsigned integer expressions [-Wsign-compare]
23:59.27 mpi/mpprime.c: In function 'mpp_make_prime':
23:59.27 mpi/mpprime.c:445:47: warning: comparison between signed and unsigned integer expressions [-Wsign-compare]
24:00.07 ecl/ecp_521.c: In function 'ec_GFp_nistp521_mod':
24:00.07 ecl/ecp_521.c:42:73: warning: comparison between signed and unsigned integer expressions [-Wsign-compare]
24:00.07 ecl/ecp_521.c:50:18: warning: comparison between signed and unsigned integer expressions [-Wsign-compare]
24:00.39 mpi/mpi.c: In function 'mp_expt':
24:00.39 mpi/mpi.c:1114:20: warning: comparison between signed and unsigned integer expressions [-Wsign-compare]
24:00.39 mpi/mpi.c:1118:22: warning: comparison between signed and unsigned integer expressions [-Wsign-compare]
24:00.39 mpi/mpi.c: In function 's_mp_exptmod':
24:00.39 mpi/mpi.c:1497:20: warning: comparison between signed and unsigned integer expressions [-Wsign-compare]
24:00.39 mpi/mpi.c:1501:22: warning: comparison between signed and unsigned integer expressions [-Wsign-compare]
24:00.39 mpi/mpi.c: In function 'mp_trailing_zeros':
24:00.39 mpi/mpi.c:2012:45: warning: comparison between signed and unsigned integer expressions [-Wsign-compare]
24:00.39 mpi/mpi.c: In function 's_mp_fixup_reciprocal':
24:00.39 mpi/mpi.c:2164:19: warning: comparison between signed and unsigned integer expressions [-Wsign-compare]
24:00.39 mpi/mpi.c:2164:51: warning: signed and unsigned type in conditional expression [-Wsign-compare]
24:00.39 mpi/mpi.c:2166:11: warning: comparison between signed and unsigned integer expressions [-Wsign-compare]
24:00.39 mpi/mpi.c: In function 's_mp_lshd':
24:00.39 mpi/mpi.c:2938:18: warning: comparison between signed and unsigned integer expressions [-Wsign-compare]
24:00.39 mpi/mpi.c: In function 's_mp_mul_2':
24:00.39 mpi/mpi.c:3063:12: warning: comparison between signed and unsigned integer expressions [-Wsign-compare]
24:00.39 mpi/mpi.c: In function 's_mp_todigit':
24:00.39 mpi/mpi.c:4600:10: warning: comparison between signed and unsigned integer expressions [-Wsign-compare]
24:00.39 mpi/mpi.c: In function 'mp_to_unsigned_octets':
24:00.39 mpi/mpi.c:4720:29: warning: comparison between signed and unsigned integer expressions [-Wsign-compare]
24:00.39 mpi/mpi.c: In function 'mp_to_signed_octets':
24:00.39 mpi/mpi.c:4752:29: warning: comparison between signed and unsigned integer expressions [-Wsign-compare]
24:00.39 mpi/mpi.c:4766:20: warning: comparison between signed and unsigned integer expressions [-Wsign-compare]
24:00.39 mpi/mpi.c:4767:18: warning: comparison between signed and unsigned integer expressions [-Wsign-compare]
24:00.39 mpi/mpi.c: In function 'mp_to_fixlen_octets':
24:00.39 mpi/mpi.c:4792:29: warning: comparison between signed and unsigned integer expressions [-Wsign-compare]
24:00.39 mpi/mpi.c:4795:16: warning: comparison between signed and unsigned integer expressions [-Wsign-compare]
24:00.81 lgglue.c: In function 'sftkdb_resolvePath':
24:00.81 lgglue.c:44:24: warning: comparison between signed and unsigned integer expressions [-Wsign-compare]
24:01.20 lowpbe.c: In function 'nsspkcs5_PKCS12PBE':
24:01.20 lowpbe.c:519:22: warning: comparison between signed and unsigned integer expressions [-Wsign-compare]
24:01.80 pkcs11u.c: In function 'sftk_DeleteObject':
24:01.80 pkcs11u.c:1177:22: warning: unused variable 'to' [-Wunused-variable]
24:01.80 pkcs11u.c: In function 'sftk_NewTokenObject':
24:01.80 pkcs11u.c:1902:22: warning: variable 'tokObject' set but not used [-Wunused-but-set-variable]
24:01.91 sdb.c: In function 'sdb_FindObjectsInit':
24:01.91 sdb.c:702:28: warning: comparison between signed and unsigned integer expressions [-Wsign-compare]
24:01.91 sdb.c:727:32: warning: comparison between signed and unsigned integer expressions [-Wsign-compare]
24:01.91 sdb.c: In function 'sdb_GetAttributeValueNoLock':
24:01.91 sdb.c:848:17: warning: comparison between signed and unsigned integer expressions [-Wsign-compare]
24:01.91 sdb.c:900:34: warning: comparison between signed and unsigned integer expressions [-Wsign-compare]
24:01.91 sdb.c: In function 'sdb_SetAttributeValue':
24:01.91 sdb.c:978:27: warning: comparison between signed and unsigned integer expressions [-Wsign-compare]
24:01.91 sdb.c:1007:17: warning: comparison between signed and unsigned integer expressions [-Wsign-compare]
24:01.91 sdb.c: In function 'sdb_CreateObject':
24:01.91 sdb.c:1138:42: warning: comparison between signed and unsigned integer expressions [-Wsign-compare]
24:01.91 sdb.c:1168:17: warning: comparison between signed and unsigned integer expressions [-Wsign-compare]
24:02.02 sftkhmac.c: In function 'sftk_HMACConstantTime_Update':
24:02.02 sftkhmac.c:149:15: warning: unused variable 'rv' [-Wunused-variable]
24:02.02 sftkhmac.c: In function 'sftk_SSLv3MACConstantTime_Update':
24:02.02 sftkhmac.c:163:15: warning: unused variable 'rv' [-Wunused-variable]
24:02.23 pkcs11.c: In function 'sftk_GetPubKey':
24:02.23 pkcs11.c:1756:35: warning: comparison between signed and unsigned integer expressions [-Wsign-compare]
24:02.23 pkcs11.c:1764:35: warning: comparison between signed and unsigned integer expressions [-Wsign-compare]
24:02.23 pkcs11.c:1774:27: warning: comparison between signed and unsigned integer expressions [-Wsign-compare]
24:02.23 pkcs11.c: In function 'NSC_GetInfo':
24:02.23 pkcs11.c:3144:19: warning: variable 'c' set but not used [-Wunused-but-set-variable]
24:02.23 pkcs11.c: In function 'NSC_GetAttributeValue':
24:02.23 pkcs11.c:4314:58: warning: comparison between signed and unsigned integer expressions [-Wsign-compare]
24:02.23 pkcs11.c: In function 'sftk_emailhack':
24:02.23 pkcs11.c:4527:17: warning: comparison between signed and unsigned integer expressions [-Wsign-compare]
24:02.23 pkcs11.c: In function 'NSC_FindObjects':
24:02.23 pkcs11.c:4743:54: warning: signed and unsigned type in conditional expression [-Wsign-compare]
24:02.23 pkcs11.c: In function 'NSC_CreateObject':
24:02.23 pkcs11.c:4085:21: warning: 'moduleIndex' may be used uninitialized in this function [-Wmaybe-uninitialized]
24:02.23 pkcs11.c:4005:19: note: 'moduleIndex' was declared here
24:02.55 sftkdb.c: In function 'sftkdb_fixupTemplateOut':
24:02.55 sftkdb.c:328:22: warning: variable 'data' set but not used [-Wunused-but-set-variable]
24:02.55 sftkdb.c:345:69: warning: comparison between signed and unsigned integer expressions [-Wsign-compare]
24:02.55 sftkdb.c: In function 'sftk_signTemplate':
24:02.55 sftkdb.c:520:17: warning: comparison between signed and unsigned integer expressions [-Wsign-compare]
24:02.55 sftkdb.c: In function 'sftkdb_CreateObject':
24:02.55 sftkdb.c:576:12: warning: variable 'inTransaction' set but not used [-Wunused-but-set-variable]
24:02.55 sftkdb.c: In function 'sftk_ExtractTemplate':
24:02.55 sftkdb.c:619:17: warning: comparison between signed and unsigned integer expressions [-Wsign-compare]
24:02.55 sftkdb.c:632:17: warning: comparison between signed and unsigned integer expressions [-Wsign-compare]
24:02.55 sftkdb.c: In function 'sftkdb_resolveConflicts':
24:02.55 sftkdb.c:1045:13: warning: comparison between signed and unsigned integer expressions [-Wsign-compare]
24:02.55 sftkdb.c: In function 'sftkdb_FindObjects':
24:02.55 sftkdb.c:1261:14: warning: comparison between signed and unsigned integer expressions [-Wsign-compare]
24:02.55 sftkdb.c: In function 'sftkdb_GetObjectTemplate':
24:02.55 sftkdb.c:1613:14: warning: comparison between signed and unsigned integer expressions [-Wsign-compare]
24:02.55 sftkdb.c:1631:63: warning: comparison between signed and unsigned integer expressions [-Wsign-compare]
24:02.55 sftkdb.c: In function 'sftkdb_handleIDAndName':
24:02.55 sftkdb.c:2014:11: warning: variable 'crv' set but not used [-Wunused-but-set-variable]
24:02.55 sftkdb.c: In function 'sftkdb_mergeObject':
24:02.56 sftkdb.c:2196:17: warning: comparison between signed and unsigned integer expressions [-Wsign-compare]
24:02.56 sftkdb.c: In function 'sftkdb_Update':
24:02.56 sftkdb.c:2301:38: warning: comparison between signed and unsigned integer expressions [-Wsign-compare]
24:02.56 sftkpwd.c: In function 'sftk_updateMacs':
24:02.56 sftkpwd.c:908:17: warning: comparison between signed and unsigned integer expressions [-Wsign-compare]
24:02.56 sftkpwd.c:909:31: warning: comparison between signed and unsigned integer expressions [-Wsign-compare]
24:02.56 sftkpwd.c:930:17: warning: comparison between signed and unsigned integer expressions [-Wsign-compare]
24:02.56 sftkpwd.c:935:31: warning: comparison between signed and unsigned integer expressions [-Wsign-compare]
24:02.56 sftkpwd.c:868:11: warning: variable 'crv2' set but not used [-Wunused-but-set-variable]
24:02.56 sftkpwd.c:867:11: warning: variable 'crv' set but not used [-Wunused-but-set-variable]
24:02.56 sftkpwd.c: In function 'sftk_updateEncrypted':
24:02.56 sftkpwd.c:986:17: warning: comparison between signed and unsigned integer expressions [-Wsign-compare]
24:02.56 sftkpwd.c:993:31: warning: comparison between signed and unsigned integer expressions [-Wsign-compare]
24:02.56 sftkpwd.c: In function 'sftkdb_convertObjects':
24:02.56 sftkpwd.c:1125:38: warning: comparison between signed and unsigned integer expressions [-Wsign-compare]
24:03.18 pkcs11c.c: In function 'NSC_GenerateKeyPair':
24:03.18 pkcs11c.c:4340:9: warning: variable 'private_value_bits' set but not used [-Wunused-but-set-variable]
24:03.18 pkcs11c.c: In function 'sftk_PackagePrivateKey':
24:03.18 pkcs11c.c:4862:14: warning: variable 'fordebug' set but not used [-Wunused-but-set-variable]
24:03.18 pkcs11c.c: In function 'NSC_DeriveKey':
24:03.18 pkcs11c.c:6764:18: warning: comparison between signed and unsigned integer expressions [-Wsign-compare]
24:03.18 pkcs11c.c:6769:18: warning: comparison between signed and unsigned integer expressions [-Wsign-compare]
24:03.18 pkcs11c.c:6850:20: warning: comparison between signed and unsigned integer expressions [-Wsign-compare]
24:03.18 pkcs11c.c: In function 'NSC_GenerateKeyPair':
24:03.18 pkcs11c.c:4260:6: warning: 'subPrimeLen' may be used uninitialized in this function [-Wmaybe-uninitialized]
24:03.18 pkcs11c.c:4042:14: note: 'subPrimeLen' was declared here
24:03.18 pkcs11c.c:4212:23: warning: 'modulusLen' may be used uninitialized in this function [-Wmaybe-uninitialized]
24:03.18 pkcs11c.c:4041:14: note: 'modulusLen' was declared here
24:03.18 pkcs11c.c: In function 'NSC_GenerateKey':
24:03.18 pkcs11c.c:3968:13: warning: 'hashType' may be used uninitialized in this function [-Wmaybe-uninitialized]
24:03.24 libnspr.a.desclibcrmf.a.desc
24:03.24 libsqlite.a.desc
24:03.34 Unified_c_manager_ssl_src0.o
24:03.34 PSMContentListener.o
24:03.34 nsCryptoHash.o
24:03.34 nsNSSCertificateDB.o
24:03.53 nsNSSComponent.o
24:04.07 nsNSSVersion.o
24:04.20 RegExp.o
24:04.20 CTypes.o
24:04.86 Unified_cpp_manager_ssl_src0.o
24:05.41 Unified_cpp_manager_ssl_src1.o
24:05.45 Library.o
24:06.02 Unified_cpp_manager_ssl_src2.o
24:12.12 Parser.o
24:13.36 ExecutableAllocatorPosix.o
24:15.47 jsarray.o
24:15.82 jsatom.o
24:17.93 libsecurity_manager_ssl_src.a.desc
24:18.00 WriteArgument.o
24:18.07 WriteArgument
24:18.17 ssltunnel.o
24:19.66 ssltunnel
24:19.74 /opt/FirefoxSource/mozilla-release/js/src/ctypes/CTypes.cpp: In function 'bool js::ctypes::ExplicitConvert(JSContext*, JS::HandleValue, JS::HandleObject, void*)':
24:19.74 Warning: -Wmaybe-uninitialized in /opt/FirefoxSource/mozilla-release/js/src/ctypes/CTypes.cpp: 'result' may be used uninitialized in this function
24:19.74 /opt/FirefoxSource/mozilla-release/js/src/ctypes/CTypes.cpp:2748:234: warning: 'result' may be used uninitialized in this function [-Wmaybe-uninitialized]
24:19.74 /opt/FirefoxSource/mozilla-release/js/src/ctypes/CTypes.cpp:2748:34: note: 'result' was declared here
24:19.75 Warning: -Wmaybe-uninitialized in /opt/FirefoxSource/mozilla-release/js/src/ctypes/CTypes.cpp: 'result' may be used uninitialized in this function
24:19.75 /opt/FirefoxSource/mozilla-release/js/src/ctypes/CTypes.cpp:2747:218: warning: 'result' may be used uninitialized in this function [-Wmaybe-uninitialized]
24:19.75 /opt/FirefoxSource/mozilla-release/js/src/ctypes/CTypes.cpp:2747:26: note: 'result' was declared here
24:19.75 Warning: -Wmaybe-uninitialized in /opt/FirefoxSource/mozilla-release/js/src/ctypes/CTypes.cpp: 'result' may be used uninitialized in this function
24:19.75 /opt/FirefoxSource/mozilla-release/js/src/ctypes/CTypes.cpp:2746:960: warning: 'result' may be used uninitialized in this function [-Wmaybe-uninitialized]
24:19.75 /opt/FirefoxSource/mozilla-release/js/src/ctypes/CTypes.cpp:2746:750: note: 'result' was declared here
24:19.75 jsmath.o
24:19.79 BadCertServer.o
24:19.79 ClientAuthServer.o
24:20.15 GenerateOCSPResponse.o
24:20.54 OCSPStaplingServer.o
24:21.34 BadCertServer
24:21.34 ClientAuthServer
24:21.47 GenerateOCSPResponse
24:21.59 OCSPStaplingServer
24:21.84 jsutil.o
24:25.19 pm_stub.o
24:25.35 TraceLogging.o
24:25.41 TraceLoggingGraph.o
24:26.37 TraceLoggingTypes.o
24:26.51 Unified_cpp_js_src0.o
24:26.83 Unified_cpp_js_src1.o
24:28.40 Unified_cpp_js_src10.o
24:30.09 Unified_cpp_js_src11.o
24:33.05 Unified_cpp_js_src12.o
24:57.07 In file included from /opt/FirefoxSource/mozilla-release/js/src/jsobjinlines.h:24:0,
24:57.07                  from /opt/FirefoxSource/mozilla-release/js/src/frontend/BytecodeCompiler.cpp:20,
24:57.07                  from /opt/FirefoxSource/mozilla-release/objdir-droid/js/src/Unified_cpp_js_src1.cpp:20:
24:57.07 /opt/FirefoxSource/mozilla-release/js/src/jsgcinlines.h: In function 'void js::IterateScripts(JSRuntime*, JSCompartment*, void*, js::IterateScriptCallback)':
24:57.07 Warning: -Wmaybe-uninitialized in /opt/FirefoxSource/mozilla-release/js/src/jsgcinlines.h: '*((void*)(& i)+12).js::gc::ArenaCellIterImpl::thing' may be used uninitialized in this function
24:57.07 /opt/FirefoxSource/mozilla-release/js/src/jsgcinlines.h:193:27: warning: '*((void*)(& i)+12).js::gc::ArenaCellIterImpl::thing' may be used uninitialized in this function [-Wmaybe-uninitialized]
24:57.07 In file included from /opt/FirefoxSource/mozilla-release/objdir-droid/js/src/Unified_cpp_js_src1.cpp:101:0:
24:57.07 /opt/FirefoxSource/mozilla-release/js/src/gc/Iteration.cpp:108:38: note: '*((void*)(& i)+12).js::gc::ArenaCellIterImpl::thing' was declared here
24:57.07 In file included from /opt/FirefoxSource/mozilla-release/js/src/gc/Barrier.h:12:0,
24:57.07                  from /opt/FirefoxSource/mozilla-release/js/src/jsatom.h:14,
24:57.07                  from /opt/FirefoxSource/mozilla-release/js/src/vm/Runtime.h:21,
24:57.07                  from /opt/FirefoxSource/mozilla-release/js/src/jscntxt.h:15,
24:57.07                  from /opt/FirefoxSource/mozilla-release/js/src/frontend/BytecodeCompiler.cpp:9,
24:57.07                  from /opt/FirefoxSource/mozilla-release/objdir-droid/js/src/Unified_cpp_js_src1.cpp:20:
24:57.07 Warning: -Wmaybe-uninitialized in /opt/FirefoxSource/mozilla-release/js/src/gc/Heap.h: '*((void*)(& i)+12).js::gc::ArenaCellIterImpl::span.js::gc::FreeSpan::last' may be used uninitialized in this function
24:57.07 /opt/FirefoxSource/mozilla-release/js/src/gc/Heap.h:304:48: warning: '*((void*)(& i)+12).js::gc::ArenaCellIterImpl::span.js::gc::FreeSpan::last' may be used uninitialized in this function [-Wmaybe-uninitialized]
24:57.07 In file included from /opt/FirefoxSource/mozilla-release/objdir-droid/js/src/Unified_cpp_js_src1.cpp:101:0:
24:57.07 /opt/FirefoxSource/mozilla-release/js/src/gc/Iteration.cpp:108:38: note: '*((void*)(& i)+12).js::gc::ArenaCellIterImpl::span.js::gc::FreeSpan::last' was declared here
24:57.08 In file included from /opt/FirefoxSource/mozilla-release/js/src/jsobjinlines.h:24:0,
24:57.08                  from /opt/FirefoxSource/mozilla-release/js/src/frontend/BytecodeCompiler.cpp:20,
24:57.08                  from /opt/FirefoxSource/mozilla-release/objdir-droid/js/src/Unified_cpp_js_src1.cpp:20:
24:57.08 Warning: -Wmaybe-uninitialized in /opt/FirefoxSource/mozilla-release/js/src/jsgcinlines.h: '*((void*)(& i)+12).js::gc::ArenaCellIterImpl::span.js::gc::FreeSpan::first' may be used uninitialized in this function
24:57.08 /opt/FirefoxSource/mozilla-release/js/src/jsgcinlines.h:134:9: warning: '*((void*)(& i)+12).js::gc::ArenaCellIterImpl::span.js::gc::FreeSpan::first' may be used uninitialized in this function [-Wmaybe-uninitialized]
24:57.08 In file included from /opt/FirefoxSource/mozilla-release/objdir-droid/js/src/Unified_cpp_js_src1.cpp:101:0:
24:57.08 /opt/FirefoxSource/mozilla-release/js/src/gc/Iteration.cpp:108:38: note: '*((void*)(& i)+12).js::gc::ArenaCellIterImpl::span.js::gc::FreeSpan::first' was declared here
24:57.08 In file included from /opt/FirefoxSource/mozilla-release/js/src/jsobjinlines.h:24:0,
24:57.08                  from /opt/FirefoxSource/mozilla-release/js/src/frontend/BytecodeCompiler.cpp:20,
24:57.08                  from /opt/FirefoxSource/mozilla-release/objdir-droid/js/src/Unified_cpp_js_src1.cpp:20:
24:57.08 /opt/FirefoxSource/mozilla-release/js/src/jsgcinlines.h: In member function 'void js::gc::GCRuntime::markRuntime(JSTracer*, js::gc::GCRuntime::TraceOrMarkRuntime, js::gc::GCRuntime::TraceRootsOrUsedSaved)':
24:57.08 Warning: -Wmaybe-uninitialized in /opt/FirefoxSource/mozilla-release/js/src/jsgcinlines.h: '*((void*)(& i)+12).js::gc::ArenaCellIterImpl::thing' may be used uninitialized in this function
24:57.08 /opt/FirefoxSource/mozilla-release/js/src/jsgcinlines.h:183:52: warning: '*((void*)(& i)+12).js::gc::ArenaCellIterImpl::thing' may be used uninitialized in this function [-Wmaybe-uninitialized]
24:57.08 In file included from /opt/FirefoxSource/mozilla-release/objdir-droid/js/src/Unified_cpp_js_src1.cpp:137:0:
24:57.08 /opt/FirefoxSource/mozilla-release/js/src/gc/RootMarking.cpp:480:38: note: '*((void*)(& i)+12).js::gc::ArenaCellIterImpl::thing' was declared here
24:57.08 In file included from /opt/FirefoxSource/mozilla-release/js/src/gc/Barrier.h:12:0,
24:57.08                  from /opt/FirefoxSource/mozilla-release/js/src/jsatom.h:14,
24:57.08                  from /opt/FirefoxSource/mozilla-release/js/src/vm/Runtime.h:21,
24:57.08                  from /opt/FirefoxSource/mozilla-release/js/src/jscntxt.h:15,
24:57.08                  from /opt/FirefoxSource/mozilla-release/js/src/frontend/BytecodeCompiler.cpp:9,
24:57.08                  from /opt/FirefoxSource/mozilla-release/objdir-droid/js/src/Unified_cpp_js_src1.cpp:20:
24:57.08 Warning: -Wmaybe-uninitialized in /opt/FirefoxSource/mozilla-release/js/src/gc/Heap.h: '*((void*)(& i)+12).js::gc::ArenaCellIterImpl::span.js::gc::FreeSpan::last' may be used uninitialized in this function
24:57.08 /opt/FirefoxSource/mozilla-release/js/src/gc/Heap.h:304:48: warning: '*((void*)(& i)+12).js::gc::ArenaCellIterImpl::span.js::gc::FreeSpan::last' may be used uninitialized in this function [-Wmaybe-uninitialized]
24:57.08 In file included from /opt/FirefoxSource/mozilla-release/objdir-droid/js/src/Unified_cpp_js_src1.cpp:137:0:
24:57.08 /opt/FirefoxSource/mozilla-release/js/src/gc/RootMarking.cpp:480:38: note: '*((void*)(& i)+12).js::gc::ArenaCellIterImpl::span.js::gc::FreeSpan::last' was declared here
24:57.08 In file included from /opt/FirefoxSource/mozilla-release/js/src/jsobjinlines.h:24:0,
24:57.08                  from /opt/FirefoxSource/mozilla-release/js/src/frontend/BytecodeCompiler.cpp:20,
24:57.08                  from /opt/FirefoxSource/mozilla-release/objdir-droid/js/src/Unified_cpp_js_src1.cpp:20:
24:57.08 Warning: -Wmaybe-uninitialized in /opt/FirefoxSource/mozilla-release/js/src/jsgcinlines.h: '*((void*)(& i)+12).js::gc::ArenaCellIterImpl::span.js::gc::FreeSpan::first' may be used uninitialized in this function
24:57.08 /opt/FirefoxSource/mozilla-release/js/src/jsgcinlines.h:134:9: warning: '*((void*)(& i)+12).js::gc::ArenaCellIterImpl::span.js::gc::FreeSpan::first' may be used uninitialized in this function [-Wmaybe-uninitialized]
24:57.08 In file included from /opt/FirefoxSource/mozilla-release/objdir-droid/js/src/Unified_cpp_js_src1.cpp:137:0:
24:57.08 /opt/FirefoxSource/mozilla-release/js/src/gc/RootMarking.cpp:480:38: note: '*((void*)(& i)+12).js::gc::ArenaCellIterImpl::span.js::gc::FreeSpan::first' was declared here
24:57.08 In file included from /opt/FirefoxSource/mozilla-release/js/src/jsobjinlines.h:24:0,
24:57.08                  from /opt/FirefoxSource/mozilla-release/js/src/frontend/BytecodeCompiler.cpp:20,
24:57.08                  from /opt/FirefoxSource/mozilla-release/objdir-droid/js/src/Unified_cpp_js_src1.cpp:20:
24:57.08 /opt/FirefoxSource/mozilla-release/js/src/jsgcinlines.h: In member function 'void js::gc::GCRuntime::_ZN2js2gc9GCRuntime11markRuntimeEP8JSTracerNS1_18TraceOrMarkRuntimeENS1_21TraceRootsOrUsedSavedE.constprop.487(JSTracer*)':
24:57.08 Warning: -Wmaybe-uninitialized in /opt/FirefoxSource/mozilla-release/js/src/jsgcinlines.h: '*((void*)(& i)+12).js::gc::ArenaCellIterImpl::thing' may be used uninitialized in this function
24:57.08 /opt/FirefoxSource/mozilla-release/js/src/jsgcinlines.h:183:52: warning: '*((void*)(& i)+12).js::gc::ArenaCellIterImpl::thing' may be used uninitialized in this function [-Wmaybe-uninitialized]
24:57.08 In file included from /opt/FirefoxSource/mozilla-release/objdir-droid/js/src/Unified_cpp_js_src1.cpp:137:0:
24:57.08 /opt/FirefoxSource/mozilla-release/js/src/gc/RootMarking.cpp:480:38: note: '*((void*)(& i)+12).js::gc::ArenaCellIterImpl::thing' was declared here
24:57.08 In file included from /opt/FirefoxSource/mozilla-release/js/src/gc/Barrier.h:12:0,
24:57.08                  from /opt/FirefoxSource/mozilla-release/js/src/jsatom.h:14,
24:57.08                  from /opt/FirefoxSource/mozilla-release/js/src/vm/Runtime.h:21,
24:57.08                  from /opt/FirefoxSource/mozilla-release/js/src/jscntxt.h:15,
24:57.08                  from /opt/FirefoxSource/mozilla-release/js/src/frontend/BytecodeCompiler.cpp:9,
24:57.08                  from /opt/FirefoxSource/mozilla-release/objdir-droid/js/src/Unified_cpp_js_src1.cpp:20:
24:57.08 Warning: -Wmaybe-uninitialized in /opt/FirefoxSource/mozilla-release/js/src/gc/Heap.h: '*((void*)(& i)+12).js::gc::ArenaCellIterImpl::span.js::gc::FreeSpan::last' may be used uninitialized in this function
24:57.08 /opt/FirefoxSource/mozilla-release/js/src/gc/Heap.h:304:48: warning: '*((void*)(& i)+12).js::gc::ArenaCellIterImpl::span.js::gc::FreeSpan::last' may be used uninitialized in this function [-Wmaybe-uninitialized]
24:57.08 In file included from /opt/FirefoxSource/mozilla-release/objdir-droid/js/src/Unified_cpp_js_src1.cpp:137:0:
24:57.08 /opt/FirefoxSource/mozilla-release/js/src/gc/RootMarking.cpp:480:38: note: '*((void*)(& i)+12).js::gc::ArenaCellIterImpl::span.js::gc::FreeSpan::last' was declared here
24:57.08 In file included from /opt/FirefoxSource/mozilla-release/js/src/jsobjinlines.h:24:0,
24:57.08                  from /opt/FirefoxSource/mozilla-release/js/src/frontend/BytecodeCompiler.cpp:20,
24:57.08                  from /opt/FirefoxSource/mozilla-release/objdir-droid/js/src/Unified_cpp_js_src1.cpp:20:
24:57.08 Warning: -Wmaybe-uninitialized in /opt/FirefoxSource/mozilla-release/js/src/jsgcinlines.h: '*((void*)(& i)+12).js::gc::ArenaCellIterImpl::span.js::gc::FreeSpan::first' may be used uninitialized in this function
24:57.08 /opt/FirefoxSource/mozilla-release/js/src/jsgcinlines.h:134:9: warning: '*((void*)(& i)+12).js::gc::ArenaCellIterImpl::span.js::gc::FreeSpan::first' may be used uninitialized in this function [-Wmaybe-uninitialized]
24:57.08 In file included from /opt/FirefoxSource/mozilla-release/objdir-droid/js/src/Unified_cpp_js_src1.cpp:137:0:
24:57.08 /opt/FirefoxSource/mozilla-release/js/src/gc/RootMarking.cpp:480:38: note: '*((void*)(& i)+12).js::gc::ArenaCellIterImpl::span.js::gc::FreeSpan::first' was declared here
24:57.08 Unified_cpp_js_src2.o
25:01.03 Unified_cpp_js_src3.o
25:07.01 Unified_cpp_js_src4.o
25:14.15 In file included from /opt/FirefoxSource/mozilla-release/objdir-droid/js/src/Unified_cpp_js_src0.cpp:38:0:
25:14.15 /opt/FirefoxSource/mozilla-release/js/src/asmjs/AsmJSValidate.cpp: In function 'js::AsmJSNumLit ExtractSimdValue({anonymous}::ModuleCompiler&, js::frontend::ParseNode*)':
25:14.16 Warning: -Wmaybe-uninitialized in /opt/FirefoxSource/mozilla-release/js/src/asmjs/AsmJSValidate.cpp: 'type' may be used uninitialized in this function
25:14.16 /opt/FirefoxSource/mozilla-release/js/src/asmjs/AsmJSValidate.cpp:2271:5: warning: 'type' may be used uninitialized in this function [-Wmaybe-uninitialized]
25:14.16 In file included from /opt/FirefoxSource/mozilla-release/objdir-droid/js/src/Unified_cpp_js_src0.cpp:20:0:
25:14.16 /opt/FirefoxSource/mozilla-release/js/src/asmjs/AsmJSModule.cpp: In member function 'void js::AsmJSModule::CodeRange::updateOffsets(js::jit::MacroAssembler&)':
25:14.16 Warning: -Wmaybe-uninitialized in /opt/FirefoxSource/mozilla-release/js/src/asmjs/AsmJSModule.cpp: 'profilingEpilogueBefore' may be used uninitialized in this function
25:14.16 /opt/FirefoxSource/mozilla-release/js/src/asmjs/AsmJSModule.cpp:1381:61: warning: 'profilingEpilogueBefore' may be used uninitialized in this function [-Wmaybe-uninitialized]
25:14.16 Warning: -Wmaybe-uninitialized in /opt/FirefoxSource/mozilla-release/js/src/asmjs/AsmJSModule.cpp: 'profilingJumpBefore' may be used uninitialized in this function
25:14.16 /opt/FirefoxSource/mozilla-release/js/src/asmjs/AsmJSModule.cpp:1381:61: warning: 'profilingJumpBefore' may be used uninitialized in this function [-Wmaybe-uninitialized]
25:14.16 Warning: -Wmaybe-uninitialized in /opt/FirefoxSource/mozilla-release/js/src/asmjs/AsmJSModule.cpp: 'entryBefore' may be used uninitialized in this function
25:14.16 /opt/FirefoxSource/mozilla-release/js/src/asmjs/AsmJSModule.cpp:1381:61: warning: 'entryBefore' may be used uninitialized in this function [-Wmaybe-uninitialized]
25:14.16 Unified_cpp_js_src5.o
25:21.86 Unified_cpp_js_src6.o
25:28.58 Unified_cpp_js_src7.o
25:55.51 Unified_cpp_js_src8.o
25:55.64 In file included from /opt/FirefoxSource/mozilla-release/js/src/vm/Shape-inl.h:22:0,
25:55.64                  from /opt/FirefoxSource/mozilla-release/js/src/jsscriptinlines.h:19,
25:55.64                  from /opt/FirefoxSource/mozilla-release/js/src/jit/BaselineCompiler.cpp:25,
25:55.64                  from /opt/FirefoxSource/mozilla-release/objdir-droid/js/src/Unified_cpp_js_src3.cpp:2:
25:55.64 /opt/FirefoxSource/mozilla-release/js/src/jsgcinlines.h: In function 'void js::jit::ToggleBaselineTraceLoggerScripts(JSRuntime*, bool)':
25:55.64 Warning: -Wmaybe-uninitialized in /opt/FirefoxSource/mozilla-release/js/src/jsgcinlines.h: '*((void*)(& i)+12).js::gc::ArenaCellIterImpl::thing' may be used uninitialized in this function
25:55.64 /opt/FirefoxSource/mozilla-release/js/src/jsgcinlines.h:183:52: warning: '*((void*)(& i)+12).js::gc::ArenaCellIterImpl::thing' may be used uninitialized in this function [-Wmaybe-uninitialized]
25:55.64 In file included from /opt/FirefoxSource/mozilla-release/objdir-droid/js/src/Unified_cpp_js_src3.cpp:56:0:
25:55.64 /opt/FirefoxSource/mozilla-release/js/src/jit/BaselineJIT.cpp:1093:31: note: '*((void*)(& i)+12).js::gc::ArenaCellIterImpl::thing' was declared here
25:55.64 In file included from /opt/FirefoxSource/mozilla-release/js/src/gc/Barrier.h:12:0,
25:55.65                  from /opt/FirefoxSource/mozilla-release/js/src/jsatom.h:14,
25:55.65                  from /opt/FirefoxSource/mozilla-release/js/src/vm/Runtime.h:21,
25:55.65                  from /opt/FirefoxSource/mozilla-release/js/src/jscntxt.h:15,
25:55.65                  from /opt/FirefoxSource/mozilla-release/js/src/jit/Ion.h:12,
25:55.65                  from /opt/FirefoxSource/mozilla-release/js/src/jit/FixedList.h:12,
25:55.65                  from /opt/FirefoxSource/mozilla-release/js/src/jit/BaselineCompiler.h:10,
25:55.65                  from /opt/FirefoxSource/mozilla-release/js/src/jit/BaselineCompiler.cpp:7,
25:55.65                  from /opt/FirefoxSource/mozilla-release/objdir-droid/js/src/Unified_cpp_js_src3.cpp:2:
25:55.65 Warning: -Wmaybe-uninitialized in /opt/FirefoxSource/mozilla-release/js/src/gc/Heap.h: '*((void*)(& i)+12).js::gc::ArenaCellIterImpl::span.js::gc::FreeSpan::last' may be used uninitialized in this function
25:55.65 /opt/FirefoxSource/mozilla-release/js/src/gc/Heap.h:304:48: warning: '*((void*)(& i)+12).js::gc::ArenaCellIterImpl::span.js::gc::FreeSpan::last' may be used uninitialized in this function [-Wmaybe-uninitialized]
25:55.65 In file included from /opt/FirefoxSource/mozilla-release/objdir-droid/js/src/Unified_cpp_js_src3.cpp:56:0:
25:55.65 /opt/FirefoxSource/mozilla-release/js/src/jit/BaselineJIT.cpp:1093:31: note: '*((void*)(& i)+12).js::gc::ArenaCellIterImpl::span.js::gc::FreeSpan::last' was declared here
25:55.65 In file included from /opt/FirefoxSource/mozilla-release/js/src/vm/Shape-inl.h:22:0,
25:55.65                  from /opt/FirefoxSource/mozilla-release/js/src/jsscriptinlines.h:19,
25:55.65                  from /opt/FirefoxSource/mozilla-release/js/src/jit/BaselineCompiler.cpp:25,
25:55.65                  from /opt/FirefoxSource/mozilla-release/objdir-droid/js/src/Unified_cpp_js_src3.cpp:2:
25:55.65 Warning: -Wmaybe-uninitialized in /opt/FirefoxSource/mozilla-release/js/src/jsgcinlines.h: '*((void*)(& i)+12).js::gc::ArenaCellIterImpl::span.js::gc::FreeSpan::first' may be used uninitialized in this function
25:55.65 /opt/FirefoxSource/mozilla-release/js/src/jsgcinlines.h:134:9: warning: '*((void*)(& i)+12).js::gc::ArenaCellIterImpl::span.js::gc::FreeSpan::first' may be used uninitialized in this function [-Wmaybe-uninitialized]
25:55.65 In file included from /opt/FirefoxSource/mozilla-release/objdir-droid/js/src/Unified_cpp_js_src3.cpp:56:0:
25:55.65 /opt/FirefoxSource/mozilla-release/js/src/jit/BaselineJIT.cpp:1093:31: note: '*((void*)(& i)+12).js::gc::ArenaCellIterImpl::span.js::gc::FreeSpan::first' was declared here
25:55.88 Unified_cpp_js_src9.o
26:05.47 In file included from /opt/FirefoxSource/mozilla-release/objdir-droid/js/src/Unified_cpp_js_src6.cpp:47:0:
26:05.47 /opt/FirefoxSource/mozilla-release/js/src/jit/arm/Assembler-arm.cpp: In static member function 'static void js::jit::Assembler::RetargetNearBranch(js::jit::Instruction*, int, bool)':
26:05.48 Warning: -Wmaybe-uninitialized in /opt/FirefoxSource/mozilla-release/js/src/jit/arm/Assembler-arm.cpp: 'c' may be used uninitialized in this function
26:05.48 /opt/FirefoxSource/mozilla-release/js/src/jit/arm/Assembler-arm.cpp:2632:44: warning: 'c' may be used uninitialized in this function [-Wmaybe-uninitialized]
26:05.48 In file included from /opt/FirefoxSource/mozilla-release/objdir-droid/js/src/Unified_cpp_js_src6.cpp:47:0:
26:05.48 /opt/FirefoxSource/mozilla-release/js/src/jit/arm/Assembler-arm.cpp: In function 'void js::jit::PatchJump(js::jit::CodeLocationJump&, js::jit::CodeLocationLabel)':
26:05.48 Warning: -Wmaybe-uninitialized in /opt/FirefoxSource/mozilla-release/js/src/jit/arm/Assembler-arm.cpp: 'c' may be used uninitialized in this function
26:05.48 /opt/FirefoxSource/mozilla-release/js/src/jit/arm/Assembler-arm.cpp:551:65: warning: 'c' may be used uninitialized in this function [-Wmaybe-uninitialized]
26:05.48 In file included from /opt/FirefoxSource/mozilla-release/objdir-droid/js/src/Unified_cpp_js_src6.cpp:47:0:
26:05.48 /opt/FirefoxSource/mozilla-release/js/src/jit/arm/Assembler-arm.cpp: In member function 'js::jit::Instruction* js::jit::Instruction::skipPool()':
26:05.48 Warning: -Wmaybe-uninitialized in /opt/FirefoxSource/mozilla-release/js/src/jit/arm/Assembler-arm.cpp: 'c' may be used uninitialized in this function
26:05.48 /opt/FirefoxSource/mozilla-release/js/src/jit/arm/Assembler-arm.cpp:2823:5: warning: 'c' may be used uninitialized in this function [-Wmaybe-uninitialized]
26:05.48 /opt/FirefoxSource/mozilla-release/js/src/jit/arm/Assembler-arm.cpp:2821:26: note: 'c' was declared here
26:05.48 Warning: -Wmaybe-uninitialized in /opt/FirefoxSource/mozilla-release/js/src/jit/arm/Assembler-arm.cpp: 'c' may be used uninitialized in this function
26:05.48 /opt/FirefoxSource/mozilla-release/js/src/jit/arm/Assembler-arm.cpp:2805:5: warning: 'c' may be used uninitialized in this function [-Wmaybe-uninitialized]
26:05.48 /opt/FirefoxSource/mozilla-release/js/src/jit/arm/Assembler-arm.cpp:2803:26: note: 'c' was declared here
26:05.48 /opt/FirefoxSource/mozilla-release/js/src/jit/arm/Assembler-arm.cpp: In member function 'js::jit::Instruction* js::jit::Instruction::next()':
26:05.48 Warning: -Wmaybe-uninitialized in /opt/FirefoxSource/mozilla-release/js/src/jit/arm/Assembler-arm.cpp: 'c' may be used uninitialized in this function
26:05.48 /opt/FirefoxSource/mozilla-release/js/src/jit/arm/Assembler-arm.cpp:2805:5: warning: 'c' may be used uninitialized in this function [-Wmaybe-uninitialized]
26:05.48 /opt/FirefoxSource/mozilla-release/js/src/jit/arm/Assembler-arm.cpp:2803:26: note: 'c' was declared here
26:05.48 Warning: -Wmaybe-uninitialized in /opt/FirefoxSource/mozilla-release/js/src/jit/arm/Assembler-arm.cpp: 'c' may be used uninitialized in this function
26:05.48 /opt/FirefoxSource/mozilla-release/js/src/jit/arm/Assembler-arm.cpp:2805:5: warning: 'c' may be used uninitialized in this function [-Wmaybe-uninitialized]
26:05.48 /opt/FirefoxSource/mozilla-release/js/src/jit/arm/Assembler-arm.cpp:2803:26: note: 'c' was declared here
26:05.48 In file included from /opt/FirefoxSource/mozilla-release/js/src/jit/arm/MacroAssembler-arm.h:14:0,
26:05.48                  from /opt/FirefoxSource/mozilla-release/js/src/jit/MacroAssembler.h:19,
26:05.48                  from /opt/FirefoxSource/mozilla-release/js/src/jit/MIR.h:23,
26:05.48                  from /opt/FirefoxSource/mozilla-release/js/src/jit/LIR.h:19,
26:05.48                  from /opt/FirefoxSource/mozilla-release/js/src/jit/Lowering.h:13,
26:05.49                  from /opt/FirefoxSource/mozilla-release/js/src/jit/TypePolicy.cpp:9,
26:05.49                  from /opt/FirefoxSource/mozilla-release/objdir-droid/js/src/Unified_cpp_js_src6.cpp:2:
26:05.49 /opt/FirefoxSource/mozilla-release/js/src/jit/arm/Assembler-arm.h: In member function 'void js::jit::Assembler::bind(js::jit::Label*, js::jit::BufferOffset)':
26:05.49 Warning: -Wmaybe-uninitialized in /opt/FirefoxSource/mozilla-release/js/src/jit/arm/Assembler-arm.h: 'c' may be used uninitialized in this function
26:05.49 /opt/FirefoxSource/mozilla-release/js/src/jit/arm/Assembler-arm.h:1832:85: warning: 'c' may be used uninitialized in this function [-Wmaybe-uninitialized]
26:05.49 In file included from /opt/FirefoxSource/mozilla-release/objdir-droid/js/src/Unified_cpp_js_src6.cpp:47:0:
26:05.49 /opt/FirefoxSource/mozilla-release/js/src/jit/arm/Assembler-arm.cpp:2496:23: note: 'c' was declared here
26:05.49 In file included from /opt/FirefoxSource/mozilla-release/js/src/jit/arm/MacroAssembler-arm.h:14:0,
26:05.49                  from /opt/FirefoxSource/mozilla-release/js/src/jit/MacroAssembler.h:19,
26:05.49                  from /opt/FirefoxSource/mozilla-release/js/src/jit/MIR.h:23,
26:05.49                  from /opt/FirefoxSource/mozilla-release/js/src/jit/LIR.h:19,
26:05.49                  from /opt/FirefoxSource/mozilla-release/js/src/jit/Lowering.h:13,
26:05.49                  from /opt/FirefoxSource/mozilla-release/js/src/jit/TypePolicy.cpp:9,
26:05.49                  from /opt/FirefoxSource/mozilla-release/objdir-droid/js/src/Unified_cpp_js_src6.cpp:2:
26:05.49 /opt/FirefoxSource/mozilla-release/js/src/jit/arm/Assembler-arm.h: In member function 'void js::jit::Assembler::retarget(js::jit::Label*, js::jit::Label*)':
26:05.49 Warning: -Wmaybe-uninitialized in /opt/FirefoxSource/mozilla-release/js/src/jit/arm/Assembler-arm.h: 'c' may be used uninitialized in this function
26:05.49 /opt/FirefoxSource/mozilla-release/js/src/jit/arm/Assembler-arm.h:1832:85: warning: 'c' may be used uninitialized in this function [-Wmaybe-uninitialized]
26:05.49 In file included from /opt/FirefoxSource/mozilla-release/objdir-droid/js/src/Unified_cpp_js_src6.cpp:47:0:
26:05.49 /opt/FirefoxSource/mozilla-release/js/src/jit/arm/Assembler-arm.cpp:2552:23: note: 'c' was declared here
26:05.49 In file included from /opt/FirefoxSource/mozilla-release/js/src/jit/arm/MacroAssembler-arm.h:14:0,
26:05.49                  from /opt/FirefoxSource/mozilla-release/js/src/jit/MacroAssembler.h:19,
26:05.49                  from /opt/FirefoxSource/mozilla-release/js/src/jit/MIR.h:23,
26:05.49                  from /opt/FirefoxSource/mozilla-release/js/src/jit/LIR.h:19,
26:05.49                  from /opt/FirefoxSource/mozilla-release/js/src/jit/Lowering.h:13,
26:05.49                  from /opt/FirefoxSource/mozilla-release/js/src/jit/TypePolicy.cpp:9,
26:05.49                  from /opt/FirefoxSource/mozilla-release/objdir-droid/js/src/Unified_cpp_js_src6.cpp:2:
26:05.49 /opt/FirefoxSource/mozilla-release/js/src/jit/arm/Assembler-arm.h: In member function 'void js::jit::AssemblerBufferWithConstantPools<SliceSize, InstSize, Inst, Asm>::executableCopy(uint8_t*) [with unsigned int SliceSize = 1024u; unsigned int InstSize = 4u; Inst = js::jit::Instruction; Asm = js::jit::Assembler; uint8_t = unsigned char]':
26:05.49 Warning: -Wmaybe-uninitialized in /opt/FirefoxSource/mozilla-release/js/src/jit/arm/Assembler-arm.h: 'c' may be used uninitialized in this function
26:05.49 /opt/FirefoxSource/mozilla-release/js/src/jit/arm/Assembler-arm.h:1832:85: warning: 'c' may be used uninitialized in this function [-Wmaybe-uninitialized]
26:05.49 In file included from /opt/FirefoxSource/mozilla-release/objdir-droid/js/src/Unified_cpp_js_src6.cpp:47:0:
26:05.49 /opt/FirefoxSource/mozilla-release/js/src/jit/arm/Assembler-arm.cpp:2630:26: note: 'c' was declared here
26:05.49 In file included from /opt/FirefoxSource/mozilla-release/js/src/jit/arm/MacroAssembler-arm.h:14:0,
26:05.49                  from /opt/FirefoxSource/mozilla-release/js/src/jit/MacroAssembler.h:19,
26:05.49                  from /opt/FirefoxSource/mozilla-release/js/src/jit/MIR.h:23,
26:05.50                  from /opt/FirefoxSource/mozilla-release/js/src/jit/LIR.h:19,
26:05.50                  from /opt/FirefoxSource/mozilla-release/js/src/jit/Lowering.h:13,
26:05.50                  from /opt/FirefoxSource/mozilla-release/js/src/jit/TypePolicy.cpp:9,
26:05.50                  from /opt/FirefoxSource/mozilla-release/objdir-droid/js/src/Unified_cpp_js_src6.cpp:2:
26:05.50 /opt/FirefoxSource/mozilla-release/js/src/jit/arm/Assembler-arm.h: In member function 'void js::jit::Assembler::bind(js::jit::RepatchLabel*)':
26:05.50 Warning: -Wmaybe-uninitialized in /opt/FirefoxSource/mozilla-release/js/src/jit/arm/Assembler-arm.h: 'cond' may be used uninitialized in this function
26:05.50 /opt/FirefoxSource/mozilla-release/js/src/jit/arm/Assembler-arm.h:1832:85: warning: 'cond' may be used uninitialized in this function [-Wmaybe-uninitialized]
26:05.50 In file included from /opt/FirefoxSource/mozilla-release/objdir-droid/js/src/Unified_cpp_js_src6.cpp:47:0:
26:05.50 /opt/FirefoxSource/mozilla-release/js/src/jit/arm/Assembler-arm.cpp:2523:19: note: 'cond' was declared here
26:35.77 In file included from /opt/FirefoxSource/mozilla-release/js/src/vm/Stack.h:17:0,
26:35.77                  from /opt/FirefoxSource/mozilla-release/js/src/vm/Runtime.h:43,
26:35.77                  from /opt/FirefoxSource/mozilla-release/js/src/builtin/MapObject.h:12,
26:35.77                  from /opt/FirefoxSource/mozilla-release/js/src/jsobjinlines.h:12,
26:35.77                  from /opt/FirefoxSource/mozilla-release/js/src/proxy/ScriptedDirectProxyHandler.cpp:13,
26:35.77                  from /opt/FirefoxSource/mozilla-release/objdir-droid/js/src/Unified_cpp_js_src9.cpp:2:
26:35.77 /opt/FirefoxSource/mozilla-release/js/src/jit/JitFrameIterator.h: In member function 'void js::jit::JitFrameIterator::unaliasedForEachActual(Op, js::jit::ReadFrameArgsBehavior) const [with Op = js::CopyToHeap]':
26:35.77 Warning: -Wmaybe-uninitialized in /opt/FirefoxSource/mozilla-release/js/src/jit/JitFrameIterator.h: 'end' may be used uninitialized in this function
26:35.77 /opt/FirefoxSource/mozilla-release/js/src/jit/JitFrameIterator.h:255:9: warning: 'end' may be used uninitialized in this function [-Wmaybe-uninitialized]
26:35.77 Warning: -Wmaybe-uninitialized in /opt/FirefoxSource/mozilla-release/js/src/jit/JitFrameIterator.h: 'start' may be used uninitialized in this function
26:35.77 /opt/FirefoxSource/mozilla-release/js/src/jit/JitFrameIterator.h:235:10: warning: 'start' may be used uninitialized in this function [-Wmaybe-uninitialized]
26:39.02 In file included from /opt/FirefoxSource/mozilla-release/js/src/vm/Shape-inl.h:22:0,
26:39.02                  from /opt/FirefoxSource/mozilla-release/js/src/jsscriptinlines.h:19,
26:39.02                  from /opt/FirefoxSource/mozilla-release/js/src/jsapi.cpp:91,
26:39.02                  from /opt/FirefoxSource/mozilla-release/objdir-droid/js/src/Unified_cpp_js_src7.cpp:20:
26:39.02 /opt/FirefoxSource/mozilla-release/js/src/jsgcinlines.h: In member function 'void js::gc::GCRuntime::sweepTypesAfterCompacting(JS::Zone*)':
26:39.02 Warning: -Wmaybe-uninitialized in /opt/FirefoxSource/mozilla-release/js/src/jsgcinlines.h: '*((void*)(& i)+12).js::gc::ArenaCellIterImpl::thing' may be used uninitialized in this function
26:39.03 /opt/FirefoxSource/mozilla-release/js/src/jsgcinlines.h:193:27: warning: '*((void*)(& i)+12).js::gc::ArenaCellIterImpl::thing' may be used uninitialized in this function [-Wmaybe-uninitialized]
26:39.03 In file included from /opt/FirefoxSource/mozilla-release/objdir-droid/js/src/Unified_cpp_js_src7.cpp:101:0:
26:39.03 /opt/FirefoxSource/mozilla-release/js/src/jsgc.cpp:2230:30: note: '*((void*)(& i)+12).js::gc::ArenaCellIterImpl::thing' was declared here
26:39.03 In file included from /opt/FirefoxSource/mozilla-release/js/src/gc/Barrier.h:12:0,
26:39.03                  from /opt/FirefoxSource/mozilla-release/js/src/jsobj.h:21,
26:39.03                  from /opt/FirefoxSource/mozilla-release/js/src/jsfun.h:14,
26:39.03                  from /opt/FirefoxSource/mozilla-release/js/src/jit/JitFrameIterator.h:10,
26:39.03                  from /opt/FirefoxSource/mozilla-release/js/src/jit/Bailouts.h:12,
26:39.03                  from /opt/FirefoxSource/mozilla-release/js/src/jit/LIR.h:15,
26:39.03                  from /opt/FirefoxSource/mozilla-release/js/src/jit/shared/Lowering-shared.h:13,
26:39.03                  from /opt/FirefoxSource/mozilla-release/js/src/jit/shared/Lowering-shared-inl.h:10,
26:39.03                  from /opt/FirefoxSource/mozilla-release/js/src/jit/shared/Lowering-shared.cpp:7,
26:39.03                  from /opt/FirefoxSource/mozilla-release/objdir-droid/js/src/Unified_cpp_js_src7.cpp:2:
26:39.03 Warning: -Wmaybe-uninitialized in /opt/FirefoxSource/mozilla-release/js/src/gc/Heap.h: '*((void*)(& i)+12).js::gc::ArenaCellIterImpl::span.js::gc::FreeSpan::last' may be used uninitialized in this function
26:39.03 /opt/FirefoxSource/mozilla-release/js/src/gc/Heap.h:304:48: warning: '*((void*)(& i)+12).js::gc::ArenaCellIterImpl::span.js::gc::FreeSpan::last' may be used uninitialized in this function [-Wmaybe-uninitialized]
26:39.03 In file included from /opt/FirefoxSource/mozilla-release/objdir-droid/js/src/Unified_cpp_js_src7.cpp:101:0:
26:39.03 /opt/FirefoxSource/mozilla-release/js/src/jsgc.cpp:2230:30: note: '*((void*)(& i)+12).js::gc::ArenaCellIterImpl::span.js::gc::FreeSpan::last' was declared here
26:39.03 In file included from /opt/FirefoxSource/mozilla-release/js/src/vm/Shape-inl.h:22:0,
26:39.03                  from /opt/FirefoxSource/mozilla-release/js/src/jsscriptinlines.h:19,
26:39.03                  from /opt/FirefoxSource/mozilla-release/js/src/jsapi.cpp:91,
26:39.03                  from /opt/FirefoxSource/mozilla-release/objdir-droid/js/src/Unified_cpp_js_src7.cpp:20:
26:39.03 Warning: -Wmaybe-uninitialized in /opt/FirefoxSource/mozilla-release/js/src/jsgcinlines.h: '*((void*)(& i)+12).js::gc::ArenaCellIterImpl::span.js::gc::FreeSpan::first' may be used uninitialized in this function
26:39.03 /opt/FirefoxSource/mozilla-release/js/src/jsgcinlines.h:134:9: warning: '*((void*)(& i)+12).js::gc::ArenaCellIterImpl::span.js::gc::FreeSpan::first' may be used uninitialized in this function [-Wmaybe-uninitialized]
26:39.03 In file included from /opt/FirefoxSource/mozilla-release/objdir-droid/js/src/Unified_cpp_js_src7.cpp:101:0:
26:39.03 /opt/FirefoxSource/mozilla-release/js/src/jsgc.cpp:2230:30: note: '*((void*)(& i)+12).js::gc::ArenaCellIterImpl::span.js::gc::FreeSpan::first' was declared here
26:39.03 In file included from /opt/FirefoxSource/mozilla-release/js/src/vm/Shape-inl.h:22:0,
26:39.03                  from /opt/FirefoxSource/mozilla-release/js/src/jsscriptinlines.h:19,
26:39.03                  from /opt/FirefoxSource/mozilla-release/js/src/jsapi.cpp:91,
26:39.03                  from /opt/FirefoxSource/mozilla-release/objdir-droid/js/src/Unified_cpp_js_src7.cpp:20:
26:39.03 Warning: -Wmaybe-uninitialized in /opt/FirefoxSource/mozilla-release/js/src/jsgcinlines.h: '*((void*)(& i)+12).js::gc::ArenaCellIterImpl::thing' may be used uninitialized in this function
26:39.03 /opt/FirefoxSource/mozilla-release/js/src/jsgcinlines.h:193:27: warning: '*((void*)(& i)+12).js::gc::ArenaCellIterImpl::thing' may be used uninitialized in this function [-Wmaybe-uninitialized]
26:39.03 In file included from /opt/FirefoxSource/mozilla-release/objdir-droid/js/src/Unified_cpp_js_src7.cpp:101:0:
26:39.03 /opt/FirefoxSource/mozilla-release/js/src/jsgc.cpp:2225:30: note: '*((void*)(& i)+12).js::gc::ArenaCellIterImpl::thing' was declared here
26:39.03 In file included from /opt/FirefoxSource/mozilla-release/js/src/gc/Barrier.h:12:0,
26:39.03                  from /opt/FirefoxSource/mozilla-release/js/src/jsobj.h:21,
26:39.03                  from /opt/FirefoxSource/mozilla-release/js/src/jsfun.h:14,
26:39.03                  from /opt/FirefoxSource/mozilla-release/js/src/jit/JitFrameIterator.h:10,
26:39.03                  from /opt/FirefoxSource/mozilla-release/js/src/jit/Bailouts.h:12,
26:39.03                  from /opt/FirefoxSource/mozilla-release/js/src/jit/LIR.h:15,
26:39.03                  from /opt/FirefoxSource/mozilla-release/js/src/jit/shared/Lowering-shared.h:13,
26:39.03                  from /opt/FirefoxSource/mozilla-release/js/src/jit/shared/Lowering-shared-inl.h:10,
26:39.03                  from /opt/FirefoxSource/mozilla-release/js/src/jit/shared/Lowering-shared.cpp:7,
26:39.03                  from /opt/FirefoxSource/mozilla-release/objdir-droid/js/src/Unified_cpp_js_src7.cpp:2:
26:39.03 Warning: -Wmaybe-uninitialized in /opt/FirefoxSource/mozilla-release/js/src/gc/Heap.h: '*((void*)(& i)+12).js::gc::ArenaCellIterImpl::span.js::gc::FreeSpan::last' may be used uninitialized in this function
26:39.03 /opt/FirefoxSource/mozilla-release/js/src/gc/Heap.h:304:48: warning: '*((void*)(& i)+12).js::gc::ArenaCellIterImpl::span.js::gc::FreeSpan::last' may be used uninitialized in this function [-Wmaybe-uninitialized]
26:39.03 In file included from /opt/FirefoxSource/mozilla-release/objdir-droid/js/src/Unified_cpp_js_src7.cpp:101:0:
26:39.03 /opt/FirefoxSource/mozilla-release/js/src/jsgc.cpp:2225:30: note: '*((void*)(& i)+12).js::gc::ArenaCellIterImpl::span.js::gc::FreeSpan::last' was declared here
26:39.03 In file included from /opt/FirefoxSource/mozilla-release/js/src/vm/Shape-inl.h:22:0,
26:39.03                  from /opt/FirefoxSource/mozilla-release/js/src/jsscriptinlines.h:19,
26:39.03                  from /opt/FirefoxSource/mozilla-release/js/src/jsapi.cpp:91,
26:39.03                  from /opt/FirefoxSource/mozilla-release/objdir-droid/js/src/Unified_cpp_js_src7.cpp:20:
26:39.03 Warning: -Wmaybe-uninitialized in /opt/FirefoxSource/mozilla-release/js/src/jsgcinlines.h: '*((void*)(& i)+12).js::gc::ArenaCellIterImpl::span.js::gc::FreeSpan::first' may be used uninitialized in this function
26:39.03 /opt/FirefoxSource/mozilla-release/js/src/jsgcinlines.h:134:9: warning: '*((void*)(& i)+12).js::gc::ArenaCellIterImpl::span.js::gc::FreeSpan::first' may be used uninitialized in this function [-Wmaybe-uninitialized]
26:39.03 In file included from /opt/FirefoxSource/mozilla-release/objdir-droid/js/src/Unified_cpp_js_src7.cpp:101:0:
26:39.03 /opt/FirefoxSource/mozilla-release/js/src/jsgc.cpp:2225:30: note: '*((void*)(& i)+12).js::gc::ArenaCellIterImpl::span.js::gc::FreeSpan::first' was declared here
26:39.03 In file included from /opt/FirefoxSource/mozilla-release/js/src/vm/Shape-inl.h:22:0,
26:39.03                  from /opt/FirefoxSource/mozilla-release/js/src/jsscriptinlines.h:19,
26:39.03                  from /opt/FirefoxSource/mozilla-release/js/src/jsapi.cpp:91,
26:39.03                  from /opt/FirefoxSource/mozilla-release/objdir-droid/js/src/Unified_cpp_js_src7.cpp:20:
26:39.03 /opt/FirefoxSource/mozilla-release/js/src/jsgcinlines.h: In function 'void js::ReleaseAllJITCode(js::FreeOp*)':
26:39.03 Warning: -Wmaybe-uninitialized in /opt/FirefoxSource/mozilla-release/js/src/jsgcinlines.h: '*((void*)(& i)+12).js::gc::ArenaCellIterImpl::thing' may be used uninitialized in this function
26:39.03 /opt/FirefoxSource/mozilla-release/js/src/jsgcinlines.h:193:27: warning: '*((void*)(& i)+12).js::gc::ArenaCellIterImpl::thing' may be used uninitialized in this function [-Wmaybe-uninitialized]
26:39.03 In file included from /opt/FirefoxSource/mozilla-release/objdir-droid/js/src/Unified_cpp_js_src7.cpp:101:0:
26:39.04 /opt/FirefoxSource/mozilla-release/js/src/jsgc.cpp:6724:27: note: '*((void*)(& i)+12).js::gc::ArenaCellIterImpl::thing' was declared here
26:39.04 In file included from /opt/FirefoxSource/mozilla-release/js/src/gc/Barrier.h:12:0,
26:39.04                  from /opt/FirefoxSource/mozilla-release/js/src/jsobj.h:21,
26:39.04                  from /opt/FirefoxSource/mozilla-release/js/src/jsfun.h:14,
26:39.04                  from /opt/FirefoxSource/mozilla-release/js/src/jit/JitFrameIterator.h:10,
26:39.04                  from /opt/FirefoxSource/mozilla-release/js/src/jit/Bailouts.h:12,
26:39.04                  from /opt/FirefoxSource/mozilla-release/js/src/jit/LIR.h:15,
26:39.04                  from /opt/FirefoxSource/mozilla-release/js/src/jit/shared/Lowering-shared.h:13,
26:39.04                  from /opt/FirefoxSource/mozilla-release/js/src/jit/shared/Lowering-shared-inl.h:10,
26:39.04                  from /opt/FirefoxSource/mozilla-release/js/src/jit/shared/Lowering-shared.cpp:7,
26:39.04                  from /opt/FirefoxSource/mozilla-release/objdir-droid/js/src/Unified_cpp_js_src7.cpp:2:
26:39.04 Warning: -Wmaybe-uninitialized in /opt/FirefoxSource/mozilla-release/js/src/gc/Heap.h: '*((void*)(& i)+12).js::gc::ArenaCellIterImpl::span.js::gc::FreeSpan::last' may be used uninitialized in this function
26:39.04 /opt/FirefoxSource/mozilla-release/js/src/gc/Heap.h:304:48: warning: '*((void*)(& i)+12).js::gc::ArenaCellIterImpl::span.js::gc::FreeSpan::last' may be used uninitialized in this function [-Wmaybe-uninitialized]
26:39.04 In file included from /opt/FirefoxSource/mozilla-release/objdir-droid/js/src/Unified_cpp_js_src7.cpp:101:0:
26:39.04 /opt/FirefoxSource/mozilla-release/js/src/jsgc.cpp:6724:27: note: '*((void*)(& i)+12).js::gc::ArenaCellIterImpl::span.js::gc::FreeSpan::last' was declared here
26:39.04 In file included from /opt/FirefoxSource/mozilla-release/js/src/vm/Shape-inl.h:22:0,
26:39.04                  from /opt/FirefoxSource/mozilla-release/js/src/jsscriptinlines.h:19,
26:39.04                  from /opt/FirefoxSource/mozilla-release/js/src/jsapi.cpp:91,
26:39.04                  from /opt/FirefoxSource/mozilla-release/objdir-droid/js/src/Unified_cpp_js_src7.cpp:20:
26:39.04 Warning: -Wmaybe-uninitialized in /opt/FirefoxSource/mozilla-release/js/src/jsgcinlines.h: '*((void*)(& i)+12).js::gc::ArenaCellIterImpl::span.js::gc::FreeSpan::first' may be used uninitialized in this function
26:39.04 /opt/FirefoxSource/mozilla-release/js/src/jsgcinlines.h:134:9: warning: '*((void*)(& i)+12).js::gc::ArenaCellIterImpl::span.js::gc::FreeSpan::first' may be used uninitialized in this function [-Wmaybe-uninitialized]
26:39.04 In file included from /opt/FirefoxSource/mozilla-release/objdir-droid/js/src/Unified_cpp_js_src7.cpp:101:0:
26:39.04 /opt/FirefoxSource/mozilla-release/js/src/jsgc.cpp:6724:27: note: '*((void*)(& i)+12).js::gc::ArenaCellIterImpl::span.js::gc::FreeSpan::first' was declared here
26:39.04 In file included from /opt/FirefoxSource/mozilla-release/js/src/vm/Shape-inl.h:22:0,
26:39.04                  from /opt/FirefoxSource/mozilla-release/js/src/jsscriptinlines.h:19,
26:39.04                  from /opt/FirefoxSource/mozilla-release/js/src/jsapi.cpp:91,
26:39.04                  from /opt/FirefoxSource/mozilla-release/objdir-droid/js/src/Unified_cpp_js_src7.cpp:20:
26:39.04 /opt/FirefoxSource/mozilla-release/js/src/jsgcinlines.h: In function 'void js::PurgeJITCaches(JS::Zone*)':
26:39.04 Warning: -Wmaybe-uninitialized in /opt/FirefoxSource/mozilla-release/js/src/jsgcinlines.h: '*((void*)(& i)+12).js::gc::ArenaCellIterImpl::thing' may be used uninitialized in this function
26:39.04 /opt/FirefoxSource/mozilla-release/js/src/jsgcinlines.h:193:27: warning: '*((void*)(& i)+12).js::gc::ArenaCellIterImpl::thing' may be used uninitialized in this function [-Wmaybe-uninitialized]
26:39.04 In file included from /opt/FirefoxSource/mozilla-release/objdir-droid/js/src/Unified_cpp_js_src7.cpp:101:0:
26:39.04 /opt/FirefoxSource/mozilla-release/js/src/jsgc.cpp:6742:30: note: '*((void*)(& i)+12).js::gc::ArenaCellIterImpl::thing' was declared here
26:39.04 In file included from /opt/FirefoxSource/mozilla-release/js/src/gc/Barrier.h:12:0,
26:39.04                  from /opt/FirefoxSource/mozilla-release/js/src/jsobj.h:21,
26:39.04                  from /opt/FirefoxSource/mozilla-release/js/src/jsfun.h:14,
26:39.04                  from /opt/FirefoxSource/mozilla-release/js/src/jit/JitFrameIterator.h:10,
26:39.04                  from /opt/FirefoxSource/mozilla-release/js/src/jit/Bailouts.h:12,
26:39.04                  from /opt/FirefoxSource/mozilla-release/js/src/jit/LIR.h:15,
26:39.04                  from /opt/FirefoxSource/mozilla-release/js/src/jit/shared/Lowering-shared.h:13,
26:39.04                  from /opt/FirefoxSource/mozilla-release/js/src/jit/shared/Lowering-shared-inl.h:10,
26:39.04                  from /opt/FirefoxSource/mozilla-release/js/src/jit/shared/Lowering-shared.cpp:7,
26:39.04                  from /opt/FirefoxSource/mozilla-release/objdir-droid/js/src/Unified_cpp_js_src7.cpp:2:
26:39.04 Warning: -Wmaybe-uninitialized in /opt/FirefoxSource/mozilla-release/js/src/gc/Heap.h: '*((void*)(& i)+12).js::gc::ArenaCellIterImpl::span.js::gc::FreeSpan::last' may be used uninitialized in this function
26:39.04 /opt/FirefoxSource/mozilla-release/js/src/gc/Heap.h:304:48: warning: '*((void*)(& i)+12).js::gc::ArenaCellIterImpl::span.js::gc::FreeSpan::last' may be used uninitialized in this function [-Wmaybe-uninitialized]
26:39.04 In file included from /opt/FirefoxSource/mozilla-release/objdir-droid/js/src/Unified_cpp_js_src7.cpp:101:0:
26:39.04 /opt/FirefoxSource/mozilla-release/js/src/jsgc.cpp:6742:30: note: '*((void*)(& i)+12).js::gc::ArenaCellIterImpl::span.js::gc::FreeSpan::last' was declared here
26:39.04 In file included from /opt/FirefoxSource/mozilla-release/js/src/vm/Shape-inl.h:22:0,
26:39.04                  from /opt/FirefoxSource/mozilla-release/js/src/jsscriptinlines.h:19,
26:39.04                  from /opt/FirefoxSource/mozilla-release/js/src/jsapi.cpp:91,
26:39.04                  from /opt/FirefoxSource/mozilla-release/objdir-droid/js/src/Unified_cpp_js_src7.cpp:20:
26:39.04 Warning: -Wmaybe-uninitialized in /opt/FirefoxSource/mozilla-release/js/src/jsgcinlines.h: '*((void*)(& i)+12).js::gc::ArenaCellIterImpl::span.js::gc::FreeSpan::first' may be used uninitialized in this function
26:39.04 /opt/FirefoxSource/mozilla-release/js/src/jsgcinlines.h:134:9: warning: '*((void*)(& i)+12).js::gc::ArenaCellIterImpl::span.js::gc::FreeSpan::first' may be used uninitialized in this function [-Wmaybe-uninitialized]
26:39.04 In file included from /opt/FirefoxSource/mozilla-release/objdir-droid/js/src/Unified_cpp_js_src7.cpp:101:0:
26:39.04 /opt/FirefoxSource/mozilla-release/js/src/jsgc.cpp:6742:30: note: '*((void*)(& i)+12).js::gc::ArenaCellIterImpl::span.js::gc::FreeSpan::first' was declared here
26:39.04 In file included from /opt/FirefoxSource/mozilla-release/js/src/jit/Bailouts.h:12:0,
26:39.04                  from /opt/FirefoxSource/mozilla-release/js/src/jit/LIR.h:15,
26:39.04                  from /opt/FirefoxSource/mozilla-release/js/src/jit/shared/Lowering-shared.h:13,
26:39.04                  from /opt/FirefoxSource/mozilla-release/js/src/jit/shared/Lowering-shared-inl.h:10,
26:39.04                  from /opt/FirefoxSource/mozilla-release/js/src/jit/shared/Lowering-shared.cpp:7,
26:39.04                  from /opt/FirefoxSource/mozilla-release/objdir-droid/js/src/Unified_cpp_js_src7.cpp:2:
26:39.04 /opt/FirefoxSource/mozilla-release/js/src/jit/JitFrameIterator.h: In member function 'void js::jit::JitFrameIterator::unaliasedForEachActual(Op, js::jit::ReadFrameArgsBehavior) const [with Op = js::CopyTo]':
26:39.05 Warning: -Wmaybe-uninitialized in /opt/FirefoxSource/mozilla-release/js/src/jit/JitFrameIterator.h: 'end' may be used uninitialized in this function
26:39.05 /opt/FirefoxSource/mozilla-release/js/src/jit/JitFrameIterator.h:235:10: warning: 'end' may be used uninitialized in this function [-Wmaybe-uninitialized]
26:39.05 Warning: -Wmaybe-uninitialized in /opt/FirefoxSource/mozilla-release/js/src/jit/JitFrameIterator.h: 'start' may be used uninitialized in this function
26:39.05 /opt/FirefoxSource/mozilla-release/js/src/jit/JitFrameIterator.h:235:10: warning: 'start' may be used uninitialized in this function [-Wmaybe-uninitialized]
26:39.25 libjs_static.a
26:42.84 Unified_cpp_js_src_shell0.oUnified_cpp_js_src_jsapi-tests0.o
26:42.84 Unified_cpp_js_src_jsapi-tests1.o
26:42.84 Unified_cpp_js_src_gdb0.o
26:42.84 StaticXULComponentsStart.o
26:43.14 libxul_s.a.desc
26:43.14 libxul.so
26:45.68 gdb-tests
26:48.14 Unified_cpp_js_src_jsapi-tests2.o
26:51.41 Unified_cpp_js_src_jsapi-tests3.o
26:53.91 Unified_cpp_js_src_jsapi-tests4.o
26:53.94 js
26:55.88 Unified_cpp_js_src_jsapi-tests5.o
27:05.46 jsapi-tests
29:07.71 triplescat.o
29:07.71 TestComponent.o
29:07.71 PropertiesTest.o
29:07.71 ReadNTLM.o
29:07.72 TestAudioEventTimeline.o
29:08.16 libtest656331.so
29:08.50 TestComponent.o
29:08.66 libtestcomponent.so
29:08.83 test_tone.o
29:08.96 triplescat
29:09.04 test_tone
29:09.19 TestCSPParser.o
29:09.19 TestGetURL.o
29:09.26 TestTXMgr.o
29:10.15 TestAudioEventTimeline
29:10.33 rdfpoll.o
29:10.65 TestBlockingSocket.o
29:10.94 rdfpoll
29:10.99 TestNativeXMLHttpRequest.o
29:11.11 test_AsXXX_helpers.o
29:11.11 test_async_callbacks_with_spun_event_loops.o
29:11.11 TestCallbacks.o
29:11.54 TestTXMgr
29:11.68 TestComponent.o
29:11.74 TestPlainTextSerializer.o
29:11.87 libtestcompnoaslr.so
29:12.00 TestAudioChannelService.o
29:12.33 test_asyncStatementExecution_transaction.o
29:12.46 TestDNS.o
29:13.19 TestCSPParser
29:13.19 TestGetURL
29:13.20 test_binding_params.o
29:13.27 TestNativeXMLHttpRequest
29:13.38 TestPlainTextSerializer
29:13.42 TestAudioChannelService
29:13.63 xpcshell.o
29:13.65 test_file_perms.o
29:13.86 xpcshell
29:13.98 Unified_cpp_components_native0.o
29:14.11 TestIncrementalDownload.o
29:14.33 test_mutex.o
29:14.61 TestOpen.o
29:14.74 test_service_init_background_thread.o
29:14.85 libxpctest.so
29:14.95 test_statement_scoper.o
29:15.16 TestLineBreak.o
29:15.55 test_StatementCache.o
29:15.77 test_transaction_helper.o
29:15.89 TestLineBreak
29:15.99 TestProtocols.o
29:15.99 Unified_cpp_xpcom_sample0.o
29:16.40 test_true_async.o
29:16.43 libxpcomsample.so
29:16.74 TestAppShellSteadyState.o
29:16.94 test_unlock_notify.o
29:17.22 TestServ.o
29:17.89 test_AsXXX_helpers
29:17.89 test_async_callbacks_with_spun_event_loops
29:18.01 Unified_cpp_streamconv_test0.o
29:18.20 TestStreamConv
29:18.31 nsIFileEnumerator.o
29:18.31 TestArguments.o
29:18.72 TestBlockingProcess.o
29:18.88 test_asyncStatementExecution_transaction
29:18.98 TestCallTemplates.o
29:18.98 test_binding_params
29:19.03 TestINIParser.o
29:19.07 test_file_perms
29:19.13 TestStandardURL.o
29:19.16 test_mutex
29:19.21 TestAppShellSteadyState
29:19.25 test_service_init_background_thread
29:19.27 TestPRIntN.o
29:19.34 test_statement_scoper
29:19.41 TestStartupCache.o
29:19.42 test_StatementCache
29:19.51 test_transaction_helper
29:19.59 test_true_async
29:19.68 test_unlock_notify
29:19.71 TestQuickReturn.o
29:19.89 TestRacingServiceManager.o
29:19.90 TestWebGLElementArrayCache.o
29:19.96 TestRegistrationOrder.o
29:20.16 TestThreadPoolListener.o
29:20.38 TestStartupCache
29:20.43 TestStreamLoader.o
29:20.58 TestMinStringAPI.o
29:20.73 TestMinStringAPI
29:20.79 TestTimers.o
29:20.83 rdfcat.o
29:20.87 TestUpload.o
29:21.31 rdfcat
29:21.38 TestWebGLElementArrayCache
29:21.46 TestCertDB.o
29:21.54 TestUnicodeArguments.o
29:21.58 NormalizationTest.o
29:21.58 UnicharSelfTest.o
29:21.67 TestCertDB
29:21.81 TestAudioBuffers.o
29:21.81 TestAudioMixer.o
29:22.29 ShowAlignments.o
29:22.29 TestURLParser.o
29:22.37 TestAutoPtr.o
29:22.48 TestAutoRef.o
29:22.75 NormalizationTest
29:22.75 UnicharSelfTest
29:22.89 TestAudioBuffers
29:22.89 TestAudioMixer
29:22.99 urltest.o
29:23.05 TestBind.o
29:23.09 TestCOMArray.o
29:23.42 TestCookie.o
29:23.62 TestCOMPtr.o
29:23.67 TestSTSParser.o
29:24.08 TestUDPSocket.o
29:24.28 PropertiesTest
29:24.28 ReadNTLM
29:24.38 TestBlockingSocket
29:24.46 TestCallbacks
29:24.48 TestCOMPtrEq.o
29:24.56 TestDNS
29:24.65 TestDeque.o
29:24.83 TestFile.o
29:24.90 TestHashtables.o
29:25.24 TestIncrementalDownload
29:25.34 TestID.o
29:25.59 TestNsRefPtr.o
29:25.70 TestObserverArray.o
29:25.73 TestOpen
29:25.74 TestObserverService.o
29:25.82 TestProtocols
29:25.91 TestServ
29:26.02 TestStandardURL
29:26.11 TestStreamLoader
29:26.19 TestPipe.o
29:26.21 TestUpload
29:26.30 TestURLParser
29:26.35 TestPLDHash.o
29:26.39 urltest
29:26.48 TestBind
29:26.57 TestCookie
29:26.66 TestStringAPI.o
29:26.67 TestSTSParser
29:26.76 TestUDPSocket
29:26.79 TestTArray.o
29:26.84 TestTextFormatter.o
29:26.98 TestThreadUtils.o
29:27.02 TestJemalloc.o
29:27.33 nsIFileEnumerator
29:27.33 TestArguments
29:27.42 TestBlockingProcess
29:27.49 TestCallTemplates
29:27.56 TestINIParser
29:27.65 TestPRIntN
29:27.73 TestQuickReturn
29:27.82 TestRacingServiceManager
29:27.82 TestRegistrationOrder
29:27.86 TestThreadPoolListener
29:27.89 TestTimers
29:27.93 TestUnicodeArguments
29:27.94 ShowAlignments
29:27.98 TestAutoPtr
29:28.03 TestAutoRef
29:28.04 TestCOMArray
29:28.07 TestCOMPtr
29:28.10 TestCOMPtrEq
29:28.14 TestDeque
29:28.16 TestFile
29:28.19 TestHashtables
29:28.22 TestID
29:28.26 TestNsRefPtr
29:28.28 TestObserverArray
29:28.31 TestObserverService
29:28.36 TestPipe
29:28.36 TestPLDHash
29:28.40 TestStringAPI
29:28.45 TestTextFormatter
29:28.45 TestThreadUtils
29:28.49 TestJemalloc
29:30.96 TestTArray
29:36.27 /opt/FirefoxSource/mozilla-release/toolkit/modules/GMPUtils.jsm: WARNING: no preprocessor directives found
29:38.40 /opt/FirefoxSource/mozilla-release/config/rules.mk:1512: warning: overriding recipe for target '../../../dist/bin/modules/LoginManagerParent.jsm'
29:38.40 /opt/FirefoxSource/mozilla-release/config/rules.mk:1447: warning: ignoring old recipe for target '../../../dist/bin/modules/LoginManagerParent.jsm'
29:39.11 Exporting extension to source/test/addons/packed.xpi.
29:39.11 Exporting extension to source/test/addons/simple-prefs.xpi.
29:39.60 Exporting extension to source/test/addons/require.xpi.
29:39.78 Exporting extension to source/test/addons/l10n.xpi.
29:40.17 Exporting extension to source/test/addons/e10s.xpi.
29:40.20 Exporting extension to source/test/addons/child_process.xpi.
29:40.40 Exporting extension to source/test/addons/addon-manager.xpi.
29:40.41 Exporting extension to source/test/addons/unpacked.xpi.
29:40.71 Exporting extension to source/test/addons/unsafe-content-script.xpi.
29:40.98 Exporting extension to source/test/addons/standard-id.xpi.
29:41.12 Exporting extension to source/test/addons/page-mod-debugger-pre.xpi.
29:41.38 Exporting extension to source/test/addons/translators.xpi.
29:41.39 /opt/FirefoxSource/mozilla-release/addon-sdk/source/python-lib/cuddlefish/xpi.py:22: UserWarning: Duplicate name: 'locale/'
29:41.39   zf.writestr(dirinfo, "")
29:41.40 Exporting extension to source/test/addons/l10n-properties.xpi.
29:41.50 Exporting extension to source/test/addons/places.xpi.
29:41.63 Exporting extension to source/test/addons/main.xpi.
29:41.78 Exporting extension to source/test/addons/name-in-numbers.xpi.
29:41.84 Exporting extension to source/test/addons/self.xpi.
29:41.88 Exporting extension to source/test/addons/content-permissions.xpi.
29:42.02 Exporting extension to source/test/addons/preferences-branch.xpi.
29:42.14 Exporting extension to source/test/addons/tab-close-on-startup.xpi.
29:42.28 Exporting extension to source/test/addons/curly-id.xpi.
29:42.30 Exporting extension to source/test/addons/e10s-tabs.xpi.
29:42.41 Exporting extension to source/test/addons/packaging.xpi.
29:42.49 Exporting extension to source/test/addons/private-browsing-supported.xpi.
29:42.56 Exporting extension to source/test/addons/contributors.xpi.
29:42.56 Exporting extension to source/test/addons/predefined-id-with-at.xpi.
29:42.64 Warning: missing module: ./toolkit-require-reload-child
29:42.69 Exporting extension to source/test/addons/name-in-numbers-plus.xpi.
29:42.86 Exporting extension to source/test/addons/toolkit-require-reload.xpi.
29:42.90 Exporting extension to source/test/addons/symbiont.xpi.
29:42.94 Exporting extension to source/test/addons/author-email.xpi.
29:43.21 Exporting extension to source/test/addons/page-mod-debugger-post.xpi.
29:43.25 Exporting extension to source/test/addons/e10s-content.xpi.
29:43.26 Exporting extension to source/test/addons/simple-prefs-regression.xpi.
29:43.43 Exporting extension to source/test/addons/chrome.xpi.
29:43.43 Exporting extension to source/test/addons/developers.xpi.
29:43.59 Exporting extension to source/test/addons/simple-prefs-l10n.xpi.
29:43.94 Exporting extension to source/test/addons/layout-change.xpi.
29:49.30 /opt/FirefoxSource/mozilla-release/netwerk/base/security-prefs.js: WARNING: no preprocessor directives found
29:57.17   adding: install.rdf (deflated 52%)
29:57.38   adding: plugins/libnptest.so (deflated 64%)
29:57.59   adding: plugins/libnpsecondtest.so (deflated 64%)
30:01.01 /opt/FirefoxSource/mozilla-release/config/rules.mk:1512: warning: overriding recipe for target '../../../dist/bin/modules/LoginManagerParent.jsm'
30:01.01 /opt/FirefoxSource/mozilla-release/config/rules.mk:1447: warning: ignoring old recipe for target '../../../dist/bin/modules/LoginManagerParent.jsm'
30:09.92 /opt/FirefoxSource/mozilla-release/mobile/android/thirdparty/jap/branding/locales/en-US/brand.properties: WARNING: no useful preprocessor directives found
30:10.09 /opt/FirefoxSource/mozilla-release/mobile/locales/en-US/overrides/netError.dtd: WARNING: no preprocessor directives found
30:10.14 /opt/FirefoxSource/mozilla-release/mobile/locales/en-US/overrides/appstrings.properties: WARNING: no useful preprocessor directives found
30:10.16 /opt/FirefoxSource/mozilla-release/mobile/locales/en-US/overrides/passwordmgr.properties: WARNING: no useful preprocessor directives found
30:10.95 /opt/FirefoxSource/mozilla-release/mobile/android/base/WebappManifestFragment.xml.frag.in: WARNING: no preprocessor directives found
30:11.25 make[5]: *** No rule to make target 'generated/preprocessed/org/mozilla/gecko/AppConstants.java', needed by 'constants.jar'.  Schluss.
30:11.25 make[5]: *** Warte auf noch nicht beendete Prozesse...
30:11.43 Read 3 engines: [u'Google', u'Yahoo', u'Bing']
30:11.43 Default engine is 'Google'.
30:11.43 /opt/FirefoxSource/mozilla-release/objdir-droid/mobile/android/base/res/raw/browsersearch.json updated
30:11.55 Reading 0 suggested sites: []
30:11.55 /opt/FirefoxSource/mozilla-release/objdir-droid/mobile/android/base/res/raw/suggestedsites.json updated
30:11.56 /opt/FirefoxSource/mozilla-release/config/recurse.mk:82: recipe for target 'mobile/android/base/libs' failed
30:11.56 make[4]: *** [mobile/android/base/libs] Error 2
30:11.56 /opt/FirefoxSource/mozilla-release/config/recurse.mk:36: recipe for target 'libs' failed
30:11.56 make[3]: *** [libs] Error 2
30:11.56 /opt/FirefoxSource/mozilla-release/config/rules.mk:541: recipe for target 'default' failed
30:11.56 make[2]: *** [default] Error 2
30:11.56 /opt/FirefoxSource/mozilla-release/client.mk:398: recipe for target 'realbuild' failed
30:11.56 make[1]: *** [realbuild] Error 2
30:11.56 client.mk:171: recipe for target 'build' failed
30:11.56 make: *** [build] Error 2
30:11.59 366 compiler warnings present.
30:12.10 Notification center failed: Install the python dbus module to get a notification when the build finishes.
Build step 'Shell ausführen' marked build as failure
[PostBuildScript] - Execution post build scripts.
[PostBuildScript] Build is not success : do not execute script
Finished: FAILURE