Console Output

Skipping 388 KB.. Full Log
12:11.34 /opt/FirefoxSource/mozilla-release/media/omx-plugin/include/gb/stagefright/MetaData.h:120:22: warning: multi-character character constant [-Wmultichar]
12:11.34 Warning: -Wmultichar in /opt/FirefoxSource/mozilla-release/media/omx-plugin/include/gb/stagefright/MetaData.h: multi-character character constant
12:11.35 /opt/FirefoxSource/mozilla-release/media/omx-plugin/include/gb/stagefright/MetaData.h:121:22: warning: multi-character character constant [-Wmultichar]
12:11.35 Warning: -Wmultichar in /opt/FirefoxSource/mozilla-release/media/omx-plugin/include/gb/stagefright/MetaData.h: multi-character character constant
12:11.35 /opt/FirefoxSource/mozilla-release/media/omx-plugin/include/gb/stagefright/MetaData.h:122:22: warning: multi-character character constant [-Wmultichar]
12:11.35 Warning: -Wmultichar in /opt/FirefoxSource/mozilla-release/media/omx-plugin/include/gb/stagefright/MetaData.h: multi-character character constant
12:11.35 /opt/FirefoxSource/mozilla-release/media/omx-plugin/include/gb/stagefright/MetaData.h:123:24: warning: multi-character character constant [-Wmultichar]
12:11.35 libstagefright.so
12:11.45 libstagefright.o
12:11.55 TestMacroArgs.o
12:11.69 In file included from /opt/FirefoxSource/mozilla-release/media/omx-plugin/lib/hc/libstagefright/../../gb/libstagefright/libstagefright.cpp:12:0,
12:11.69                  from /opt/FirefoxSource/mozilla-release/media/omx-plugin/lib/hc/libstagefright/libstagefright.cpp:9:
12:11.70 Warning: -Wmultichar in /opt/FirefoxSource/mozilla-release/media/omx-plugin/include/gb/stagefright/MetaData.h: multi-character character constant
12:11.70 /opt/FirefoxSource/mozilla-release/media/omx-plugin/include/gb/stagefright/MetaData.h:32:20: warning: multi-character character constant [-Wmultichar]
12:11.70 Warning: -Wmultichar in /opt/FirefoxSource/mozilla-release/media/omx-plugin/include/gb/stagefright/MetaData.h: multi-character character constant
12:11.70 /opt/FirefoxSource/mozilla-release/media/omx-plugin/include/gb/stagefright/MetaData.h:33:17: warning: multi-character character constant [-Wmultichar]
12:11.70 Warning: -Wmultichar in /opt/FirefoxSource/mozilla-release/media/omx-plugin/include/gb/stagefright/MetaData.h: multi-character character constant
12:11.70 /opt/FirefoxSource/mozilla-release/media/omx-plugin/include/gb/stagefright/MetaData.h:34:18: warning: multi-character character constant [-Wmultichar]
12:11.70 Warning: -Wmultichar in /opt/FirefoxSource/mozilla-release/media/omx-plugin/include/gb/stagefright/MetaData.h: multi-character character constant
12:11.70 /opt/FirefoxSource/mozilla-release/media/omx-plugin/include/gb/stagefright/MetaData.h:35:20: warning: multi-character character constant [-Wmultichar]
12:11.70 Warning: -Wmultichar in /opt/FirefoxSource/mozilla-release/media/omx-plugin/include/gb/stagefright/MetaData.h: multi-character character constant
12:11.70 /opt/FirefoxSource/mozilla-release/media/omx-plugin/include/gb/stagefright/MetaData.h:36:27: warning: multi-character character constant [-Wmultichar]
12:11.70 Warning: -Wmultichar in /opt/FirefoxSource/mozilla-release/media/omx-plugin/include/gb/stagefright/MetaData.h: multi-character character constant
12:11.70 /opt/FirefoxSource/mozilla-release/media/omx-plugin/include/gb/stagefright/MetaData.h:37:18: warning: multi-character character constant [-Wmultichar]
12:11.70 Warning: -Wmultichar in /opt/FirefoxSource/mozilla-release/media/omx-plugin/include/gb/stagefright/MetaData.h: multi-character character constant
12:11.70 /opt/FirefoxSource/mozilla-release/media/omx-plugin/include/gb/stagefright/MetaData.h:38:23: warning: multi-character character constant [-Wmultichar]
12:11.70 Warning: -Wmultichar in /opt/FirefoxSource/mozilla-release/media/omx-plugin/include/gb/stagefright/MetaData.h: multi-character character constant
12:11.70 /opt/FirefoxSource/mozilla-release/media/omx-plugin/include/gb/stagefright/MetaData.h:39:24: warning: multi-character character constant [-Wmultichar]
12:11.70 Warning: -Wmultichar in /opt/FirefoxSource/mozilla-release/media/omx-plugin/include/gb/stagefright/MetaData.h: multi-character character constant
12:11.70 /opt/FirefoxSource/mozilla-release/media/omx-plugin/include/gb/stagefright/MetaData.h:40:22: warning: multi-character character constant [-Wmultichar]
12:11.70 Warning: -Wmultichar in /opt/FirefoxSource/mozilla-release/media/omx-plugin/include/gb/stagefright/MetaData.h: multi-character character constant
12:11.70 /opt/FirefoxSource/mozilla-release/media/omx-plugin/include/gb/stagefright/MetaData.h:41:19: warning: multi-character character constant [-Wmultichar]
12:11.70 Warning: -Wmultichar in /opt/FirefoxSource/mozilla-release/media/omx-plugin/include/gb/stagefright/MetaData.h: multi-character character constant
12:11.70 /opt/FirefoxSource/mozilla-release/media/omx-plugin/include/gb/stagefright/MetaData.h:42:16: warning: multi-character character constant [-Wmultichar]
12:11.70 Warning: -Wmultichar in /opt/FirefoxSource/mozilla-release/media/omx-plugin/include/gb/stagefright/MetaData.h: multi-character character constant
12:11.70 /opt/FirefoxSource/mozilla-release/media/omx-plugin/include/gb/stagefright/MetaData.h:43:16: warning: multi-character character constant [-Wmultichar]
12:11.70 Warning: -Wmultichar in /opt/FirefoxSource/mozilla-release/media/omx-plugin/include/gb/stagefright/MetaData.h: multi-character character constant
12:11.70 /opt/FirefoxSource/mozilla-release/media/omx-plugin/include/gb/stagefright/MetaData.h:44:22: warning: multi-character character constant [-Wmultichar]
12:11.70 Warning: -Wmultichar in /opt/FirefoxSource/mozilla-release/media/omx-plugin/include/gb/stagefright/MetaData.h: multi-character character constant
12:11.70 /opt/FirefoxSource/mozilla-release/media/omx-plugin/include/gb/stagefright/MetaData.h:45:23: warning: multi-character character constant [-Wmultichar]
12:11.70 Warning: -Wmultichar in /opt/FirefoxSource/mozilla-release/media/omx-plugin/include/gb/stagefright/MetaData.h: multi-character character constant
12:11.70 /opt/FirefoxSource/mozilla-release/media/omx-plugin/include/gb/stagefright/MetaData.h:46:29: warning: multi-character character constant [-Wmultichar]
12:11.70 Warning: -Wmultichar in /opt/FirefoxSource/mozilla-release/media/omx-plugin/include/gb/stagefright/MetaData.h: multi-character character constant
12:11.70 /opt/FirefoxSource/mozilla-release/media/omx-plugin/include/gb/stagefright/MetaData.h:47:23: warning: multi-character character constant [-Wmultichar]
12:11.70 Warning: -Wmultichar in /opt/FirefoxSource/mozilla-release/media/omx-plugin/include/gb/stagefright/MetaData.h: multi-character character constant
12:11.70 /opt/FirefoxSource/mozilla-release/media/omx-plugin/include/gb/stagefright/MetaData.h:48:25: warning: multi-character character constant [-Wmultichar]
12:11.70 Warning: -Wmultichar in /opt/FirefoxSource/mozilla-release/media/omx-plugin/include/gb/stagefright/MetaData.h: multi-character character constant
12:11.70 /opt/FirefoxSource/mozilla-release/media/omx-plugin/include/gb/stagefright/MetaData.h:49:16: warning: multi-character character constant [-Wmultichar]
12:11.70 Warning: -Wmultichar in /opt/FirefoxSource/mozilla-release/media/omx-plugin/include/gb/stagefright/MetaData.h: multi-character character constant
12:11.70 /opt/FirefoxSource/mozilla-release/media/omx-plugin/include/gb/stagefright/MetaData.h:50:19: warning: multi-character character constant [-Wmultichar]
12:11.70 Warning: -Wmultichar in /opt/FirefoxSource/mozilla-release/media/omx-plugin/include/gb/stagefright/MetaData.h: multi-character character constant
12:11.70 /opt/FirefoxSource/mozilla-release/media/omx-plugin/include/gb/stagefright/MetaData.h:51:22: warning: multi-character character constant [-Wmultichar]
12:11.70 Warning: -Wmultichar in /opt/FirefoxSource/mozilla-release/media/omx-plugin/include/gb/stagefright/MetaData.h: multi-character character constant
12:11.70 /opt/FirefoxSource/mozilla-release/media/omx-plugin/include/gb/stagefright/MetaData.h:52:21: warning: multi-character character constant [-Wmultichar]
12:11.70 Warning: -Wmultichar in /opt/FirefoxSource/mozilla-release/media/omx-plugin/include/gb/stagefright/MetaData.h: multi-character character constant
12:11.70 /opt/FirefoxSource/mozilla-release/media/omx-plugin/include/gb/stagefright/MetaData.h:53:22: warning: multi-character character constant [-Wmultichar]
12:11.70 Warning: -Wmultichar in /opt/FirefoxSource/mozilla-release/media/omx-plugin/include/gb/stagefright/MetaData.h: multi-character character constant
12:11.70 /opt/FirefoxSource/mozilla-release/media/omx-plugin/include/gb/stagefright/MetaData.h:54:20: warning: multi-character character constant [-Wmultichar]
12:11.70 Warning: -Wmultichar in /opt/FirefoxSource/mozilla-release/media/omx-plugin/include/gb/stagefright/MetaData.h: multi-character character constant
12:11.70 /opt/FirefoxSource/mozilla-release/media/omx-plugin/include/gb/stagefright/MetaData.h:55:23: warning: multi-character character constant [-Wmultichar]
12:11.70 Warning: -Wmultichar in /opt/FirefoxSource/mozilla-release/media/omx-plugin/include/gb/stagefright/MetaData.h: multi-character character constant
12:11.70 /opt/FirefoxSource/mozilla-release/media/omx-plugin/include/gb/stagefright/MetaData.h:56:27: warning: multi-character character constant [-Wmultichar]
12:11.70 Warning: -Wmultichar in /opt/FirefoxSource/mozilla-release/media/omx-plugin/include/gb/stagefright/MetaData.h: multi-character character constant
12:11.70 /opt/FirefoxSource/mozilla-release/media/omx-plugin/include/gb/stagefright/MetaData.h:57:28: warning: multi-character character constant [-Wmultichar]
12:11.70 Warning: -Wmultichar in /opt/FirefoxSource/mozilla-release/media/omx-plugin/include/gb/stagefright/MetaData.h: multi-character character constant
12:11.70 /opt/FirefoxSource/mozilla-release/media/omx-plugin/include/gb/stagefright/MetaData.h:58:20: warning: multi-character character constant [-Wmultichar]
12:11.70 Warning: -Wmultichar in /opt/FirefoxSource/mozilla-release/media/omx-plugin/include/gb/stagefright/MetaData.h: multi-character character constant
12:11.70 /opt/FirefoxSource/mozilla-release/media/omx-plugin/include/gb/stagefright/MetaData.h:59:24: warning: multi-character character constant [-Wmultichar]
12:11.70 Warning: -Wmultichar in /opt/FirefoxSource/mozilla-release/media/omx-plugin/include/gb/stagefright/MetaData.h: multi-character character constant
12:11.71 /opt/FirefoxSource/mozilla-release/media/omx-plugin/include/gb/stagefright/MetaData.h:60:25: warning: multi-character character constant [-Wmultichar]
12:11.71 Warning: -Wmultichar in /opt/FirefoxSource/mozilla-release/media/omx-plugin/include/gb/stagefright/MetaData.h: multi-character character constant
12:11.71 /opt/FirefoxSource/mozilla-release/media/omx-plugin/include/gb/stagefright/MetaData.h:62:17: warning: multi-character character constant [-Wmultichar]
12:11.71 Warning: -Wmultichar in /opt/FirefoxSource/mozilla-release/media/omx-plugin/include/gb/stagefright/MetaData.h: multi-character character constant
12:11.71 /opt/FirefoxSource/mozilla-release/media/omx-plugin/include/gb/stagefright/MetaData.h:63:18: warning: multi-character character constant [-Wmultichar]
12:11.71 Warning: -Wmultichar in /opt/FirefoxSource/mozilla-release/media/omx-plugin/include/gb/stagefright/MetaData.h: multi-character character constant
12:11.71 /opt/FirefoxSource/mozilla-release/media/omx-plugin/include/gb/stagefright/MetaData.h:64:23: warning: multi-character character constant [-Wmultichar]
12:11.71 Warning: -Wmultichar in /opt/FirefoxSource/mozilla-release/media/omx-plugin/include/gb/stagefright/MetaData.h: multi-character character constant
12:11.71 /opt/FirefoxSource/mozilla-release/media/omx-plugin/include/gb/stagefright/MetaData.h:65:20: warning: multi-character character constant [-Wmultichar]
12:11.71 Warning: -Wmultichar in /opt/FirefoxSource/mozilla-release/media/omx-plugin/include/gb/stagefright/MetaData.h: multi-character character constant
12:11.71 /opt/FirefoxSource/mozilla-release/media/omx-plugin/include/gb/stagefright/MetaData.h:66:17: warning: multi-character character constant [-Wmultichar]
12:11.71 Warning: -Wmultichar in /opt/FirefoxSource/mozilla-release/media/omx-plugin/include/gb/stagefright/MetaData.h: multi-character character constant
12:11.71 /opt/FirefoxSource/mozilla-release/media/omx-plugin/include/gb/stagefright/MetaData.h:67:17: warning: multi-character character constant [-Wmultichar]
12:11.71 Warning: -Wmultichar in /opt/FirefoxSource/mozilla-release/media/omx-plugin/include/gb/stagefright/MetaData.h: multi-character character constant
12:11.72 /opt/FirefoxSource/mozilla-release/media/omx-plugin/include/gb/stagefright/MetaData.h:68:16: warning: multi-character character constant [-Wmultichar]
12:11.72 Warning: -Wmultichar in /opt/FirefoxSource/mozilla-release/media/omx-plugin/include/gb/stagefright/MetaData.h: multi-character character constant
12:11.72 /opt/FirefoxSource/mozilla-release/media/omx-plugin/include/gb/stagefright/MetaData.h:69:20: warning: multi-character character constant [-Wmultichar]
12:11.72 Warning: -Wmultichar in /opt/FirefoxSource/mozilla-release/media/omx-plugin/include/gb/stagefright/MetaData.h: multi-character character constant
12:11.72 /opt/FirefoxSource/mozilla-release/media/omx-plugin/include/gb/stagefright/MetaData.h:70:24: warning: multi-character character constant [-Wmultichar]
12:11.72 Warning: -Wmultichar in /opt/FirefoxSource/mozilla-release/media/omx-plugin/include/gb/stagefright/MetaData.h: multi-character character constant
12:11.72 /opt/FirefoxSource/mozilla-release/media/omx-plugin/include/gb/stagefright/MetaData.h:71:18: warning: multi-character character constant [-Wmultichar]
12:11.72 Warning: -Wmultichar in /opt/FirefoxSource/mozilla-release/media/omx-plugin/include/gb/stagefright/MetaData.h: multi-character character constant
12:11.72 /opt/FirefoxSource/mozilla-release/media/omx-plugin/include/gb/stagefright/MetaData.h:72:25: warning: multi-character character constant [-Wmultichar]
12:11.72 Warning: -Wmultichar in /opt/FirefoxSource/mozilla-release/media/omx-plugin/include/gb/stagefright/MetaData.h: multi-character character constant
12:11.72 /opt/FirefoxSource/mozilla-release/media/omx-plugin/include/gb/stagefright/MetaData.h:73:22: warning: multi-character character constant [-Wmultichar]
12:11.72 Warning: -Wmultichar in /opt/FirefoxSource/mozilla-release/media/omx-plugin/include/gb/stagefright/MetaData.h: multi-character character constant
12:11.72 /opt/FirefoxSource/mozilla-release/media/omx-plugin/include/gb/stagefright/MetaData.h:74:16: warning: multi-character character constant [-Wmultichar]
12:11.72 Warning: -Wmultichar in /opt/FirefoxSource/mozilla-release/media/omx-plugin/include/gb/stagefright/MetaData.h: multi-character character constant
12:11.72 /opt/FirefoxSource/mozilla-release/media/omx-plugin/include/gb/stagefright/MetaData.h:75:18: warning: multi-character character constant [-Wmultichar]
12:11.72 Warning: -Wmultichar in /opt/FirefoxSource/mozilla-release/media/omx-plugin/include/gb/stagefright/MetaData.h: multi-character character constant
12:11.72 /opt/FirefoxSource/mozilla-release/media/omx-plugin/include/gb/stagefright/MetaData.h:76:23: warning: multi-character character constant [-Wmultichar]
12:11.72 Warning: -Wmultichar in /opt/FirefoxSource/mozilla-release/media/omx-plugin/include/gb/stagefright/MetaData.h: multi-character character constant
12:11.72 /opt/FirefoxSource/mozilla-release/media/omx-plugin/include/gb/stagefright/MetaData.h:77:21: warning: multi-character character constant [-Wmultichar]
12:11.72 Warning: -Wmultichar in /opt/FirefoxSource/mozilla-release/media/omx-plugin/include/gb/stagefright/MetaData.h: multi-character character constant
12:11.72 /opt/FirefoxSource/mozilla-release/media/omx-plugin/include/gb/stagefright/MetaData.h:80:24: warning: multi-character character constant [-Wmultichar]
12:11.72 Warning: -Wmultichar in /opt/FirefoxSource/mozilla-release/media/omx-plugin/include/gb/stagefright/MetaData.h: multi-character character constant
12:11.72 /opt/FirefoxSource/mozilla-release/media/omx-plugin/include/gb/stagefright/MetaData.h:81:22: warning: multi-character character constant [-Wmultichar]
12:11.72 Warning: -Wmultichar in /opt/FirefoxSource/mozilla-release/media/omx-plugin/include/gb/stagefright/MetaData.h: multi-character character constant
12:11.72 /opt/FirefoxSource/mozilla-release/media/omx-plugin/include/gb/stagefright/MetaData.h:84:27: warning: multi-character character constant [-Wmultichar]
12:11.72 Warning: -Wmultichar in /opt/FirefoxSource/mozilla-release/media/omx-plugin/include/gb/stagefright/MetaData.h: multi-character character constant
12:11.72 /opt/FirefoxSource/mozilla-release/media/omx-plugin/include/gb/stagefright/MetaData.h:85:26: warning: multi-character character constant [-Wmultichar]
12:11.72 Warning: -Wmultichar in /opt/FirefoxSource/mozilla-release/media/omx-plugin/include/gb/stagefright/MetaData.h: multi-character character constant
12:11.72 /opt/FirefoxSource/mozilla-release/media/omx-plugin/include/gb/stagefright/MetaData.h:90:20: warning: multi-character character constant [-Wmultichar]
12:11.72 Warning: -Wmultichar in /opt/FirefoxSource/mozilla-release/media/omx-plugin/include/gb/stagefright/MetaData.h: multi-character character constant
12:11.72 /opt/FirefoxSource/mozilla-release/media/omx-plugin/include/gb/stagefright/MetaData.h:94:27: warning: multi-character character constant [-Wmultichar]
12:11.72 Warning: -Wmultichar in /opt/FirefoxSource/mozilla-release/media/omx-plugin/include/gb/stagefright/MetaData.h: multi-character character constant
12:11.72 /opt/FirefoxSource/mozilla-release/media/omx-plugin/include/gb/stagefright/MetaData.h:95:26: warning: multi-character character constant [-Wmultichar]
12:11.72 Warning: -Wmultichar in /opt/FirefoxSource/mozilla-release/media/omx-plugin/include/gb/stagefright/MetaData.h: multi-character character constant
12:11.73 /opt/FirefoxSource/mozilla-release/media/omx-plugin/include/gb/stagefright/MetaData.h:97:23: warning: multi-character character constant [-Wmultichar]
12:11.73 Warning: -Wmultichar in /opt/FirefoxSource/mozilla-release/media/omx-plugin/include/gb/stagefright/MetaData.h: multi-character character constant
12:11.73 /opt/FirefoxSource/mozilla-release/media/omx-plugin/include/gb/stagefright/MetaData.h:100:20: warning: multi-character character constant [-Wmultichar]
12:11.73 Warning: -Wmultichar in /opt/FirefoxSource/mozilla-release/media/omx-plugin/include/gb/stagefright/MetaData.h: multi-character character constant
12:11.73 /opt/FirefoxSource/mozilla-release/media/omx-plugin/include/gb/stagefright/MetaData.h:102:24: warning: multi-character character constant [-Wmultichar]
12:11.73 Warning: -Wmultichar in /opt/FirefoxSource/mozilla-release/media/omx-plugin/include/gb/stagefright/MetaData.h: multi-character character constant
12:11.73 /opt/FirefoxSource/mozilla-release/media/omx-plugin/include/gb/stagefright/MetaData.h:104:24: warning: multi-character character constant [-Wmultichar]
12:11.73 Warning: -Wmultichar in /opt/FirefoxSource/mozilla-release/media/omx-plugin/include/gb/stagefright/MetaData.h: multi-character character constant
12:11.73 /opt/FirefoxSource/mozilla-release/media/omx-plugin/include/gb/stagefright/MetaData.h:108:17: warning: multi-character character constant [-Wmultichar]
12:11.73 Warning: -Wmultichar in /opt/FirefoxSource/mozilla-release/media/omx-plugin/include/gb/stagefright/MetaData.h: multi-character character constant
12:11.73 /opt/FirefoxSource/mozilla-release/media/omx-plugin/include/gb/stagefright/MetaData.h:109:17: warning: multi-character character constant [-Wmultichar]
12:11.73 Warning: -Wmultichar in /opt/FirefoxSource/mozilla-release/media/omx-plugin/include/gb/stagefright/MetaData.h: multi-character character constant
12:11.73 /opt/FirefoxSource/mozilla-release/media/omx-plugin/include/gb/stagefright/MetaData.h:118:21: warning: multi-character character constant [-Wmultichar]
12:11.73 Warning: -Wmultichar in /opt/FirefoxSource/mozilla-release/media/omx-plugin/include/gb/stagefright/MetaData.h: multi-character character constant
12:11.73 /opt/FirefoxSource/mozilla-release/media/omx-plugin/include/gb/stagefright/MetaData.h:119:25: warning: multi-character character constant [-Wmultichar]
12:11.73 Warning: -Wmultichar in /opt/FirefoxSource/mozilla-release/media/omx-plugin/include/gb/stagefright/MetaData.h: multi-character character constant
12:11.73 /opt/FirefoxSource/mozilla-release/media/omx-plugin/include/gb/stagefright/MetaData.h:120:22: warning: multi-character character constant [-Wmultichar]
12:11.73 Warning: -Wmultichar in /opt/FirefoxSource/mozilla-release/media/omx-plugin/include/gb/stagefright/MetaData.h: multi-character character constant
12:11.73 /opt/FirefoxSource/mozilla-release/media/omx-plugin/include/gb/stagefright/MetaData.h:121:22: warning: multi-character character constant [-Wmultichar]
12:11.73 Warning: -Wmultichar in /opt/FirefoxSource/mozilla-release/media/omx-plugin/include/gb/stagefright/MetaData.h: multi-character character constant
12:11.73 /opt/FirefoxSource/mozilla-release/media/omx-plugin/include/gb/stagefright/MetaData.h:122:22: warning: multi-character character constant [-Wmultichar]
12:11.73 Warning: -Wmultichar in /opt/FirefoxSource/mozilla-release/media/omx-plugin/include/gb/stagefright/MetaData.h: multi-character character constant
12:11.73 /opt/FirefoxSource/mozilla-release/media/omx-plugin/include/gb/stagefright/MetaData.h:123:24: warning: multi-character character constant [-Wmultichar]
12:11.73 libstagefright.so
12:11.76 OmxPlugin.o
12:12.06 TestMacroForEach.o
12:12.09 TestMaybe.o
12:12.15 TestPair.o
12:12.52 libomxplugin.so
12:12.59 libstagefright.o
12:12.82 In file included from /opt/FirefoxSource/mozilla-release/media/omx-plugin/lib/gb235/libstagefright/../../gb/libstagefright/libstagefright.cpp:12:0,
12:12.82                  from /opt/FirefoxSource/mozilla-release/media/omx-plugin/lib/gb235/libstagefright/libstagefright.cpp:8:
12:12.82 Warning: -Wmultichar in /opt/FirefoxSource/mozilla-release/media/omx-plugin/include/gb/stagefright/MetaData.h: multi-character character constant
12:12.82 /opt/FirefoxSource/mozilla-release/media/omx-plugin/include/gb/stagefright/MetaData.h:32:20: warning: multi-character character constant [-Wmultichar]
12:12.82 Warning: -Wmultichar in /opt/FirefoxSource/mozilla-release/media/omx-plugin/include/gb/stagefright/MetaData.h: multi-character character constant
12:12.82 /opt/FirefoxSource/mozilla-release/media/omx-plugin/include/gb/stagefright/MetaData.h:33:17: warning: multi-character character constant [-Wmultichar]
12:12.82 Warning: -Wmultichar in /opt/FirefoxSource/mozilla-release/media/omx-plugin/include/gb/stagefright/MetaData.h: multi-character character constant
12:12.82 /opt/FirefoxSource/mozilla-release/media/omx-plugin/include/gb/stagefright/MetaData.h:34:18: warning: multi-character character constant [-Wmultichar]
12:12.82 Warning: -Wmultichar in /opt/FirefoxSource/mozilla-release/media/omx-plugin/include/gb/stagefright/MetaData.h: multi-character character constant
12:12.82 /opt/FirefoxSource/mozilla-release/media/omx-plugin/include/gb/stagefright/MetaData.h:35:20: warning: multi-character character constant [-Wmultichar]
12:12.82 Warning: -Wmultichar in /opt/FirefoxSource/mozilla-release/media/omx-plugin/include/gb/stagefright/MetaData.h: multi-character character constant
12:12.82 /opt/FirefoxSource/mozilla-release/media/omx-plugin/include/gb/stagefright/MetaData.h:36:27: warning: multi-character character constant [-Wmultichar]
12:12.82 Warning: -Wmultichar in /opt/FirefoxSource/mozilla-release/media/omx-plugin/include/gb/stagefright/MetaData.h: multi-character character constant
12:12.82 /opt/FirefoxSource/mozilla-release/media/omx-plugin/include/gb/stagefright/MetaData.h:37:18: warning: multi-character character constant [-Wmultichar]
12:12.82 Warning: -Wmultichar in /opt/FirefoxSource/mozilla-release/media/omx-plugin/include/gb/stagefright/MetaData.h: multi-character character constant
12:12.82 /opt/FirefoxSource/mozilla-release/media/omx-plugin/include/gb/stagefright/MetaData.h:38:23: warning: multi-character character constant [-Wmultichar]
12:12.82 Warning: -Wmultichar in /opt/FirefoxSource/mozilla-release/media/omx-plugin/include/gb/stagefright/MetaData.h: multi-character character constant
12:12.82 /opt/FirefoxSource/mozilla-release/media/omx-plugin/include/gb/stagefright/MetaData.h:39:24: warning: multi-character character constant [-Wmultichar]
12:12.82 Warning: -Wmultichar in /opt/FirefoxSource/mozilla-release/media/omx-plugin/include/gb/stagefright/MetaData.h: multi-character character constant
12:12.82 /opt/FirefoxSource/mozilla-release/media/omx-plugin/include/gb/stagefright/MetaData.h:40:22: warning: multi-character character constant [-Wmultichar]
12:12.82 Warning: -Wmultichar in /opt/FirefoxSource/mozilla-release/media/omx-plugin/include/gb/stagefright/MetaData.h: multi-character character constant
12:12.82 /opt/FirefoxSource/mozilla-release/media/omx-plugin/include/gb/stagefright/MetaData.h:41:19: warning: multi-character character constant [-Wmultichar]
12:12.82 Warning: -Wmultichar in /opt/FirefoxSource/mozilla-release/media/omx-plugin/include/gb/stagefright/MetaData.h: multi-character character constant
12:12.82 /opt/FirefoxSource/mozilla-release/media/omx-plugin/include/gb/stagefright/MetaData.h:42:16: warning: multi-character character constant [-Wmultichar]
12:12.82 Warning: -Wmultichar in /opt/FirefoxSource/mozilla-release/media/omx-plugin/include/gb/stagefright/MetaData.h: multi-character character constant
12:12.82 /opt/FirefoxSource/mozilla-release/media/omx-plugin/include/gb/stagefright/MetaData.h:43:16: warning: multi-character character constant [-Wmultichar]
12:12.82 Warning: -Wmultichar in /opt/FirefoxSource/mozilla-release/media/omx-plugin/include/gb/stagefright/MetaData.h: multi-character character constant
12:12.82 /opt/FirefoxSource/mozilla-release/media/omx-plugin/include/gb/stagefright/MetaData.h:44:22: warning: multi-character character constant [-Wmultichar]
12:12.82 Warning: -Wmultichar in /opt/FirefoxSource/mozilla-release/media/omx-plugin/include/gb/stagefright/MetaData.h: multi-character character constant
12:12.82 /opt/FirefoxSource/mozilla-release/media/omx-plugin/include/gb/stagefright/MetaData.h:45:23: warning: multi-character character constant [-Wmultichar]
12:12.82 Warning: -Wmultichar in /opt/FirefoxSource/mozilla-release/media/omx-plugin/include/gb/stagefright/MetaData.h: multi-character character constant
12:12.82 /opt/FirefoxSource/mozilla-release/media/omx-plugin/include/gb/stagefright/MetaData.h:46:29: warning: multi-character character constant [-Wmultichar]
12:12.82 Warning: -Wmultichar in /opt/FirefoxSource/mozilla-release/media/omx-plugin/include/gb/stagefright/MetaData.h: multi-character character constant
12:12.82 /opt/FirefoxSource/mozilla-release/media/omx-plugin/include/gb/stagefright/MetaData.h:47:23: warning: multi-character character constant [-Wmultichar]
12:12.82 Warning: -Wmultichar in /opt/FirefoxSource/mozilla-release/media/omx-plugin/include/gb/stagefright/MetaData.h: multi-character character constant
12:12.82 /opt/FirefoxSource/mozilla-release/media/omx-plugin/include/gb/stagefright/MetaData.h:48:25: warning: multi-character character constant [-Wmultichar]
12:12.82 Warning: -Wmultichar in /opt/FirefoxSource/mozilla-release/media/omx-plugin/include/gb/stagefright/MetaData.h: multi-character character constant
12:12.82 /opt/FirefoxSource/mozilla-release/media/omx-plugin/include/gb/stagefright/MetaData.h:49:16: warning: multi-character character constant [-Wmultichar]
12:12.82 Warning: -Wmultichar in /opt/FirefoxSource/mozilla-release/media/omx-plugin/include/gb/stagefright/MetaData.h: multi-character character constant
12:12.82 /opt/FirefoxSource/mozilla-release/media/omx-plugin/include/gb/stagefright/MetaData.h:50:19: warning: multi-character character constant [-Wmultichar]
12:12.83 Warning: -Wmultichar in /opt/FirefoxSource/mozilla-release/media/omx-plugin/include/gb/stagefright/MetaData.h: multi-character character constant
12:12.83 /opt/FirefoxSource/mozilla-release/media/omx-plugin/include/gb/stagefright/MetaData.h:51:22: warning: multi-character character constant [-Wmultichar]
12:12.83 Warning: -Wmultichar in /opt/FirefoxSource/mozilla-release/media/omx-plugin/include/gb/stagefright/MetaData.h: multi-character character constant
12:12.83 /opt/FirefoxSource/mozilla-release/media/omx-plugin/include/gb/stagefright/MetaData.h:52:21: warning: multi-character character constant [-Wmultichar]
12:12.83 Warning: -Wmultichar in /opt/FirefoxSource/mozilla-release/media/omx-plugin/include/gb/stagefright/MetaData.h: multi-character character constant
12:12.83 /opt/FirefoxSource/mozilla-release/media/omx-plugin/include/gb/stagefright/MetaData.h:53:22: warning: multi-character character constant [-Wmultichar]
12:12.83 Warning: -Wmultichar in /opt/FirefoxSource/mozilla-release/media/omx-plugin/include/gb/stagefright/MetaData.h: multi-character character constant
12:12.83 /opt/FirefoxSource/mozilla-release/media/omx-plugin/include/gb/stagefright/MetaData.h:54:20: warning: multi-character character constant [-Wmultichar]
12:12.83 Warning: -Wmultichar in /opt/FirefoxSource/mozilla-release/media/omx-plugin/include/gb/stagefright/MetaData.h: multi-character character constant
12:12.83 /opt/FirefoxSource/mozilla-release/media/omx-plugin/include/gb/stagefright/MetaData.h:55:23: warning: multi-character character constant [-Wmultichar]
12:12.83 Warning: -Wmultichar in /opt/FirefoxSource/mozilla-release/media/omx-plugin/include/gb/stagefright/MetaData.h: multi-character character constant
12:12.83 /opt/FirefoxSource/mozilla-release/media/omx-plugin/include/gb/stagefright/MetaData.h:56:27: warning: multi-character character constant [-Wmultichar]
12:12.83 Warning: -Wmultichar in /opt/FirefoxSource/mozilla-release/media/omx-plugin/include/gb/stagefright/MetaData.h: multi-character character constant
12:12.83 /opt/FirefoxSource/mozilla-release/media/omx-plugin/include/gb/stagefright/MetaData.h:57:28: warning: multi-character character constant [-Wmultichar]
12:12.83 Warning: -Wmultichar in /opt/FirefoxSource/mozilla-release/media/omx-plugin/include/gb/stagefright/MetaData.h: multi-character character constant
12:12.83 /opt/FirefoxSource/mozilla-release/media/omx-plugin/include/gb/stagefright/MetaData.h:58:20: warning: multi-character character constant [-Wmultichar]
12:12.83 Warning: -Wmultichar in /opt/FirefoxSource/mozilla-release/media/omx-plugin/include/gb/stagefright/MetaData.h: multi-character character constant
12:12.83 /opt/FirefoxSource/mozilla-release/media/omx-plugin/include/gb/stagefright/MetaData.h:59:24: warning: multi-character character constant [-Wmultichar]
12:12.83 Warning: -Wmultichar in /opt/FirefoxSource/mozilla-release/media/omx-plugin/include/gb/stagefright/MetaData.h: multi-character character constant
12:12.83 /opt/FirefoxSource/mozilla-release/media/omx-plugin/include/gb/stagefright/MetaData.h:60:25: warning: multi-character character constant [-Wmultichar]
12:12.83 Warning: -Wmultichar in /opt/FirefoxSource/mozilla-release/media/omx-plugin/include/gb/stagefright/MetaData.h: multi-character character constant
12:12.83 /opt/FirefoxSource/mozilla-release/media/omx-plugin/include/gb/stagefright/MetaData.h:62:17: warning: multi-character character constant [-Wmultichar]
12:12.83 Warning: -Wmultichar in /opt/FirefoxSource/mozilla-release/media/omx-plugin/include/gb/stagefright/MetaData.h: multi-character character constant
12:12.83 /opt/FirefoxSource/mozilla-release/media/omx-plugin/include/gb/stagefright/MetaData.h:63:18: warning: multi-character character constant [-Wmultichar]
12:12.83 Warning: -Wmultichar in /opt/FirefoxSource/mozilla-release/media/omx-plugin/include/gb/stagefright/MetaData.h: multi-character character constant
12:12.83 /opt/FirefoxSource/mozilla-release/media/omx-plugin/include/gb/stagefright/MetaData.h:64:23: warning: multi-character character constant [-Wmultichar]
12:12.83 Warning: -Wmultichar in /opt/FirefoxSource/mozilla-release/media/omx-plugin/include/gb/stagefright/MetaData.h: multi-character character constant
12:12.83 /opt/FirefoxSource/mozilla-release/media/omx-plugin/include/gb/stagefright/MetaData.h:65:20: warning: multi-character character constant [-Wmultichar]
12:12.83 Warning: -Wmultichar in /opt/FirefoxSource/mozilla-release/media/omx-plugin/include/gb/stagefright/MetaData.h: multi-character character constant
12:12.83 /opt/FirefoxSource/mozilla-release/media/omx-plugin/include/gb/stagefright/MetaData.h:66:17: warning: multi-character character constant [-Wmultichar]
12:12.83 Warning: -Wmultichar in /opt/FirefoxSource/mozilla-release/media/omx-plugin/include/gb/stagefright/MetaData.h: multi-character character constant
12:12.83 /opt/FirefoxSource/mozilla-release/media/omx-plugin/include/gb/stagefright/MetaData.h:67:17: warning: multi-character character constant [-Wmultichar]
12:12.83 Warning: -Wmultichar in /opt/FirefoxSource/mozilla-release/media/omx-plugin/include/gb/stagefright/MetaData.h: multi-character character constant
12:12.83 /opt/FirefoxSource/mozilla-release/media/omx-plugin/include/gb/stagefright/MetaData.h:68:16: warning: multi-character character constant [-Wmultichar]
12:12.83 Warning: -Wmultichar in /opt/FirefoxSource/mozilla-release/media/omx-plugin/include/gb/stagefright/MetaData.h: multi-character character constant
12:12.83 /opt/FirefoxSource/mozilla-release/media/omx-plugin/include/gb/stagefright/MetaData.h:69:20: warning: multi-character character constant [-Wmultichar]
12:12.83 Warning: -Wmultichar in /opt/FirefoxSource/mozilla-release/media/omx-plugin/include/gb/stagefright/MetaData.h: multi-character character constant
12:12.83 /opt/FirefoxSource/mozilla-release/media/omx-plugin/include/gb/stagefright/MetaData.h:70:24: warning: multi-character character constant [-Wmultichar]
12:12.83 Warning: -Wmultichar in /opt/FirefoxSource/mozilla-release/media/omx-plugin/include/gb/stagefright/MetaData.h: multi-character character constant
12:12.83 /opt/FirefoxSource/mozilla-release/media/omx-plugin/include/gb/stagefright/MetaData.h:71:18: warning: multi-character character constant [-Wmultichar]
12:12.83 Warning: -Wmultichar in /opt/FirefoxSource/mozilla-release/media/omx-plugin/include/gb/stagefright/MetaData.h: multi-character character constant
12:12.83 /opt/FirefoxSource/mozilla-release/media/omx-plugin/include/gb/stagefright/MetaData.h:72:25: warning: multi-character character constant [-Wmultichar]
12:12.83 Warning: -Wmultichar in /opt/FirefoxSource/mozilla-release/media/omx-plugin/include/gb/stagefright/MetaData.h: multi-character character constant
12:12.83 /opt/FirefoxSource/mozilla-release/media/omx-plugin/include/gb/stagefright/MetaData.h:73:22: warning: multi-character character constant [-Wmultichar]
12:12.83 Warning: -Wmultichar in /opt/FirefoxSource/mozilla-release/media/omx-plugin/include/gb/stagefright/MetaData.h: multi-character character constant
12:12.83 /opt/FirefoxSource/mozilla-release/media/omx-plugin/include/gb/stagefright/MetaData.h:74:16: warning: multi-character character constant [-Wmultichar]
12:12.83 Warning: -Wmultichar in /opt/FirefoxSource/mozilla-release/media/omx-plugin/include/gb/stagefright/MetaData.h: multi-character character constant
12:12.83 /opt/FirefoxSource/mozilla-release/media/omx-plugin/include/gb/stagefright/MetaData.h:75:18: warning: multi-character character constant [-Wmultichar]
12:12.83 Warning: -Wmultichar in /opt/FirefoxSource/mozilla-release/media/omx-plugin/include/gb/stagefright/MetaData.h: multi-character character constant
12:12.83 /opt/FirefoxSource/mozilla-release/media/omx-plugin/include/gb/stagefright/MetaData.h:76:23: warning: multi-character character constant [-Wmultichar]
12:12.83 Warning: -Wmultichar in /opt/FirefoxSource/mozilla-release/media/omx-plugin/include/gb/stagefright/MetaData.h: multi-character character constant
12:12.83 /opt/FirefoxSource/mozilla-release/media/omx-plugin/include/gb/stagefright/MetaData.h:77:21: warning: multi-character character constant [-Wmultichar]
12:12.83 Warning: -Wmultichar in /opt/FirefoxSource/mozilla-release/media/omx-plugin/include/gb/stagefright/MetaData.h: multi-character character constant
12:12.83 /opt/FirefoxSource/mozilla-release/media/omx-plugin/include/gb/stagefright/MetaData.h:80:24: warning: multi-character character constant [-Wmultichar]
12:12.83 Warning: -Wmultichar in /opt/FirefoxSource/mozilla-release/media/omx-plugin/include/gb/stagefright/MetaData.h: multi-character character constant
12:12.83 /opt/FirefoxSource/mozilla-release/media/omx-plugin/include/gb/stagefright/MetaData.h:81:22: warning: multi-character character constant [-Wmultichar]
12:12.84 Warning: -Wmultichar in /opt/FirefoxSource/mozilla-release/media/omx-plugin/include/gb/stagefright/MetaData.h: multi-character character constant
12:12.84 /opt/FirefoxSource/mozilla-release/media/omx-plugin/include/gb/stagefright/MetaData.h:84:27: warning: multi-character character constant [-Wmultichar]
12:12.84 Warning: -Wmultichar in /opt/FirefoxSource/mozilla-release/media/omx-plugin/include/gb/stagefright/MetaData.h: multi-character character constant
12:12.84 /opt/FirefoxSource/mozilla-release/media/omx-plugin/include/gb/stagefright/MetaData.h:85:26: warning: multi-character character constant [-Wmultichar]
12:12.84 Warning: -Wmultichar in /opt/FirefoxSource/mozilla-release/media/omx-plugin/include/gb/stagefright/MetaData.h: multi-character character constant
12:12.84 /opt/FirefoxSource/mozilla-release/media/omx-plugin/include/gb/stagefright/MetaData.h:90:20: warning: multi-character character constant [-Wmultichar]
12:12.84 Warning: -Wmultichar in /opt/FirefoxSource/mozilla-release/media/omx-plugin/include/gb/stagefright/MetaData.h: multi-character character constant
12:12.84 /opt/FirefoxSource/mozilla-release/media/omx-plugin/include/gb/stagefright/MetaData.h:94:27: warning: multi-character character constant [-Wmultichar]
12:12.84 Warning: -Wmultichar in /opt/FirefoxSource/mozilla-release/media/omx-plugin/include/gb/stagefright/MetaData.h: multi-character character constant
12:12.84 /opt/FirefoxSource/mozilla-release/media/omx-plugin/include/gb/stagefright/MetaData.h:95:26: warning: multi-character character constant [-Wmultichar]
12:12.84 Warning: -Wmultichar in /opt/FirefoxSource/mozilla-release/media/omx-plugin/include/gb/stagefright/MetaData.h: multi-character character constant
12:12.84 /opt/FirefoxSource/mozilla-release/media/omx-plugin/include/gb/stagefright/MetaData.h:97:23: warning: multi-character character constant [-Wmultichar]
12:12.84 Warning: -Wmultichar in /opt/FirefoxSource/mozilla-release/media/omx-plugin/include/gb/stagefright/MetaData.h: multi-character character constant
12:12.84 /opt/FirefoxSource/mozilla-release/media/omx-plugin/include/gb/stagefright/MetaData.h:100:20: warning: multi-character character constant [-Wmultichar]
12:12.84 Warning: -Wmultichar in /opt/FirefoxSource/mozilla-release/media/omx-plugin/include/gb/stagefright/MetaData.h: multi-character character constant
12:12.84 /opt/FirefoxSource/mozilla-release/media/omx-plugin/include/gb/stagefright/MetaData.h:102:24: warning: multi-character character constant [-Wmultichar]
12:12.84 Warning: -Wmultichar in /opt/FirefoxSource/mozilla-release/media/omx-plugin/include/gb/stagefright/MetaData.h: multi-character character constant
12:12.84 /opt/FirefoxSource/mozilla-release/media/omx-plugin/include/gb/stagefright/MetaData.h:104:24: warning: multi-character character constant [-Wmultichar]
12:12.84 Warning: -Wmultichar in /opt/FirefoxSource/mozilla-release/media/omx-plugin/include/gb/stagefright/MetaData.h: multi-character character constant
12:12.84 /opt/FirefoxSource/mozilla-release/media/omx-plugin/include/gb/stagefright/MetaData.h:108:17: warning: multi-character character constant [-Wmultichar]
12:12.84 Warning: -Wmultichar in /opt/FirefoxSource/mozilla-release/media/omx-plugin/include/gb/stagefright/MetaData.h: multi-character character constant
12:12.84 /opt/FirefoxSource/mozilla-release/media/omx-plugin/include/gb/stagefright/MetaData.h:109:17: warning: multi-character character constant [-Wmultichar]
12:12.84 Warning: -Wmultichar in /opt/FirefoxSource/mozilla-release/media/omx-plugin/include/gb/stagefright/MetaData.h: multi-character character constant
12:12.84 /opt/FirefoxSource/mozilla-release/media/omx-plugin/include/gb/stagefright/MetaData.h:118:21: warning: multi-character character constant [-Wmultichar]
12:12.84 Warning: -Wmultichar in /opt/FirefoxSource/mozilla-release/media/omx-plugin/include/gb/stagefright/MetaData.h: multi-character character constant
12:12.84 /opt/FirefoxSource/mozilla-release/media/omx-plugin/include/gb/stagefright/MetaData.h:119:25: warning: multi-character character constant [-Wmultichar]
12:12.84 Warning: -Wmultichar in /opt/FirefoxSource/mozilla-release/media/omx-plugin/include/gb/stagefright/MetaData.h: multi-character character constant
12:12.84 /opt/FirefoxSource/mozilla-release/media/omx-plugin/include/gb/stagefright/MetaData.h:120:22: warning: multi-character character constant [-Wmultichar]
12:12.84 Warning: -Wmultichar in /opt/FirefoxSource/mozilla-release/media/omx-plugin/include/gb/stagefright/MetaData.h: multi-character character constant
12:12.84 /opt/FirefoxSource/mozilla-release/media/omx-plugin/include/gb/stagefright/MetaData.h:121:22: warning: multi-character character constant [-Wmultichar]
12:12.84 Warning: -Wmultichar in /opt/FirefoxSource/mozilla-release/media/omx-plugin/include/gb/stagefright/MetaData.h: multi-character character constant
12:12.84 /opt/FirefoxSource/mozilla-release/media/omx-plugin/include/gb/stagefright/MetaData.h:122:22: warning: multi-character character constant [-Wmultichar]
12:12.84 Warning: -Wmultichar in /opt/FirefoxSource/mozilla-release/media/omx-plugin/include/gb/stagefright/MetaData.h: multi-character character constant
12:12.84 /opt/FirefoxSource/mozilla-release/media/omx-plugin/include/gb/stagefright/MetaData.h:123:24: warning: multi-character character constant [-Wmultichar]
12:12.84 libstagefright.so
12:12.91 BionicGlue.o
12:12.91 arm.o
12:12.98 TestRefPtr.o
12:13.08 TestRollingMean.o
12:13.25 libmozglue.so
12:13.29 TestSegmentedVector.o
12:13.65 TestSHA1.o
12:13.80 OmxPlugin236.o
12:14.07 TestSplayTree.o
12:14.14 TestTypedEnum.o
12:14.33 TestTypeTraits.o
12:14.46 libomxplugingb.so
12:14.53 TestUniquePtr.o
12:14.63 TestVector.o
12:15.33 TestWeakPtr.o
12:15.44 OmxPluginHoneycomb.o
12:16.11 libomxpluginhc.so
12:16.19 OmxPlugin235.o
12:16.84 libomxplugingb235.so
12:17.26 quickder.c: In function 'DecodeItem':
12:17.26 quickder.c:666:12: warning: variable 'optional' set but not used [-Wunused-but-set-variable]
12:17.69 derenc.c: In function 'der_encode':
12:17.69 derenc.c:282:22: warning: variable 'optional' set but not used [-Wunused-but-set-variable]
12:18.38 nssb64e.c: In function 'NSSBase64_EncodeItem_Util':
12:18.38 nssb64e.c:684:15: warning: 'out_len' may be used uninitialized in this function [-Wmaybe-uninitialized]
12:18.50 libgfx_ots_src.a.desc
12:18.53 TestExampleGenBinding.o
12:20.20 secoid.c: In function 'SECOID_Init':
12:20.20 secoid.c:1922:19: warning: variable 'c' set but not used [-Wunused-but-set-variable]
12:20.63 utilmod.c: In function 'nssutil_DeleteSecmodDBEntry.isra.1':
12:20.63 utilmod.c:545:12: warning: 'lib_len' may be used uninitialized in this function [-Wmaybe-uninitialized]
12:20.63 TestJSImplGenBinding.o
12:20.94 utilpars.c: In function 'nssutil_mkSlotFlags':
12:20.94 utilpars.c:679:17: warning: comparison between signed and unsigned integer expressions [-Wsign-compare]
12:20.94 utilpars.c: In function 'nssutil_mkCipherFlags':
12:20.94 utilpars.c:891:17: warning: comparison between signed and unsigned integer expressions [-Wsign-compare]
12:20.94 utilpars.c:910:17: warning: comparison between signed and unsigned integer expressions [-Wsign-compare]
12:22.60 ocsp.c: In function 'ocsp_RemoveCacheItem':
12:22.60 ocsp.c:562:12: warning: variable 'couldRemoveFromHashTable' set but not used [-Wunused-but-set-variable]
12:23.30 certhigh.c: In function 'CERT_MatchNickname':
12:23.30 certhigh.c:28:9: warning: variable 'len' set but not used [-Wunused-but-set-variable]
12:23.31 TestJSImplInheritanceGenBinding.o
12:23.71 TestPoisonArea.o
12:24.05 TestArrayUtils
12:24.05 TestAtomics
12:24.17 TestBinarySearch
12:24.31 TestBloomFilter
12:24.42 TestCasting
12:24.52 TestCeilingFloor
12:24.62 TestCheckedInt
12:24.72 TestCountPopulation
12:24.85 TestCountZeroes
12:24.94 TestEndian
12:25.04 TestEnumSet
12:25.07 certvfypkix.c: In function 'setRevocationMethod':
12:25.07 certvfypkix.c:1422:17: warning: comparison between signed and unsigned integer expressions [-Wsign-compare]
12:25.16 TestFloatingPoint
12:25.30 TestIntegerPrintfMacros
12:25.39 sechash.c: In function 'HASH_ResultLen':
12:25.39 sechash.c:263:5: warning: comparison of unsigned expression < 0 is always false [-Wtype-limits]
12:25.39 sechash.c: In function 'HASH_HashBuf':
12:25.39 sechash.c:288:5: warning: comparison of unsigned expression < 0 is always false [-Wtype-limits]
12:25.39 sechash.c: In function 'HASH_Create':
12:25.39 sechash.c:310:5: warning: comparison of unsigned expression < 0 is always false [-Wtype-limits]
12:25.40 TestJSONWriter
12:25.50 TestMacroArgs
12:25.60 TestMacroForEach
12:25.70 TestMaybe
12:25.80 TestPair
12:25.90 TestRefPtr
12:26.01 TestRollingMean
12:26.11 TestSegmentedVector
12:26.21 TestSHA1
12:26.32 TestSplayTree
12:26.43 TestTypedEnum
12:26.54 TestTypeTraits
12:26.66 TestUniquePtr
12:26.76 TestVector
12:26.86 TestWeakPtr
12:26.97 TestPoisonArea
12:27.10 pk11akey.c: In function 'pk11_get_Decoded_ECPoint':
12:27.10 pk11akey.c:406:26: warning: comparison between signed and unsigned integer expressions [-Wsign-compare]
12:27.10 pk11akey.c:420:63: warning: comparison between signed and unsigned integer expressions [-Wsign-compare]
12:27.22 TestTypedefBinding.o
12:28.53 pk11cert.c: In function 'pk11_fastCert':
12:28.53 pk11cert.c:231:14: warning: variable 'status' set but not used [-Wunused-but-set-variable]
12:28.53 pk11cert.c: In function 'PK11_TraverseCertsForNicknameInSlot':
12:28.53 pk11cert.c:2008:28: warning: variable 'pk11cb' set but not used [-Wunused-but-set-variable]
12:30.62 In file included from pk11load.c:26:0:
12:30.62 debug_module.c: In function 'log_handle':
12:30.62 debug_module.c:339:28: warning: comparison between signed and unsigned integer expressions [-Wsign-compare]
12:30.62 debug_module.c:343:28: warning: comparison between signed and unsigned integer expressions [-Wsign-compare]
12:30.62 pk11load.c: In function 'SECMOD_UnloadModule':
12:30.62 pk11load.c:592:28: warning: unused variable 'status' [-Wunused-variable]
12:31.20 Unified_cpp_memory_mozalloc0.o
12:31.39 In file included from /opt/FirefoxSource/mozilla-release/objdir-droid/memory/mozalloc/Unified_cpp_memory_mozalloc0.cpp:11:0:
12:31.39 /opt/FirefoxSource/mozilla-release/memory/mozalloc/mozalloc_abort.cpp: In function 'void abort()':
12:31.39 Warning: enabled by default in /opt/FirefoxSource/mozilla-release/memory/mozalloc/mozalloc_abort.cpp: 'noreturn' function does return
12:31.39 /opt/FirefoxSource/mozilla-release/memory/mozalloc/mozalloc_abort.cpp:76:1: warning: 'noreturn' function does return [enabled by default]
12:31.39 libmozalloc.so
12:31.45 pk11merge.c: In function 'pk11_matchAcrossTokens':
12:31.45 pk11merge.c:100:32: warning: comparison between signed and unsigned integer expressions [-Wsign-compare]
12:31.47 libgkmedias.a.desc
12:31.51 nsTestSample.o
12:31.72 nsTestSample
12:32.15 pk11pars.c: In function 'secmod_ParseModuleSpecForTokens':
12:32.15 pk11pars.c:364:47: warning: suggest braces around empty body in an 'else' statement [-Wempty-body]
12:32.15 pk11pars.c:366:47: warning: suggest braces around empty body in an 'else' statement [-Wempty-body]
12:32.15 pk11pars.c:375:6: warning: suggest braces around empty body in an 'else' statement [-Wempty-body]
12:32.15 pk11pars.c:384:7: warning: suggest braces around empty body in an 'else' statement [-Wempty-body]
12:32.15 pk11pars.c:393:7: warning: suggest braces around empty body in an 'else' statement [-Wempty-body]
12:32.15 pk11pars.c:402:7: warning: suggest braces around empty body in an 'else' statement [-Wempty-body]
12:32.15 pk11pars.c: In function 'secmod_MkAppendTokensList':
12:32.15 pk11pars.c:767:13: warning: comparison between signed and unsigned integer expressions [-Wsign-compare]
12:32.15 pk11pars.c:804:13: warning: comparison between signed and unsigned integer expressions [-Wsign-compare]
12:32.35 pk11obj.c: In function 'PK11_MatchItem':
12:32.35 pk11obj.c:1799:72: warning: comparison between signed and unsigned integer expressions [-Wsign-compare]
12:32.35 pk11obj.c:1784:22: warning: variable 'parent' set but not used [-Wunused-but-set-variable]
12:32.59 pk11pk12.c: In function 'PK11_ImportPrivateKeyInfoAndReturnKey':
12:32.59 pk11pk12.c:425:17: warning: variable 'keyType' set but not used [-Wunused-but-set-variable]
12:32.70 pk11pqg.c: In function 'PK11_PQG_ParamGenSeedLen':
12:32.70 pk11pqg.c:230:56: warning: signed and unsigned type in conditional expression [-Wsign-compare]
12:32.70 pk11pqg.c: In function 'PK11_PQG_ParamGen':
12:32.70 pk11pqg.c:241:56: warning: signed and unsigned type in conditional expression [-Wsign-compare]
12:32.70 pk11pqg.c: In function 'PK11_PQG_VerifyParams':
12:32.70 pk11pqg.c:295:19: warning: comparison between signed and unsigned integer expressions [-Wsign-compare]
12:32.78 ShowSSEConfig.o
12:32.84 ShowSSEConfig
12:33.40 alg1485.c: In function 'cert_AVAOidTagToMaxLen':
12:33.40 alg1485.c:162:57: warning: signed and unsigned type in conditional expression [-Wsign-compare]
12:33.40 alg1485.c: In function 'AppendAVA':
12:33.40 alg1485.c:963:40: warning: signed and unsigned type in conditional expression [-Wsign-compare]
12:33.42 pk11skey.c: In function 'pk11_TokenKeyGenWithFlagsAndKeyType':
12:33.42 pk11skey.c:926:17: warning: comparison between signed and unsigned integer expressions [-Wsign-compare]
12:33.42 pk11skey.c: In function 'pk11_HandUnwrap':
12:33.42 pk11skey.c:2296:40: warning: signed and unsigned type in conditional expression [-Wsign-compare]
12:34.11 pk11slot.c: In function 'PK11_InitToken':
12:34.11 pk11slot.c:1108:11: warning: variable 'tmp' set but not used [-Wunused-but-set-variable]
12:34.11 pk11slot.c: In function 'PK11_InitSlot':
12:34.11 pk11slot.c:1352:11: warning: variable 'tmp' set but not used [-Wunused-but-set-variable]
12:34.11 pk11slot.c: In function 'PK11_GetBestSlotMultipleWithAttributes':
12:34.11 pk11slot.c:2076:17: warning: comparison between signed and unsigned integer expressions [-Wsign-compare]
12:34.11 pk11slot.c:2094:18: warning: comparison between signed and unsigned integer expressions [-Wsign-compare]
12:34.11 pk11slot.c: In function 'PK11_ResetToken':
12:34.11 pk11slot.c:2317:22: warning: comparison between signed and unsigned integer expressions [-Wsign-compare]
12:34.11 pk11slot.c:2322:22: warning: comparison between signed and unsigned integer expressions [-Wsign-compare]
12:34.13 certdb.c: In function 'CERT_ImportCerts':
12:34.13 certdb.c:2446:15: warning: variable 'rv' set but not used [-Wunused-but-set-variable]
12:34.13 certdb.c: In function 'CERT_UnlockCertRefCount':
12:34.13 certdb.c:2896:14: warning: variable 'prstat' set but not used [-Wunused-but-set-variable]
12:34.13 certdb.c: In function 'CERT_UnlockCertTrust':
12:34.13 certdb.c:2976:14: warning: variable 'prstat' set but not used [-Wunused-but-set-variable]
12:34.56 pk11util.c: In function 'SECMOD_UpdateSlotList':
12:34.56 pk11util.c:931:15: warning: comparison between signed and unsigned integer expressions [-Wsign-compare]
12:35.12 certificate.c: In function 'nssCertificateList_DoCallback':
12:35.12 certificate.c:898:14: warning: variable 'nssrv' set but not used [-Wunused-but-set-variable]
12:35.14 crl.c: In function 'crl_storeCRL':
12:35.14 crl.c:630:15: warning: variable 'rv' set but not used [-Wunused-but-set-variable]
12:35.14 crl.c: In function 'cert_CheckCertRevocationStatus':
12:35.14 crl.c:2696:27: warning: unused variable 'rv2' [-Wunused-variable]
12:35.14 crl.c: In function 'cert_CacheCRLByGeneralName':
12:35.14 crl.c:3053:32: warning: variable 'rv2' set but not used [-Wunused-but-set-variable]
12:35.89 trustdomain.c: In function 'NSSTrustDomain_TraverseCertificates':
12:35.89 trustdomain.c:994:14: warning: variable 'status' set but not used [-Wunused-but-set-variable]
12:36.21 tdcache.c: In function 'add_cert_to_cache':
12:36.21 tdcache.c:779:9: warning: variable 'handle' set but not used [-Wunused-but-set-variable]
12:36.21 tdcache.c: In function 'nssTrustDomain_RemoveCertFromCacheLOCKED':
12:36.21 tdcache.c:272:16: warning: 'nickname' may be used uninitialized in this function [-Wmaybe-uninitialized]
12:36.21 tdcache.c:332:14: note: 'nickname' was declared here
12:36.89 pkibase.c: In function 'nssPKIObjectCollection_Traverse':
12:36.89 pkibase.c:906:14: warning: variable 'status' set but not used [-Wunused-but-set-variable]
12:36.89 pkibase.c: In function 'nssCertificateCollection_Create':
12:36.89 pkibase.c:1060:14: warning: variable 'status' set but not used [-Wunused-but-set-variable]
12:36.89 pkibase.c: In function 'nssCRLCollection_Create':
12:36.89 pkibase.c:1167:14: warning: variable 'status' set but not used [-Wunused-but-set-variable]
12:37.32 pki3hack.c: In function 'DeleteCertTrustMatchingSlot':
12:37.32 pki3hack.c:1280:27: warning: comparison between signed and unsigned integer expressions [-Wsign-compare]
12:37.32 pki3hack.c: In function 'STAN_DeleteCertTrustMatchingSlot':
12:37.32 pki3hack.c:1340:19: warning: comparison between signed and unsigned integer expressions [-Wsign-compare]
12:37.35 devtoken.c: In function 'nssToken_TraverseCertificates':
12:37.35 devtoken.c:1469:14: warning: variable 'status' set but not used [-Wunused-but-set-variable]
12:37.94 ckhelper.c: In function 'nssCKObject_GetAttributes':
12:37.94 ckhelper.c:139:36: warning: comparison between signed and unsigned integer expressions [-Wsign-compare]
12:37.94 ckhelper.c: In function 'nssCryptokiTrust_GetAttributes':
12:37.94 ckhelper.c:442:36: warning: comparison between signed and unsigned integer expressions [-Wsign-compare]
12:38.31 list.c: In function 'nssList_Add':
12:38.31 list.c:220:14: warning: variable 'nssrv' set but not used [-Wunused-but-set-variable]
12:40.30 pkix_revocationchecker.c: In function 'PKIX_RevocationChecker_Check':
12:40.30 pkix_revocationchecker.c:353:25: warning: comparison between signed and unsigned integer expressions [-Wsign-compare]
12:42.61 pkix_tools.c: In function 'pkix_i2hex':
12:42.61 pkix_tools.c:482:9: warning: comparison is always true due to limited range of data type [-Wtype-limits]
12:43.49 pkix_errpaths.c: In function 'PKIX_DoReturn':
12:43.49 pkix_errpaths.c:58:2: warning: suggest braces around empty body in an 'if' statement [-Wempty-body]
12:44.64 pkix_build.c: In function 'pkix_Build_SelectCertsFromTrustAnchors':
12:44.64 pkix_build.c:1548:38: warning: comparison between signed and unsigned integer expressions [-Wsign-compare]
12:45.68 pkix_pl_cert.c: In function 'PKIX_PL_Cert_Create':
12:45.68 pkix_pl_cert.c:1518:22: warning: variable 'copyDER' set but not used [-Wunused-but-set-variable]
12:45.98 pkix_pl_lifecycle.c: In function 'pkix_pl_lifecycle_ObjectLeakCheck':
12:45.98 pkix_pl_lifecycle.c:87:55: warning: comparison between signed and unsigned integer expressions [-Wsign-compare]
12:45.98 pkix_pl_lifecycle.c: In function 'PKIX_PL_Shutdown':
12:45.98 pkix_pl_lifecycle.c:248:21: warning: variable 'numLeakedObjects' set but not used [-Wunused-but-set-variable]
12:46.59 pkix_pl_httpdefaultclient.c: In function 'pkix_pl_HttpDefaultClient_HdrCheckComplete':
12:46.59 pkix_pl_httpdefaultclient.c:268:32: warning: comparison between signed and unsigned integer expressions [-Wsign-compare]
12:46.59 pkix_pl_httpdefaultclient.c:285:41: warning: comparison between signed and unsigned integer expressions [-Wsign-compare]
12:46.59 pkix_pl_httpdefaultclient.c:293:40: warning: comparison between signed and unsigned integer expressions [-Wsign-compare]
12:46.59 pkix_pl_httpdefaultclient.c: In function 'pkix_pl_HttpDefaultClient_RecvBody':
12:46.59 pkix_pl_httpdefaultclient.c:925:39: warning: comparison between signed and unsigned integer expressions [-Wsign-compare]
12:46.59 pkix_pl_httpdefaultclient.c:940:31: warning: comparison between signed and unsigned integer expressions [-Wsign-compare]
12:46.59 pkix_pl_httpdefaultclient.c:945:31: warning: comparison between signed and unsigned integer expressions [-Wsign-compare]
12:46.59 pkix_pl_httpdefaultclient.c:951:38: warning: comparison between signed and unsigned integer expressions [-Wsign-compare]
12:46.59 pkix_pl_httpdefaultclient.c:995:39: warning: comparison between signed and unsigned integer expressions [-Wsign-compare]
12:46.59 pkix_pl_httpdefaultclient.c:1005:43: warning: comparison between signed and unsigned integer expressions [-Wsign-compare]
12:46.59 pkix_pl_httpdefaultclient.c: In function 'pkix_pl_HttpDefaultClient_KeepAliveSession':
12:46.59 pkix_pl_httpdefaultclient.c:1135:36: warning: variable 'client' set but not used [-Wunused-but-set-variable]
12:46.59 pkix_pl_httpdefaultclient.c: In function 'pkix_pl_HttpDefaultClient_TrySendAndReceive':
12:46.59 pkix_pl_httpdefaultclient.c:1429:63: warning: comparison between signed and unsigned integer expressions [-Wsign-compare]
12:46.59 pkix_pl_httpdefaultclient.c: In function 'pkix_pl_HttpDefaultClient_Cancel':
12:46.59 pkix_pl_httpdefaultclient.c:1487:36: warning: variable 'client' set but not used [-Wunused-but-set-variable]
12:46.98 pkix_pl_object.c: In function 'pkix_pl_Object_GetHeader':
12:46.98 pkix_pl_object.c:115:34: warning: comparison between signed and unsigned integer expressions [-Wsign-compare]
12:46.99 pkix_pl_crl.c: In function 'pkix_pl_CRL_ToString':
12:46.99 pkix_pl_crl.c:455:58: warning: 'crlVersion' may be used uninitialized in this function [-Wmaybe-uninitialized]
12:46.99 pkix_pl_crl.c:354:21: note: 'crlVersion' was declared here
12:47.94 pkix_pl_ldaprequest.c: In function 'pkix_pl_LdapRequest_Destroy':
12:47.94 pkix_pl_ldaprequest.c:266:30: warning: variable 'ldapRq' set but not used [-Wunused-but-set-variable]
12:48.65 pkix_pl_ldapdefaultclient.c: In function 'pkix_pl_LdapDefaultClient_VerifyBindResponse':
12:48.65 pkix_pl_ldapdefaultclient.c:371:21: warning: '*((void *)&msg+16).resultCode.data' may be used uninitialized in this function [-Wmaybe-uninitialized]
12:48.65 pkix_pl_ldapdefaultclient.c:354:21: note: '*((void *)&msg+16).resultCode.data' was declared here
12:48.70 nssinit.c: In function 'NSS_VersionCheck':
12:48.70 nssinit.c:1250:19: warning: variable 'c' set but not used [-Wunused-but-set-variable]
12:49.42 pkix_pl_pk11certstore.c: In function 'NameCacheHasFetchedCrlInfo':
12:49.42 pkix_pl_pk11certstore.c:382:22: warning: variable 'cert' set but not used [-Wunused-but-set-variable]
12:49.42 pkix_pl_pk11certstore.c: In function 'RemovePartitionedDpsFromList':
12:49.42 pkix_pl_pk11certstore.c:701:20: warning: comparison between signed and unsigned integer expressions [-Wsign-compare]
12:49.42 pkix_pl_pk11certstore.c: In function 'DownloadCrl':
12:49.43 pkix_pl_pk11certstore.c:782:16: warning: variable 'savedError' set but not used [-Wunused-but-set-variable]
12:49.48 dtlscon.c: In function 'ssl3_DisableNonDTLSSuites':
12:49.48 dtlscon.c:107:19: warning: unused variable 'rv' [-Wunused-variable]
12:49.48 dtlscon.c: In function 'dtls_HandleHandshake':
12:49.48 dtlscon.c:399:37: warning: comparison between signed and unsigned integer expressions [-Wsign-compare]
12:49.48 dtlscon.c:428:48: warning: comparison between signed and unsigned integer expressions [-Wsign-compare]
12:49.48 dtlscon.c: In function 'dtls_TransmitMessageFlight':
12:49.48 dtlscon.c:679:60: warning: comparison between signed and unsigned integer expressions [-Wsign-compare]
12:49.48 dtlscon.c:679:120: warning: signed and unsigned type in conditional expression [-Wsign-compare]
12:49.48 dtlscon.c:717:26: warning: comparison between signed and unsigned integer expressions [-Wsign-compare]
12:49.48 dtlscon.c: In function 'dtls_SetMTU':
12:49.48 dtlscon.c:952:19: warning: comparison between signed and unsigned integer expressions [-Wsign-compare]
12:50.18 pkix_pl_publickey.c: In function 'pkix_pl_PublicKey_Hashcode':
12:50.18 pkix_pl_publickey.c:214:21: warning: variable 'fullHash' set but not used [-Wunused-but-set-variable]
12:50.87 certread.c: In function 'CERT_DecodeCertPackage':
12:50.87 certread.c:419:16: warning: comparison between signed and unsigned integer expressions [-Wsign-compare]
12:50.87 certread.c:447:13: warning: comparison between signed and unsigned integer expressions [-Wsign-compare]
12:51.32 p12e.c: In function 'sec_PKCS12CreateSafeBag':
12:51.32 p12e.c:698:12: warning: variable 'setName' set but not used [-Wunused-but-set-variable]
12:51.32 p12e.c: In function 'sec_pkcs12_encoder_start_context':
12:51.32 p12e.c:1535:12: warning: variable 'rv' set but not used [-Wunused-but-set-variable]
12:51.78 p7decode.c: In function 'sec_pkcs7_verify_signature':
12:51.78 p7decode.c:1293:21: warning: variable 'crls' set but not used [-Wunused-but-set-variable]
12:52.04 p7encode.c: In function 'sec_pkcs7_encoder_start_encrypt':
12:52.04 p7encode.c:62:18: warning: variable 'wincx' set but not used [-Wunused-but-set-variable]
12:52.09 p12d.c: In function 'SEC_PKCS12DecoderRenameCertNicknames':
12:52.09 p12d.c:2813:5: warning: suggest parentheses around assignment used as truth value [-Wparentheses]
12:52.16 ssl3con.c: In function 'ssl3_CompressMACEncryptRecord':
12:52.16 ssl3con.c:2559:12: warning: comparison between signed and unsigned integer expressions [-Wsign-compare]
12:52.16 ssl3con.c: In function 'ssl3_FlushHandshakeMessages':
12:52.16 ssl3con.c:3122:19: warning: comparison between signed and unsigned integer expressions [-Wsign-compare]
12:52.16 ssl3con.c: In function 'ssl3_HandleClientHello':
12:52.16 ssl3con.c:7781:23: warning: comparison between signed and unsigned integer expressions [-Wsign-compare]
12:52.16 ssl3con.c:8285:28: warning: comparison between signed and unsigned integer expressions [-Wsign-compare]
12:52.16 ssl3con.c: In function 'ssl3_HandleRSAClientKeyExchange':
12:52.16 ssl3con.c:9211:13: warning: variable 'pmsItem' set but not used [-Wunused-but-set-variable]
12:52.16 ssl3con.c:9207:12: warning: variable 'isTLS' set but not used [-Wunused-but-set-variable]
12:52.16 ssl3con.c: In function 'ssl3_HandleCertificateStatus':
12:52.16 ssl3con.c:9779:13: warning: comparison between signed and unsigned integer expressions [-Wsign-compare]
12:52.16 ssl3con.c: In function 'ssl3_HandleHandshakeMessage':
12:52.16 ssl3con.c:6950:22: warning: 'preferSha1' may be used uninitialized in this function [-Wmaybe-uninitialized]
12:52.16 ssl3con.c:6916:12: note: 'preferSha1' was declared here
12:52.16 ssl3con.c: In function 'ssl3_HandleRecord':
12:52.16 ssl3con.c:11589:21: warning: 'dtls_seq_num' may be used uninitialized in this function [-Wmaybe-uninitialized]
12:52.16 ssl3con.c:11309:14: note: 'dtls_seq_num' was declared here
12:52.31 p7local.c: In function 'sec_PKCS7Decrypt':
12:52.31 p7local.c:556:28: warning: comparison between signed and unsigned integer expressions [-Wsign-compare]
12:52.37 ssl3gthr.c: In function 'ssl3_GatherData':
12:52.37 ssl3gthr.c:75:9: warning: comparison between signed and unsigned integer expressions [-Wsign-compare]
12:52.54 sslauth.c: In function 'SSL_AuthCertificate':
12:52.54 sslauth.c:267:18: warning: unused variable 'error' [-Wunused-variable]
12:52.60 /opt/FirefoxSource/mozilla-release/config/external/nss/nss.def: WARNING: no preprocessor directives found
12:52.63 /opt/FirefoxSource/mozilla-release/config/external/nss/nspr-dummy.def: WARNING: no preprocessor directives found
12:53.02 cmscipher.c: In function 'NSS_CMSCipherContext_Decrypt':
12:53.02 cmscipher.c:525:28: warning: comparison between signed and unsigned integer expressions [-Wsign-compare]
12:53.36 sslcon.c: In function 'ssl2_SendClear':
12:53.36 sslcon.c:865:17: warning: comparison between signed and unsigned integer expressions [-Wsign-compare]
12:53.36 sslcon.c:894:19: warning: comparison between signed and unsigned integer expressions [-Wsign-compare]
12:53.36 sslcon.c: In function 'ssl2_SendStream':
12:53.36 sslcon.c:944:13: warning: comparison between signed and unsigned integer expressions [-Wsign-compare]
12:53.36 sslcon.c:991:19: warning: comparison between signed and unsigned integer expressions [-Wsign-compare]
12:53.36 sslcon.c: In function 'ssl2_SendBlock':
12:53.36 sslcon.c:1058:13: warning: comparison between signed and unsigned integer expressions [-Wsign-compare]
12:53.36 sslcon.c: In function 'ssl2_ServerSetupSessionCypher':
12:53.36 sslcon.c:1624:15: warning: comparison between signed and unsigned integer expressions [-Wsign-compare]
12:53.36 sslcon.c:1648:20: warning: comparison between signed and unsigned integer expressions [-Wsign-compare]
12:53.36 sslcon.c: In function 'ssl2_HandleMessage':
12:53.36 sslcon.c:2498:9: warning: variable 'rv2' set but not used [-Wunused-but-set-variable]
12:53.36 sslcon.c: In function 'ssl2_HandleServerHelloMessage':
12:53.36 sslcon.c:2802:51: warning: comparison between signed and unsigned integer expressions [-Wsign-compare]
12:53.36 sslcon.c:2813:16: warning: comparison between signed and unsigned integer expressions [-Wsign-compare]
12:53.36 sslcon.c:2815:23: warning: comparison between signed and unsigned integer expressions [-Wsign-compare]
12:53.36 sslcon.c:2815:65: warning: signed and unsigned type in conditional expression [-Wsign-compare]
12:53.36 sslcon.c: In function 'NSSSSL_VersionCheck':
12:53.36 sslcon.c:3687:19: warning: variable 'c' set but not used [-Wunused-but-set-variable]
12:53.74 cmsencode.c: In function 'nss_cms_encoder_notify':
12:53.74 cmsencode.c:125:18: warning: variable 'poolp' set but not used [-Wunused-but-set-variable]
12:53.74 cmsencode.c: In function 'nss_cms_before_data':
12:53.74 cmsencode.c:204:18: warning: variable 'poolp' set but not used [-Wunused-but-set-variable]
12:53.83 ssl3ext.c: In function 'arrayContainsExtension':
12:53.83 ssl3ext.c:310:19: warning: comparison between signed and unsigned integer expressions [-Wsign-compare]
12:53.83 ssl3ext.c: In function 'ssl3_HandleServerNameXtn':
12:53.83 ssl3ext.c:417:43: warning: comparison between signed and unsigned integer expressions [-Wsign-compare]
12:53.83 ssl3ext.c:425:17: warning: variable 'type' set but not used [-Wunused-but-set-variable]
12:53.83 ssl3ext.c:457:22: warning: comparison between signed and unsigned integer expressions [-Wsign-compare]
12:53.83 ssl3ext.c:458:31: warning: comparison between signed and unsigned integer expressions [-Wsign-compare]
12:53.83 ssl3ext.c: In function 'ssl3_SendSessionTicketXtn':
12:53.83 ssl3ext.c:538:28: warning: comparison between signed and unsigned integer expressions [-Wsign-compare]
12:53.83 ssl3ext.c:561:25: warning: comparison between signed and unsigned integer expressions [-Wsign-compare]
12:53.83 ssl3ext.c: In function 'ssl3_ServerHandleAppProtoXtn':
12:53.83 ssl3ext.c:681:15: warning: comparison between signed and unsigned integer expressions [-Wsign-compare]
12:53.83 ssl3ext.c: In function 'ssl3_ClientSendNextProtoNegoXtn':
12:53.83 ssl3ext.c:782:28: warning: comparison between signed and unsigned integer expressions [-Wsign-compare]
12:53.83 ssl3ext.c:792:25: warning: comparison between signed and unsigned integer expressions [-Wsign-compare]
12:53.83 ssl3ext.c: In function 'ssl3_ClientSendAppProtoXtn':
12:53.83 ssl3ext.c:817:28: warning: comparison between signed and unsigned integer expressions [-Wsign-compare]
12:53.83 ssl3ext.c:857:25: warning: comparison between signed and unsigned integer expressions [-Wsign-compare]
12:53.83 ssl3ext.c: In function 'ssl3_ServerSendAppProtoXtn':
12:53.83 ssl3ext.c:886:28: warning: comparison between signed and unsigned integer expressions [-Wsign-compare]
12:53.83 ssl3ext.c:905:25: warning: comparison between signed and unsigned integer expressions [-Wsign-compare]
12:53.83 ssl3ext.c: In function 'ssl3_ServerSendStatusRequestXtn':
12:53.83 ssl3ext.c:953:28: warning: comparison between signed and unsigned integer expressions [-Wsign-compare]
12:53.83 ssl3ext.c: In function 'ssl3_ClientSendStatusRequestXtn':
12:53.83 ssl3ext.c:986:28: warning: comparison between signed and unsigned integer expressions [-Wsign-compare]
12:53.83 ssl3ext.c:1014:25: warning: comparison between signed and unsigned integer expressions [-Wsign-compare]
12:53.83 ssl3ext.c: In function 'ssl3_SendNewSessionTicket':
12:53.83 ssl3ext.c:1250:19: warning: comparison between signed and unsigned integer expressions [-Wsign-compare]
12:53.83 ssl3ext.c: In function 'ssl3_ServerHandleSessionTicketXtn':
12:53.83 ssl3ext.c:1589:23: warning: comparison between signed and unsigned integer expressions [-Wsign-compare]
12:53.83 ssl3ext.c: In function 'ssl3_SendRenegotiationInfoXtn':
12:53.83 ssl3ext.c:1983:28: warning: comparison between signed and unsigned integer expressions [-Wsign-compare]
12:53.83 ssl3ext.c: In function 'ssl3_ClientSendSigAlgsXtn':
12:53.83 ssl3ext.c:2358:28: warning: comparison between signed and unsigned integer expressions [-Wsign-compare]
12:53.84 ssl3ext.c:2372:25: warning: comparison between signed and unsigned integer expressions [-Wsign-compare]
12:53.84 ssl3ext.c: In function 'ssl3_ClientSendDraftVersionXtn':
12:53.84 ssl3ext.c:2448:28: warning: comparison between signed and unsigned integer expressions [-Wsign-compare]
12:53.84 ssl3ext.c:2461:25: warning: comparison between signed and unsigned integer expressions [-Wsign-compare]
12:54.19 cmsrecinfo.c: In function 'NSS_CMSRecipientInfo_UnwrapBulkKey':
12:54.19 cmsrecinfo.c:529:21: warning: variable 'encalg' set but not used [-Wunused-but-set-variable]
12:54.39 crmfpop.c: In function 'CRMF_CertReqMsgSetRAVerifiedPOP':
12:54.39 crmfpop.c:36:14: warning: variable 'dummy' set but not used [-Wunused-but-set-variable]
12:54.39 crmfpop.c: In function 'crmf_generic_encoder_callback':
12:54.39 crmfpop.c:119:38: warning: comparison between signed and unsigned integer expressions [-Wsign-compare]
12:54.39 crmfpop.c: In function 'crmf_encode_popoprivkey':
12:54.39 crmfpop.c:349:33: warning: comparison between signed and unsigned integer expressions [-Wsign-compare]
12:54.77 sslsecur.c: In function 'SSL_ConfigSecureServerWithCertChain':
12:54.77 sslsecur.c:847:5: warning: comparison of unsigned expression < 0 is always false [-Wtype-limits]
12:54.77 sslsecur.c: In function 'ssl_SecureRecv':
12:54.77 sslsecur.c:1180:22: warning: variable 'sec' set but not used [-Wunused-but-set-variable]
12:55.06 crmfcont.c: In function 'CRMF_CreateEncryptedKeyWithEncryptedValue':
12:55.06 crmfcont.c:860:25: warning: variable 'dummy' set but not used [-Wunused-but-set-variable]
12:55.67 cmmfchal.c: In function 'cmmf_create_witness_and_challenge':
12:55.67 cmmfchal.c:33:22: warning: variable 'id' set but not used [-Wunused-but-set-variable]
12:55.75 smimeutil.c: In function 'NSSSMIME_VersionCheck':
12:55.75 smimeutil.c:772:19: warning: variable 'c' set but not used [-Wunused-but-set-variable]
12:56.11 basicutil.c: In function 'SECU_PrintPRandOSError':
12:56.11 basicutil.c:628:30: warning: comparison between signed and unsigned integer expressions [-Wsign-compare]
12:56.12 basicutil.c:632:30: warning: comparison between signed and unsigned integer expressions [-Wsign-compare]
12:56.12 basicutil.c: In function 'SECU_SECItemHexStringToBinary':
12:56.12 basicutil.c:705:16: warning: comparison between signed and unsigned integer expressions [-Wsign-compare]
12:56.12 basicutil.c:716:16: warning: comparison between signed and unsigned integer expressions [-Wsign-compare]
12:56.12 basicutil.c: In function 'SECU_PrintAsHex':
12:56.12 basicutil.c:286:13: warning: 'column' may be used uninitialized in this function [-Wmaybe-uninitialized]
12:56.16 sslsock.c: In function 'ssl_WriteV':
12:56.16 sslsock.c:2524:30: warning: comparison between signed and unsigned integer expressions [-Wsign-compare]
12:56.16 sslsock.c:2537:68: warning: comparison between signed and unsigned integer expressions [-Wsign-compare]
12:56.16 sslsock.c:2556:28: warning: comparison between signed and unsigned integer expressions [-Wsign-compare]
12:56.16 sslsock.c:2556:59: warning: signed and unsigned type in conditional expression [-Wsign-compare]
12:56.16 sslsock.c:2559:23: warning: comparison between signed and unsigned integer expressions [-Wsign-compare]
12:56.16 sslsock.c:2565:56: warning: comparison between signed and unsigned integer expressions [-Wsign-compare]
12:56.75 sslinfo.c: In function 'SSL_DisableDefaultExportCipherSuites':
12:56.75 sslinfo.c:247:15: warning: variable 'rv' set but not used [-Wunused-but-set-variable]
12:56.75 sslinfo.c: In function 'SSL_DisableExportCipherSuites':
12:56.75 sslinfo.c:268:15: warning: variable 'rv' set but not used [-Wunused-but-set-variable]
12:57.09 ssl3ecc.c: In function 'ssl3_DisableECCSuites':
12:57.09 ssl3ecc.c:969:19: warning: unused variable 'rv' [-Wunused-variable]
12:57.09 ssl3ecc.c: In function 'ssl3_SendSupportedCurvesXtn':
12:57.09 ssl3ecc.c:1130:28: warning: comparison between signed and unsigned integer expressions [-Wsign-compare]
12:57.09 ssl3ecc.c: In function 'ssl3_HandleSupportedCurvesXtn':
12:57.09 ssl3ecc.c:1238:35: warning: comparison between signed and unsigned integer expressions [-Wsign-compare]
12:57.24 jarsign.c: In function 'jar_create_pk7':
12:57.24 jarsign.c:174:11: warning: variable 'errstring' set but not used [-Wunused-but-set-variable]
12:57.24 libnss3.so
12:57.30 secutil.c: In function 'SECU_ChangePW2':
12:57.30 secutil.c:336:15: warning: variable 'rv' set but not used [-Wunused-but-set-variable]
12:57.30 secutil.c: In function 'SECU_PrintDumpDerIssuerAndSerial':
12:57.30 secutil.c:1554:19: warning: comparison between signed and unsigned integer expressions [-Wsign-compare]
12:57.30 secutil.c: In function 'SECU_PrintCertificateBasicInfo':
12:57.30 secutil.c:2420:9: warning: unused variable 'iv' [-Wunused-variable]
12:57.30 secutil.c: In function 'secu_PrintPKCS7Signed':
12:57.30 secutil.c:2746:11: warning: passing argument 5 of 'SECU_PrintSignedData' from incompatible pointer type [enabled by default]
12:57.31 In file included from secutil.c:19:0:
12:57.31 secutil.h:263:12: note: expected 'SECU_PPFunc' but argument is of type 'int (*)(struct FILE *, const struct SECItem *, const char *, int)'
12:57.31 secutil.c: In function 'secu_PrintPKCS7SignedAndEnveloped':
12:57.31 secutil.c:2865:11: warning: passing argument 5 of 'SECU_PrintSignedData' from incompatible pointer type [enabled by default]
12:57.31 In file included from secutil.c:19:0:
12:57.31 secutil.h:263:12: note: expected 'SECU_PPFunc' but argument is of type 'int (*)(struct FILE *, const struct SECItem *, const char *, int)'
12:57.31 secutil.c: In function 'SEC_PrintCertificateAndTrust':
12:57.31 secutil.c:3195:10: warning: passing argument 5 of 'SECU_PrintSignedData' from incompatible pointer type [enabled by default]
12:57.31 secutil.c:3168:5: note: expected 'SECU_PPFunc' but argument is of type 'int (*)(struct FILE *, const struct SECItem *, const char *, int)'
12:57.31 secutil.c: In function 'SECU_StoreCRL':
12:57.31 secutil.c:3367:62: warning: comparison between signed and unsigned integer expressions [-Wsign-compare]
12:57.44 jar.c: In function 'JAR_find_next':
12:57.44 jar.c:423:30: warning: comparison between signed and unsigned integer expressions [-Wsign-compare]
12:57.44 jar.c: In function 'jar_find_first_cert':
12:57.44 jar.c:462:24: warning: comparison between signed and unsigned integer expressions [-Wsign-compare]
12:57.52 derprint.c: In function 'prettyPrintLength':
12:57.52 derprint.c:454:20: warning: comparison between signed and unsigned integer expressions [-Wsign-compare]
12:57.87 jarfile.c: In function 'jar_physical_inflate':
12:57.87 jarfile.c:341:32: warning: comparison between signed and unsigned integer expressions [-Wsign-compare]
12:57.87 jarfile.c:356:38: warning: comparison between signed and unsigned integer expressions [-Wsign-compare]
12:57.87 jarfile.c: In function 'jar_extract_mf':
12:57.87 jarfile.c:578:14: warning: comparison between signed and unsigned integer expressions [-Wsign-compare]
12:57.87 jarfile.c: In function 'jar_listzip':
12:57.87 jarfile.c:702:47: warning: comparison between signed and unsigned integer expressions [-Wsign-compare]
12:57.87 jarfile.c:768:43: warning: comparison between signed and unsigned integer expressions [-Wsign-compare]
12:57.87 jarfile.c: In function 'jar_listtar':
12:57.87 jarfile.c:830:45: warning: comparison between signed and unsigned integer expressions [-Wsign-compare]
12:57.87 jarfile.c:824:12: warning: variable 'when' set but not used [-Wunused-but-set-variable]
12:57.87 jarfile.c:823:14: warning: variable 'mode' set but not used [-Wunused-but-set-variable]
12:59.17 shlibsign.c: In function 'writeItem':
12:59.17 shlibsign.c:150:22: warning: comparison between signed and unsigned integer expressions [-Wsign-compare]
12:59.17 shlibsign.c: In function 'main':
12:59.17 shlibsign.c:908:40: warning: comparison between signed and unsigned integer expressions [-Wsign-compare]
12:59.18 cd mangle; /usr/bin/make libs
12:59.91 loader.c: In function 'freebl_LoadDSO':
12:59.91 loader.c:135:14: warning: variable 'status' set but not used [-Wunused-but-set-variable]
12:59.91 loader.c: In function 'BL_Unload':
12:59.91 loader.c:904:20: warning: unused variable 'status' [-Wunused-variable]
12:59.93 mkdir: das Verzeichnis „/opt/FirefoxSource/mozilla-release/objdir-droid/security/nss/lib/freebl“ kann nicht angelegt werden: Die Datei existiert bereits
13:00.07 ldvector.c: In function 'FREEBL_GetVector':
13:00.07 ldvector.c:301:19: warning: variable 'c' set but not used [-Wunused-but-set-variable]
13:00.85 token.c: In function 'nssCKFWToken_GetUTCTime':
13:00.85 token.c:1261:27: warning: variable 'z' set but not used [-Wunused-but-set-variable]
13:01.33 keystuff.c: In function 'UpdateRNG':
13:01.33 keystuff.c:96:18: warning: comparison between signed and unsigned integer expressions [-Wsign-compare]
13:01.74 pk12util.c: In function 'P12U_ListPKCS12File':
13:01.74 pk12util.c:759:30: warning: passing argument 5 of 'SECU_PrintSignedData' from incompatible pointer type [enabled by default]
13:01.74 In file included from pk12util.c:11:0:
13:01.74 /opt/FirefoxSource/mozilla-release/objdir-droid/dist/private/nss/secutil.h:263:12: note: expected 'SECU_PPFunc' but argument is of type 'int (*)(struct FILE *, const struct SECItem *, const char *, int)'
13:01.92 cd builtins; /usr/bin/make libs
13:02.40 sha512.c: In function 'SHA512_Compress':
13:02.40 sha512.c:933:14: warning: unused variable 't1' [-Wunused-variable]
13:02.40 sha512.c:955:18: warning: unused variable 't2' [-Wunused-variable]
13:02.40 sha512.c:955:14: warning: unused variable 't1' [-Wunused-variable]
13:02.40 sha512.c: In function 'SHA512_End':
13:02.40 sha512.c:1229:14: warning: unused variable 't1' [-Wunused-variable]
13:02.40 sha512.c: In function 'SHA512_EndRaw':
13:02.40 sha512.c:1274:14: warning: unused variable 't1' [-Wunused-variable]
13:02.41 bfind.c: In function 'builtins_attrmatch':
13:02.41 bfind.c:122:11: warning: comparison between signed and unsigned integer expressions [-Wsign-compare]
13:02.44 pk11.c: In function 'ListModule':
13:02.44 pk11.c:612:16: warning: comparison between signed and unsigned integer expressions [-Wsign-compare]
13:02.49 binst.c: In function 'builtins_mdInstance_GetLibraryVersion':
13:02.49 binst.c:70:17: warning: variable 'c' set but not used [-Wunused-but-set-variable]
13:02.56 rawhash.c: In function 'HASH_GetRawHashObject':
13:02.56 rawhash.c:156:5: warning: comparison of unsigned expression < 0 is always false [-Wtype-limits]
13:03.04 ytab.c: In function 'Pk11Install_yyparse':
13:03.04 ytab.c:219:5: warning: suggest parentheses around assignment used as truth value [-Wparentheses]
13:03.74 lex.Pk11Install_yy.cpp:1060:13: warning: 'Pkcs11Install_yyunput' defined but not used [-Wunused-function]
13:03.74 lex.Pk11Install_yy.cpp:1106:12: warning: 'input' defined but not used [-Wunused-function]
13:03.80 cts.c: In function 'CTS_DecryptUpdate':
13:03.80 cts.c:226:23: warning: comparison between signed and unsigned integer expressions [-Wsign-compare]
13:03.98 gcm.c: In function 'gcm_getX':
13:03.98 gcm.c:223:13: warning: comparison between signed and unsigned integer expressions [-Wsign-compare]
13:04.31 dh.c: In function 'DH_Derive':
13:04.31 dh.c:271:13: warning: comparison between signed and unsigned integer expressions [-Wsign-compare]
13:04.46 ecdecode.c: In function 'gf_populate_params':
13:04.46 ecdecode.c:120:5: warning: comparison of unsigned expression < 0 is always false [-Wtype-limits]
13:04.51 ec.c: In function 'ec_points_mul':
13:04.51 ec.c:89:17: warning: comparison between signed and unsigned integer expressions [-Wsign-compare]
13:04.51 ec.c: In function 'EC_ValidatePublicKey':
13:04.51 ec.c:450:33: warning: comparison between signed and unsigned integer expressions [-Wsign-compare]
13:04.72 dsa.c: In function 'DSA_VerifyDigest':
13:04.72 dsa.c:518:25: warning: comparison between signed and unsigned integer expressions [-Wsign-compare]
13:04.72 dsa.c:530:27: warning: comparison between signed and unsigned integer expressions [-Wsign-compare]
13:05.02 pqg.c: In function 'makePrimefromPrimesShaweTaylor':
13:05.02 pqg.c:617:34: warning: comparison between signed and unsigned integer expressions [-Wsign-compare]
13:05.02 pqg.c:687:28: warning: comparison between signed and unsigned integer expressions [-Wsign-compare]
13:05.02 pqg.c: In function 'makePrimefromSeedShaweTaylor':
13:05.02 pqg.c:849:28: warning: comparison between signed and unsigned integer expressions [-Wsign-compare]
13:05.02 pqg.c: In function 'pqg_ParamGen':
13:05.02 pqg.c:1232:18: warning: variable 'b' set but not used [-Wunused-but-set-variable]
13:05.02 pqg.c: In function 'PQG_VerifyParams':
13:05.02 pqg.c:1614:50: warning: comparison between signed and unsigned integer expressions [-Wsign-compare]
13:05.02 pqg.c:1672:25: warning: comparison between signed and unsigned integer expressions [-Wsign-compare]
13:05.02 pqg.c:1708:18: warning: comparison between signed and unsigned integer expressions [-Wsign-compare]
13:05.02 pqg.c:1709:25: warning: comparison between signed and unsigned integer expressions [-Wsign-compare]
13:05.02 pqg.c:1710:33: warning: comparison between signed and unsigned integer expressions [-Wsign-compare]
13:05.02 pqg.c:1733:29: warning: comparison between signed and unsigned integer expressions [-Wsign-compare]
13:05.02 pqg.c:1775:27: warning: 'type' may be used uninitialized in this function [-Wmaybe-uninitialized]
13:05.02 pqg.c:1595:16: note: 'type' was declared here
13:05.02 pqg.c:1777:5: warning: 'hashtype' may be used uninitialized in this function [-Wmaybe-uninitialized]
13:05.02 pqg.c:1594:19: note: 'hashtype' was declared here
13:05.14 shvfy.c: In function 'readItem':
13:05.14 shvfy.c:267:19: warning: comparison between signed and unsigned integer expressions [-Wsign-compare]
13:05.23 rsa.c: In function 'RSA_NewKey':
13:05.23 rsa.c:251:29: warning: comparison between signed and unsigned integer expressions [-Wsign-compare]
13:05.23 rsa.c: In function 'rsa_get_primes_from_exponents':
13:05.23 rsa.c:482:52: warning: comparison between signed and unsigned integer expressions [-Wsign-compare]
13:05.43 mpi/mpprime.c: In function 'mpp_make_prime':
13:05.43 mpi/mpprime.c:445:47: warning: comparison between signed and unsigned integer expressions [-Wsign-compare]
13:05.59 mpi/mplogic.c: In function 'mpl_num_set':
13:05.59 mpi/mplogic.c:230:20: warning: comparison between signed and unsigned integer expressions [-Wsign-compare]
13:05.59 mpi/mplogic.c: In function 'mpl_num_clear':
13:05.59 mpi/mplogic.c:260:20: warning: comparison between signed and unsigned integer expressions [-Wsign-compare]
13:06.65 mpi/mpi.c: In function 'mp_expt':
13:06.65 mpi/mpi.c:1114:20: warning: comparison between signed and unsigned integer expressions [-Wsign-compare]
13:06.65 mpi/mpi.c:1118:22: warning: comparison between signed and unsigned integer expressions [-Wsign-compare]
13:06.65 mpi/mpi.c: In function 's_mp_exptmod':
13:06.65 mpi/mpi.c:1497:20: warning: comparison between signed and unsigned integer expressions [-Wsign-compare]
13:06.65 mpi/mpi.c:1501:22: warning: comparison between signed and unsigned integer expressions [-Wsign-compare]
13:06.65 mpi/mpi.c: In function 'mp_trailing_zeros':
13:06.65 mpi/mpi.c:2012:45: warning: comparison between signed and unsigned integer expressions [-Wsign-compare]
13:06.65 mpi/mpi.c: In function 's_mp_fixup_reciprocal':
13:06.65 mpi/mpi.c:2164:19: warning: comparison between signed and unsigned integer expressions [-Wsign-compare]
13:06.65 mpi/mpi.c:2164:51: warning: signed and unsigned type in conditional expression [-Wsign-compare]
13:06.65 mpi/mpi.c:2166:11: warning: comparison between signed and unsigned integer expressions [-Wsign-compare]
13:06.65 mpi/mpi.c: In function 's_mp_lshd':
13:06.65 mpi/mpi.c:2938:18: warning: comparison between signed and unsigned integer expressions [-Wsign-compare]
13:06.65 mpi/mpi.c: In function 's_mp_mul_2':
13:06.65 mpi/mpi.c:3063:12: warning: comparison between signed and unsigned integer expressions [-Wsign-compare]
13:06.65 mpi/mpi.c: In function 's_mp_todigit':
13:06.65 mpi/mpi.c:4600:10: warning: comparison between signed and unsigned integer expressions [-Wsign-compare]
13:06.65 mpi/mpi.c: In function 'mp_to_unsigned_octets':
13:06.65 mpi/mpi.c:4720:29: warning: comparison between signed and unsigned integer expressions [-Wsign-compare]
13:06.65 mpi/mpi.c: In function 'mp_to_signed_octets':
13:06.65 mpi/mpi.c:4752:29: warning: comparison between signed and unsigned integer expressions [-Wsign-compare]
13:06.65 mpi/mpi.c:4766:20: warning: comparison between signed and unsigned integer expressions [-Wsign-compare]
13:06.65 mpi/mpi.c:4767:18: warning: comparison between signed and unsigned integer expressions [-Wsign-compare]
13:06.65 mpi/mpi.c: In function 'mp_to_fixlen_octets':
13:06.65 mpi/mpi.c:4792:29: warning: comparison between signed and unsigned integer expressions [-Wsign-compare]
13:06.66 mpi/mpi.c:4795:16: warning: comparison between signed and unsigned integer expressions [-Wsign-compare]
13:06.73 ecl/ecp_521.c: In function 'ec_GFp_nistp521_mod':
13:06.73 ecl/ecp_521.c:42:73: warning: comparison between signed and unsigned integer expressions [-Wsign-compare]
13:06.73 ecl/ecp_521.c:50:18: warning: comparison between signed and unsigned integer expressions [-Wsign-compare]
13:07.56 lgglue.c: In function 'sftkdb_resolvePath':
13:07.56 lgglue.c:44:24: warning: comparison between signed and unsigned integer expressions [-Wsign-compare]
13:07.93 lowpbe.c: In function 'nsspkcs5_PKCS12PBE':
13:07.93 lowpbe.c:519:22: warning: comparison between signed and unsigned integer expressions [-Wsign-compare]
13:08.45 pkcs11u.c: In function 'sftk_DeleteObject':
13:08.45 pkcs11u.c:1177:22: warning: unused variable 'to' [-Wunused-variable]
13:08.45 pkcs11u.c: In function 'sftk_NewTokenObject':
13:08.45 pkcs11u.c:1902:22: warning: variable 'tokObject' set but not used [-Wunused-but-set-variable]
13:08.95 sdb.c: In function 'sdb_FindObjectsInit':
13:08.95 sdb.c:702:28: warning: comparison between signed and unsigned integer expressions [-Wsign-compare]
13:08.95 sdb.c:727:32: warning: comparison between signed and unsigned integer expressions [-Wsign-compare]
13:08.95 sdb.c: In function 'sdb_GetAttributeValueNoLock':
13:08.95 sdb.c:848:17: warning: comparison between signed and unsigned integer expressions [-Wsign-compare]
13:08.95 sdb.c:900:34: warning: comparison between signed and unsigned integer expressions [-Wsign-compare]
13:08.95 sdb.c: In function 'sdb_SetAttributeValue':
13:08.95 sdb.c:978:27: warning: comparison between signed and unsigned integer expressions [-Wsign-compare]
13:08.95 sdb.c:1007:17: warning: comparison between signed and unsigned integer expressions [-Wsign-compare]
13:08.95 sdb.c: In function 'sdb_CreateObject':
13:08.95 sdb.c:1138:42: warning: comparison between signed and unsigned integer expressions [-Wsign-compare]
13:08.95 sdb.c:1168:17: warning: comparison between signed and unsigned integer expressions [-Wsign-compare]
13:08.99 pkcs11.c: In function 'sftk_GetPubKey':
13:08.99 pkcs11.c:1756:35: warning: comparison between signed and unsigned integer expressions [-Wsign-compare]
13:08.99 pkcs11.c:1764:35: warning: comparison between signed and unsigned integer expressions [-Wsign-compare]
13:08.99 pkcs11.c:1774:27: warning: comparison between signed and unsigned integer expressions [-Wsign-compare]
13:08.99 pkcs11.c: In function 'NSC_GetInfo':
13:08.99 pkcs11.c:3144:19: warning: variable 'c' set but not used [-Wunused-but-set-variable]
13:08.99 pkcs11.c: In function 'NSC_GetAttributeValue':
13:08.99 pkcs11.c:4314:58: warning: comparison between signed and unsigned integer expressions [-Wsign-compare]
13:08.99 pkcs11.c: In function 'sftk_emailhack':
13:08.99 pkcs11.c:4527:17: warning: comparison between signed and unsigned integer expressions [-Wsign-compare]
13:08.99 pkcs11.c: In function 'NSC_FindObjects':
13:08.99 pkcs11.c:4743:54: warning: signed and unsigned type in conditional expression [-Wsign-compare]
13:08.99 pkcs11.c: In function 'NSC_CreateObject':
13:08.99 pkcs11.c:4085:21: warning: 'moduleIndex' may be used uninitialized in this function [-Wmaybe-uninitialized]
13:08.99 pkcs11.c:4005:19: note: 'moduleIndex' was declared here
13:09.10 sftkhmac.c: In function 'sftk_HMACConstantTime_Update':
13:09.10 sftkhmac.c:149:15: warning: unused variable 'rv' [-Wunused-variable]
13:09.10 sftkhmac.c: In function 'sftk_SSLv3MACConstantTime_Update':
13:09.10 sftkhmac.c:163:15: warning: unused variable 'rv' [-Wunused-variable]
13:09.63 sftkdb.c: In function 'sftkdb_fixupTemplateOut':
13:09.63 sftkdb.c:328:22: warning: variable 'data' set but not used [-Wunused-but-set-variable]
13:09.63 sftkdb.c:345:69: warning: comparison between signed and unsigned integer expressions [-Wsign-compare]
13:09.63 sftkdb.c: In function 'sftk_signTemplate':
13:09.63 sftkdb.c:520:17: warning: comparison between signed and unsigned integer expressions [-Wsign-compare]
13:09.63 sftkdb.c: In function 'sftkdb_CreateObject':
13:09.63 sftkdb.c:576:12: warning: variable 'inTransaction' set but not used [-Wunused-but-set-variable]
13:09.63 sftkdb.c: In function 'sftk_ExtractTemplate':
13:09.63 sftkdb.c:619:17: warning: comparison between signed and unsigned integer expressions [-Wsign-compare]
13:09.63 sftkdb.c:632:17: warning: comparison between signed and unsigned integer expressions [-Wsign-compare]
13:09.63 sftkdb.c: In function 'sftkdb_resolveConflicts':
13:09.63 sftkdb.c:1045:13: warning: comparison between signed and unsigned integer expressions [-Wsign-compare]
13:09.63 sftkdb.c: In function 'sftkdb_FindObjects':
13:09.63 sftkdb.c:1261:14: warning: comparison between signed and unsigned integer expressions [-Wsign-compare]
13:09.63 sftkdb.c: In function 'sftkdb_GetObjectTemplate':
13:09.63 sftkdb.c:1613:14: warning: comparison between signed and unsigned integer expressions [-Wsign-compare]
13:09.63 sftkdb.c:1631:63: warning: comparison between signed and unsigned integer expressions [-Wsign-compare]
13:09.63 sftkdb.c: In function 'sftkdb_handleIDAndName':
13:09.63 sftkdb.c:2014:11: warning: variable 'crv' set but not used [-Wunused-but-set-variable]
13:09.64 sftkdb.c: In function 'sftkdb_mergeObject':
13:09.64 sftkdb.c:2196:17: warning: comparison between signed and unsigned integer expressions [-Wsign-compare]
13:09.64 sftkdb.c: In function 'sftkdb_Update':
13:09.64 sftkdb.c:2301:38: warning: comparison between signed and unsigned integer expressions [-Wsign-compare]
13:09.69 sftkpwd.c: In function 'sftk_updateMacs':
13:09.69 sftkpwd.c:908:17: warning: comparison between signed and unsigned integer expressions [-Wsign-compare]
13:09.69 sftkpwd.c:909:31: warning: comparison between signed and unsigned integer expressions [-Wsign-compare]
13:09.69 sftkpwd.c:930:17: warning: comparison between signed and unsigned integer expressions [-Wsign-compare]
13:09.69 sftkpwd.c:935:31: warning: comparison between signed and unsigned integer expressions [-Wsign-compare]
13:09.69 sftkpwd.c:868:11: warning: variable 'crv2' set but not used [-Wunused-but-set-variable]
13:09.69 sftkpwd.c:867:11: warning: variable 'crv' set but not used [-Wunused-but-set-variable]
13:09.69 sftkpwd.c: In function 'sftk_updateEncrypted':
13:09.69 sftkpwd.c:986:17: warning: comparison between signed and unsigned integer expressions [-Wsign-compare]
13:09.69 sftkpwd.c:993:31: warning: comparison between signed and unsigned integer expressions [-Wsign-compare]
13:09.69 sftkpwd.c: In function 'sftkdb_convertObjects':
13:09.69 sftkpwd.c:1125:38: warning: comparison between signed and unsigned integer expressions [-Wsign-compare]
13:09.93 pkcs11c.c: In function 'NSC_GenerateKeyPair':
13:09.93 pkcs11c.c:4340:9: warning: variable 'private_value_bits' set but not used [-Wunused-but-set-variable]
13:09.93 pkcs11c.c: In function 'sftk_PackagePrivateKey':
13:09.93 pkcs11c.c:4862:14: warning: variable 'fordebug' set but not used [-Wunused-but-set-variable]
13:09.93 pkcs11c.c: In function 'NSC_DeriveKey':
13:09.93 pkcs11c.c:6764:18: warning: comparison between signed and unsigned integer expressions [-Wsign-compare]
13:09.93 pkcs11c.c:6769:18: warning: comparison between signed and unsigned integer expressions [-Wsign-compare]
13:09.93 pkcs11c.c:6850:20: warning: comparison between signed and unsigned integer expressions [-Wsign-compare]
13:09.93 pkcs11c.c: In function 'NSC_GenerateKeyPair':
13:09.93 pkcs11c.c:4260:6: warning: 'subPrimeLen' may be used uninitialized in this function [-Wmaybe-uninitialized]
13:09.93 pkcs11c.c:4042:14: note: 'subPrimeLen' was declared here
13:09.93 pkcs11c.c:4212:23: warning: 'modulusLen' may be used uninitialized in this function [-Wmaybe-uninitialized]
13:09.93 pkcs11c.c:4041:14: note: 'modulusLen' was declared here
13:09.93 pkcs11c.c: In function 'NSC_GenerateKey':
13:09.93 pkcs11c.c:3968:13: warning: 'hashType' may be used uninitialized in this function [-Wmaybe-uninitialized]
13:09.98 libnspr.a.desc
13:09.98 libsqlite.a.desc
13:10.00 libcrmf.a.desc
13:10.04 Unified_c_manager_ssl_src0.o
13:10.04 PSMContentListener.o
13:10.04 nsCryptoHash.o
13:10.18 nsNSSCertificateDB.o
13:10.42 RegExp.o
13:10.42 CTypes.o
13:10.89 WriteArgument.o
13:10.93 WriteArgument
13:11.04 ssltunnel.o
13:11.38 nsNSSComponent.o
13:12.58 ssltunnel
13:12.66 BadCertServer.o
13:12.66 ClientAuthServer.o
13:13.01 GenerateOCSPResponse.o
13:13.02 nsNSSVersion.o
13:13.34 OCSPStaplingServer.o
13:14.01 BadCertServer
13:14.01 ClientAuthServer
13:14.12 GenerateOCSPResponse
13:14.25 OCSPStaplingServer
13:14.48 Unified_cpp_manager_ssl_src0.o
13:14.65 Unified_cpp_manager_ssl_src1.o
13:14.85 Unified_cpp_manager_ssl_src2.o
13:17.13 Library.o
13:22.27 libdombindings_test_s.a.desc
13:23.30 Parser.o
13:23.74 ExecutableAllocatorPosix.o
13:24.41 jsarray.o
13:24.65 jsatom.o
13:24.75 libsecurity_manager_ssl_src.a.desc
13:24.78 jsmath.o
13:29.21 /opt/FirefoxSource/mozilla-release/js/src/ctypes/CTypes.cpp: In function 'bool js::ctypes::ExplicitConvert(JSContext*, JS::HandleValue, JS::HandleObject, void*)':
13:29.21 Warning: -Wmaybe-uninitialized in /opt/FirefoxSource/mozilla-release/js/src/ctypes/CTypes.cpp: 'result' may be used uninitialized in this function
13:29.21 /opt/FirefoxSource/mozilla-release/js/src/ctypes/CTypes.cpp:2748:234: warning: 'result' may be used uninitialized in this function [-Wmaybe-uninitialized]
13:29.21 /opt/FirefoxSource/mozilla-release/js/src/ctypes/CTypes.cpp:2748:34: note: 'result' was declared here
13:29.21 Warning: -Wmaybe-uninitialized in /opt/FirefoxSource/mozilla-release/js/src/ctypes/CTypes.cpp: 'result' may be used uninitialized in this function
13:29.21 /opt/FirefoxSource/mozilla-release/js/src/ctypes/CTypes.cpp:2747:218: warning: 'result' may be used uninitialized in this function [-Wmaybe-uninitialized]
13:29.21 /opt/FirefoxSource/mozilla-release/js/src/ctypes/CTypes.cpp:2747:26: note: 'result' was declared here
13:29.21 Warning: -Wmaybe-uninitialized in /opt/FirefoxSource/mozilla-release/js/src/ctypes/CTypes.cpp: 'result' may be used uninitialized in this function
13:29.21 /opt/FirefoxSource/mozilla-release/js/src/ctypes/CTypes.cpp:2746:960: warning: 'result' may be used uninitialized in this function [-Wmaybe-uninitialized]
13:29.21 /opt/FirefoxSource/mozilla-release/js/src/ctypes/CTypes.cpp:2746:750: note: 'result' was declared here
13:29.21 jsutil.o
13:29.85 pm_stub.o
13:29.98 TraceLogging.o
13:30.09 TraceLoggingGraph.o
13:33.76 TraceLoggingTypes.o
13:34.57 Unified_cpp_js_src0.o
13:34.89 Unified_cpp_js_src1.o
13:35.68 Unified_cpp_js_src10.o
13:37.07 Unified_cpp_js_src11.o
13:38.84 Unified_cpp_js_src12.o
14:01.66 In file included from /opt/FirefoxSource/mozilla-release/js/src/jsobjinlines.h:24:0,
14:01.66                  from /opt/FirefoxSource/mozilla-release/js/src/frontend/BytecodeCompiler.cpp:20,
14:01.66                  from /opt/FirefoxSource/mozilla-release/objdir-droid/js/src/Unified_cpp_js_src1.cpp:20:
14:01.66 /opt/FirefoxSource/mozilla-release/js/src/jsgcinlines.h: In function 'void js::IterateScripts(JSRuntime*, JSCompartment*, void*, js::IterateScriptCallback)':
14:01.66 Warning: -Wmaybe-uninitialized in /opt/FirefoxSource/mozilla-release/js/src/jsgcinlines.h: '*((void*)(& i)+12).js::gc::ArenaCellIterImpl::thing' may be used uninitialized in this function
14:01.66 /opt/FirefoxSource/mozilla-release/js/src/jsgcinlines.h:193:27: warning: '*((void*)(& i)+12).js::gc::ArenaCellIterImpl::thing' may be used uninitialized in this function [-Wmaybe-uninitialized]
14:01.66 In file included from /opt/FirefoxSource/mozilla-release/objdir-droid/js/src/Unified_cpp_js_src1.cpp:101:0:
14:01.66 /opt/FirefoxSource/mozilla-release/js/src/gc/Iteration.cpp:108:38: note: '*((void*)(& i)+12).js::gc::ArenaCellIterImpl::thing' was declared here
14:01.66 In file included from /opt/FirefoxSource/mozilla-release/js/src/gc/Barrier.h:12:0,
14:01.66                  from /opt/FirefoxSource/mozilla-release/js/src/jsatom.h:14,
14:01.66                  from /opt/FirefoxSource/mozilla-release/js/src/vm/Runtime.h:21,
14:01.66                  from /opt/FirefoxSource/mozilla-release/js/src/jscntxt.h:15,
14:01.66                  from /opt/FirefoxSource/mozilla-release/js/src/frontend/BytecodeCompiler.cpp:9,
14:01.66                  from /opt/FirefoxSource/mozilla-release/objdir-droid/js/src/Unified_cpp_js_src1.cpp:20:
14:01.66 Warning: -Wmaybe-uninitialized in /opt/FirefoxSource/mozilla-release/js/src/gc/Heap.h: '*((void*)(& i)+12).js::gc::ArenaCellIterImpl::span.js::gc::FreeSpan::last' may be used uninitialized in this function
14:01.66 /opt/FirefoxSource/mozilla-release/js/src/gc/Heap.h:304:48: warning: '*((void*)(& i)+12).js::gc::ArenaCellIterImpl::span.js::gc::FreeSpan::last' may be used uninitialized in this function [-Wmaybe-uninitialized]
14:01.66 In file included from /opt/FirefoxSource/mozilla-release/objdir-droid/js/src/Unified_cpp_js_src1.cpp:101:0:
14:01.66 /opt/FirefoxSource/mozilla-release/js/src/gc/Iteration.cpp:108:38: note: '*((void*)(& i)+12).js::gc::ArenaCellIterImpl::span.js::gc::FreeSpan::last' was declared here
14:01.66 In file included from /opt/FirefoxSource/mozilla-release/js/src/jsobjinlines.h:24:0,
14:01.66                  from /opt/FirefoxSource/mozilla-release/js/src/frontend/BytecodeCompiler.cpp:20,
14:01.66                  from /opt/FirefoxSource/mozilla-release/objdir-droid/js/src/Unified_cpp_js_src1.cpp:20:
14:01.66 Warning: -Wmaybe-uninitialized in /opt/FirefoxSource/mozilla-release/js/src/jsgcinlines.h: '*((void*)(& i)+12).js::gc::ArenaCellIterImpl::span.js::gc::FreeSpan::first' may be used uninitialized in this function
14:01.66 /opt/FirefoxSource/mozilla-release/js/src/jsgcinlines.h:134:9: warning: '*((void*)(& i)+12).js::gc::ArenaCellIterImpl::span.js::gc::FreeSpan::first' may be used uninitialized in this function [-Wmaybe-uninitialized]
14:01.66 In file included from /opt/FirefoxSource/mozilla-release/objdir-droid/js/src/Unified_cpp_js_src1.cpp:101:0:
14:01.66 /opt/FirefoxSource/mozilla-release/js/src/gc/Iteration.cpp:108:38: note: '*((void*)(& i)+12).js::gc::ArenaCellIterImpl::span.js::gc::FreeSpan::first' was declared here
14:01.66 In file included from /opt/FirefoxSource/mozilla-release/js/src/jsobjinlines.h:24:0,
14:01.66                  from /opt/FirefoxSource/mozilla-release/js/src/frontend/BytecodeCompiler.cpp:20,
14:01.66                  from /opt/FirefoxSource/mozilla-release/objdir-droid/js/src/Unified_cpp_js_src1.cpp:20:
14:01.66 /opt/FirefoxSource/mozilla-release/js/src/jsgcinlines.h: In member function 'void js::gc::GCRuntime::markRuntime(JSTracer*, js::gc::GCRuntime::TraceOrMarkRuntime, js::gc::GCRuntime::TraceRootsOrUsedSaved)':
14:01.66 Warning: -Wmaybe-uninitialized in /opt/FirefoxSource/mozilla-release/js/src/jsgcinlines.h: '*((void*)(& i)+12).js::gc::ArenaCellIterImpl::thing' may be used uninitialized in this function
14:01.66 /opt/FirefoxSource/mozilla-release/js/src/jsgcinlines.h:183:52: warning: '*((void*)(& i)+12).js::gc::ArenaCellIterImpl::thing' may be used uninitialized in this function [-Wmaybe-uninitialized]
14:01.66 In file included from /opt/FirefoxSource/mozilla-release/objdir-droid/js/src/Unified_cpp_js_src1.cpp:137:0:
14:01.66 /opt/FirefoxSource/mozilla-release/js/src/gc/RootMarking.cpp:480:38: note: '*((void*)(& i)+12).js::gc::ArenaCellIterImpl::thing' was declared here
14:01.66 In file included from /opt/FirefoxSource/mozilla-release/js/src/gc/Barrier.h:12:0,
14:01.66                  from /opt/FirefoxSource/mozilla-release/js/src/jsatom.h:14,
14:01.67                  from /opt/FirefoxSource/mozilla-release/js/src/vm/Runtime.h:21,
14:01.67                  from /opt/FirefoxSource/mozilla-release/js/src/jscntxt.h:15,
14:01.67                  from /opt/FirefoxSource/mozilla-release/js/src/frontend/BytecodeCompiler.cpp:9,
14:01.67                  from /opt/FirefoxSource/mozilla-release/objdir-droid/js/src/Unified_cpp_js_src1.cpp:20:
14:01.67 Warning: -Wmaybe-uninitialized in /opt/FirefoxSource/mozilla-release/js/src/gc/Heap.h: '*((void*)(& i)+12).js::gc::ArenaCellIterImpl::span.js::gc::FreeSpan::last' may be used uninitialized in this function
14:01.67 /opt/FirefoxSource/mozilla-release/js/src/gc/Heap.h:304:48: warning: '*((void*)(& i)+12).js::gc::ArenaCellIterImpl::span.js::gc::FreeSpan::last' may be used uninitialized in this function [-Wmaybe-uninitialized]
14:01.67 In file included from /opt/FirefoxSource/mozilla-release/objdir-droid/js/src/Unified_cpp_js_src1.cpp:137:0:
14:01.67 /opt/FirefoxSource/mozilla-release/js/src/gc/RootMarking.cpp:480:38: note: '*((void*)(& i)+12).js::gc::ArenaCellIterImpl::span.js::gc::FreeSpan::last' was declared here
14:01.67 In file included from /opt/FirefoxSource/mozilla-release/js/src/jsobjinlines.h:24:0,
14:01.67                  from /opt/FirefoxSource/mozilla-release/js/src/frontend/BytecodeCompiler.cpp:20,
14:01.67                  from /opt/FirefoxSource/mozilla-release/objdir-droid/js/src/Unified_cpp_js_src1.cpp:20:
14:01.67 Warning: -Wmaybe-uninitialized in /opt/FirefoxSource/mozilla-release/js/src/jsgcinlines.h: '*((void*)(& i)+12).js::gc::ArenaCellIterImpl::span.js::gc::FreeSpan::first' may be used uninitialized in this function
14:01.67 /opt/FirefoxSource/mozilla-release/js/src/jsgcinlines.h:134:9: warning: '*((void*)(& i)+12).js::gc::ArenaCellIterImpl::span.js::gc::FreeSpan::first' may be used uninitialized in this function [-Wmaybe-uninitialized]
14:01.67 In file included from /opt/FirefoxSource/mozilla-release/objdir-droid/js/src/Unified_cpp_js_src1.cpp:137:0:
14:01.67 /opt/FirefoxSource/mozilla-release/js/src/gc/RootMarking.cpp:480:38: note: '*((void*)(& i)+12).js::gc::ArenaCellIterImpl::span.js::gc::FreeSpan::first' was declared here
14:01.67 In file included from /opt/FirefoxSource/mozilla-release/js/src/jsobjinlines.h:24:0,
14:01.67                  from /opt/FirefoxSource/mozilla-release/js/src/frontend/BytecodeCompiler.cpp:20,
14:01.67                  from /opt/FirefoxSource/mozilla-release/objdir-droid/js/src/Unified_cpp_js_src1.cpp:20:
14:01.67 /opt/FirefoxSource/mozilla-release/js/src/jsgcinlines.h: In member function 'void js::gc::GCRuntime::_ZN2js2gc9GCRuntime11markRuntimeEP8JSTracerNS1_18TraceOrMarkRuntimeENS1_21TraceRootsOrUsedSavedE.constprop.487(JSTracer*)':
14:01.67 Warning: -Wmaybe-uninitialized in /opt/FirefoxSource/mozilla-release/js/src/jsgcinlines.h: '*((void*)(& i)+12).js::gc::ArenaCellIterImpl::thing' may be used uninitialized in this function
14:01.67 /opt/FirefoxSource/mozilla-release/js/src/jsgcinlines.h:183:52: warning: '*((void*)(& i)+12).js::gc::ArenaCellIterImpl::thing' may be used uninitialized in this function [-Wmaybe-uninitialized]
14:01.67 In file included from /opt/FirefoxSource/mozilla-release/objdir-droid/js/src/Unified_cpp_js_src1.cpp:137:0:
14:01.67 /opt/FirefoxSource/mozilla-release/js/src/gc/RootMarking.cpp:480:38: note: '*((void*)(& i)+12).js::gc::ArenaCellIterImpl::thing' was declared here
14:01.67 In file included from /opt/FirefoxSource/mozilla-release/js/src/gc/Barrier.h:12:0,
14:01.67                  from /opt/FirefoxSource/mozilla-release/js/src/jsatom.h:14,
14:01.67                  from /opt/FirefoxSource/mozilla-release/js/src/vm/Runtime.h:21,
14:01.67                  from /opt/FirefoxSource/mozilla-release/js/src/jscntxt.h:15,
14:01.67                  from /opt/FirefoxSource/mozilla-release/js/src/frontend/BytecodeCompiler.cpp:9,
14:01.67                  from /opt/FirefoxSource/mozilla-release/objdir-droid/js/src/Unified_cpp_js_src1.cpp:20:
14:01.67 Warning: -Wmaybe-uninitialized in /opt/FirefoxSource/mozilla-release/js/src/gc/Heap.h: '*((void*)(& i)+12).js::gc::ArenaCellIterImpl::span.js::gc::FreeSpan::last' may be used uninitialized in this function
14:01.67 /opt/FirefoxSource/mozilla-release/js/src/gc/Heap.h:304:48: warning: '*((void*)(& i)+12).js::gc::ArenaCellIterImpl::span.js::gc::FreeSpan::last' may be used uninitialized in this function [-Wmaybe-uninitialized]
14:01.67 In file included from /opt/FirefoxSource/mozilla-release/objdir-droid/js/src/Unified_cpp_js_src1.cpp:137:0:
14:01.67 /opt/FirefoxSource/mozilla-release/js/src/gc/RootMarking.cpp:480:38: note: '*((void*)(& i)+12).js::gc::ArenaCellIterImpl::span.js::gc::FreeSpan::last' was declared here
14:01.67 In file included from /opt/FirefoxSource/mozilla-release/js/src/jsobjinlines.h:24:0,
14:01.67                  from /opt/FirefoxSource/mozilla-release/js/src/frontend/BytecodeCompiler.cpp:20,
14:01.67                  from /opt/FirefoxSource/mozilla-release/objdir-droid/js/src/Unified_cpp_js_src1.cpp:20:
14:01.67 Warning: -Wmaybe-uninitialized in /opt/FirefoxSource/mozilla-release/js/src/jsgcinlines.h: '*((void*)(& i)+12).js::gc::ArenaCellIterImpl::span.js::gc::FreeSpan::first' may be used uninitialized in this function
14:01.67 /opt/FirefoxSource/mozilla-release/js/src/jsgcinlines.h:134:9: warning: '*((void*)(& i)+12).js::gc::ArenaCellIterImpl::span.js::gc::FreeSpan::first' may be used uninitialized in this function [-Wmaybe-uninitialized]
14:01.67 In file included from /opt/FirefoxSource/mozilla-release/objdir-droid/js/src/Unified_cpp_js_src1.cpp:137:0:
14:01.67 /opt/FirefoxSource/mozilla-release/js/src/gc/RootMarking.cpp:480:38: note: '*((void*)(& i)+12).js::gc::ArenaCellIterImpl::span.js::gc::FreeSpan::first' was declared here
14:01.67 Unified_cpp_js_src2.o
14:05.34 Unified_cpp_js_src3.o
14:08.72 Unified_cpp_js_src4.o
14:18.10 In file included from /opt/FirefoxSource/mozilla-release/objdir-droid/js/src/Unified_cpp_js_src0.cpp:38:0:
14:18.10 /opt/FirefoxSource/mozilla-release/js/src/asmjs/AsmJSValidate.cpp: In function 'js::AsmJSNumLit ExtractSimdValue({anonymous}::ModuleCompiler&, js::frontend::ParseNode*)':
14:18.11 Warning: -Wmaybe-uninitialized in /opt/FirefoxSource/mozilla-release/js/src/asmjs/AsmJSValidate.cpp: 'type' may be used uninitialized in this function
14:18.11 /opt/FirefoxSource/mozilla-release/js/src/asmjs/AsmJSValidate.cpp:2271:5: warning: 'type' may be used uninitialized in this function [-Wmaybe-uninitialized]
14:18.11 In file included from /opt/FirefoxSource/mozilla-release/objdir-droid/js/src/Unified_cpp_js_src0.cpp:20:0:
14:18.11 /opt/FirefoxSource/mozilla-release/js/src/asmjs/AsmJSModule.cpp: In member function 'void js::AsmJSModule::CodeRange::updateOffsets(js::jit::MacroAssembler&)':
14:18.11 Warning: -Wmaybe-uninitialized in /opt/FirefoxSource/mozilla-release/js/src/asmjs/AsmJSModule.cpp: 'profilingEpilogueBefore' may be used uninitialized in this function
14:18.11 /opt/FirefoxSource/mozilla-release/js/src/asmjs/AsmJSModule.cpp:1381:61: warning: 'profilingEpilogueBefore' may be used uninitialized in this function [-Wmaybe-uninitialized]
14:18.11 Warning: -Wmaybe-uninitialized in /opt/FirefoxSource/mozilla-release/js/src/asmjs/AsmJSModule.cpp: 'profilingJumpBefore' may be used uninitialized in this function
14:18.11 /opt/FirefoxSource/mozilla-release/js/src/asmjs/AsmJSModule.cpp:1381:61: warning: 'profilingJumpBefore' may be used uninitialized in this function [-Wmaybe-uninitialized]
14:18.11 Warning: -Wmaybe-uninitialized in /opt/FirefoxSource/mozilla-release/js/src/asmjs/AsmJSModule.cpp: 'entryBefore' may be used uninitialized in this function
14:18.11 /opt/FirefoxSource/mozilla-release/js/src/asmjs/AsmJSModule.cpp:1381:61: warning: 'entryBefore' may be used uninitialized in this function [-Wmaybe-uninitialized]
14:18.14 Unified_cpp_js_src5.o
14:23.44 Unified_cpp_js_src6.o
14:30.63 Unified_cpp_js_src7.o
14:53.68 In file included from /opt/FirefoxSource/mozilla-release/js/src/vm/Shape-inl.h:22:0,
14:53.68                  from /opt/FirefoxSource/mozilla-release/js/src/jsscriptinlines.h:19,
14:53.68                  from /opt/FirefoxSource/mozilla-release/js/src/jit/BaselineCompiler.cpp:25,
14:53.68                  from /opt/FirefoxSource/mozilla-release/objdir-droid/js/src/Unified_cpp_js_src3.cpp:2:
14:53.68 /opt/FirefoxSource/mozilla-release/js/src/jsgcinlines.h: In function 'void js::jit::ToggleBaselineTraceLoggerScripts(JSRuntime*, bool)':
14:53.68 Warning: -Wmaybe-uninitialized in /opt/FirefoxSource/mozilla-release/js/src/jsgcinlines.h: '*((void*)(& i)+12).js::gc::ArenaCellIterImpl::thing' may be used uninitialized in this function
14:53.68 /opt/FirefoxSource/mozilla-release/js/src/jsgcinlines.h:183:52: warning: '*((void*)(& i)+12).js::gc::ArenaCellIterImpl::thing' may be used uninitialized in this function [-Wmaybe-uninitialized]
14:53.68 In file included from /opt/FirefoxSource/mozilla-release/objdir-droid/js/src/Unified_cpp_js_src3.cpp:56:0:
14:53.68 /opt/FirefoxSource/mozilla-release/js/src/jit/BaselineJIT.cpp:1093:31: note: '*((void*)(& i)+12).js::gc::ArenaCellIterImpl::thing' was declared here
14:53.68 In file included from /opt/FirefoxSource/mozilla-release/js/src/gc/Barrier.h:12:0,
14:53.68                  from /opt/FirefoxSource/mozilla-release/js/src/jsatom.h:14,
14:53.68                  from /opt/FirefoxSource/mozilla-release/js/src/vm/Runtime.h:21,
14:53.68                  from /opt/FirefoxSource/mozilla-release/js/src/jscntxt.h:15,
14:53.68                  from /opt/FirefoxSource/mozilla-release/js/src/jit/Ion.h:12,
14:53.68                  from /opt/FirefoxSource/mozilla-release/js/src/jit/FixedList.h:12,
14:53.68                  from /opt/FirefoxSource/mozilla-release/js/src/jit/BaselineCompiler.h:10,
14:53.68                  from /opt/FirefoxSource/mozilla-release/js/src/jit/BaselineCompiler.cpp:7,
14:53.68                  from /opt/FirefoxSource/mozilla-release/objdir-droid/js/src/Unified_cpp_js_src3.cpp:2:
14:53.68 Warning: -Wmaybe-uninitialized in /opt/FirefoxSource/mozilla-release/js/src/gc/Heap.h: '*((void*)(& i)+12).js::gc::ArenaCellIterImpl::span.js::gc::FreeSpan::last' may be used uninitialized in this function
14:53.68 /opt/FirefoxSource/mozilla-release/js/src/gc/Heap.h:304:48: warning: '*((void*)(& i)+12).js::gc::ArenaCellIterImpl::span.js::gc::FreeSpan::last' may be used uninitialized in this function [-Wmaybe-uninitialized]
14:53.68 In file included from /opt/FirefoxSource/mozilla-release/objdir-droid/js/src/Unified_cpp_js_src3.cpp:56:0:
14:53.68 /opt/FirefoxSource/mozilla-release/js/src/jit/BaselineJIT.cpp:1093:31: note: '*((void*)(& i)+12).js::gc::ArenaCellIterImpl::span.js::gc::FreeSpan::last' was declared here
14:53.68 In file included from /opt/FirefoxSource/mozilla-release/js/src/vm/Shape-inl.h:22:0,
14:53.68                  from /opt/FirefoxSource/mozilla-release/js/src/jsscriptinlines.h:19,
14:53.68                  from /opt/FirefoxSource/mozilla-release/js/src/jit/BaselineCompiler.cpp:25,
14:53.68                  from /opt/FirefoxSource/mozilla-release/objdir-droid/js/src/Unified_cpp_js_src3.cpp:2:
14:53.68 Warning: -Wmaybe-uninitialized in /opt/FirefoxSource/mozilla-release/js/src/jsgcinlines.h: '*((void*)(& i)+12).js::gc::ArenaCellIterImpl::span.js::gc::FreeSpan::first' may be used uninitialized in this function
14:53.68 /opt/FirefoxSource/mozilla-release/js/src/jsgcinlines.h:134:9: warning: '*((void*)(& i)+12).js::gc::ArenaCellIterImpl::span.js::gc::FreeSpan::first' may be used uninitialized in this function [-Wmaybe-uninitialized]
14:53.68 In file included from /opt/FirefoxSource/mozilla-release/objdir-droid/js/src/Unified_cpp_js_src3.cpp:56:0:
14:53.68 /opt/FirefoxSource/mozilla-release/js/src/jit/BaselineJIT.cpp:1093:31: note: '*((void*)(& i)+12).js::gc::ArenaCellIterImpl::span.js::gc::FreeSpan::first' was declared here
14:53.85 Unified_cpp_js_src8.o
14:53.96 Unified_cpp_js_src9.o
15:04.07 In file included from /opt/FirefoxSource/mozilla-release/objdir-droid/js/src/Unified_cpp_js_src6.cpp:47:0:
15:04.07 /opt/FirefoxSource/mozilla-release/js/src/jit/arm/Assembler-arm.cpp: In static member function 'static void js::jit::Assembler::RetargetNearBranch(js::jit::Instruction*, int, bool)':
15:04.07 Warning: -Wmaybe-uninitialized in /opt/FirefoxSource/mozilla-release/js/src/jit/arm/Assembler-arm.cpp: 'c' may be used uninitialized in this function
15:04.07 /opt/FirefoxSource/mozilla-release/js/src/jit/arm/Assembler-arm.cpp:2632:44: warning: 'c' may be used uninitialized in this function [-Wmaybe-uninitialized]
15:04.07 In file included from /opt/FirefoxSource/mozilla-release/objdir-droid/js/src/Unified_cpp_js_src6.cpp:47:0:
15:04.07 /opt/FirefoxSource/mozilla-release/js/src/jit/arm/Assembler-arm.cpp: In function 'void js::jit::PatchJump(js::jit::CodeLocationJump&, js::jit::CodeLocationLabel)':
15:04.07 Warning: -Wmaybe-uninitialized in /opt/FirefoxSource/mozilla-release/js/src/jit/arm/Assembler-arm.cpp: 'c' may be used uninitialized in this function
15:04.07 /opt/FirefoxSource/mozilla-release/js/src/jit/arm/Assembler-arm.cpp:551:65: warning: 'c' may be used uninitialized in this function [-Wmaybe-uninitialized]
15:04.07 In file included from /opt/FirefoxSource/mozilla-release/objdir-droid/js/src/Unified_cpp_js_src6.cpp:47:0:
15:04.07 /opt/FirefoxSource/mozilla-release/js/src/jit/arm/Assembler-arm.cpp: In member function 'js::jit::Instruction* js::jit::Instruction::skipPool()':
15:04.07 Warning: -Wmaybe-uninitialized in /opt/FirefoxSource/mozilla-release/js/src/jit/arm/Assembler-arm.cpp: 'c' may be used uninitialized in this function
15:04.07 /opt/FirefoxSource/mozilla-release/js/src/jit/arm/Assembler-arm.cpp:2823:5: warning: 'c' may be used uninitialized in this function [-Wmaybe-uninitialized]
15:04.07 /opt/FirefoxSource/mozilla-release/js/src/jit/arm/Assembler-arm.cpp:2821:26: note: 'c' was declared here
15:04.07 Warning: -Wmaybe-uninitialized in /opt/FirefoxSource/mozilla-release/js/src/jit/arm/Assembler-arm.cpp: 'c' may be used uninitialized in this function
15:04.07 /opt/FirefoxSource/mozilla-release/js/src/jit/arm/Assembler-arm.cpp:2805:5: warning: 'c' may be used uninitialized in this function [-Wmaybe-uninitialized]
15:04.07 /opt/FirefoxSource/mozilla-release/js/src/jit/arm/Assembler-arm.cpp:2803:26: note: 'c' was declared here
15:04.07 /opt/FirefoxSource/mozilla-release/js/src/jit/arm/Assembler-arm.cpp: In member function 'js::jit::Instruction* js::jit::Instruction::next()':
15:04.07 Warning: -Wmaybe-uninitialized in /opt/FirefoxSource/mozilla-release/js/src/jit/arm/Assembler-arm.cpp: 'c' may be used uninitialized in this function
15:04.07 /opt/FirefoxSource/mozilla-release/js/src/jit/arm/Assembler-arm.cpp:2805:5: warning: 'c' may be used uninitialized in this function [-Wmaybe-uninitialized]
15:04.07 /opt/FirefoxSource/mozilla-release/js/src/jit/arm/Assembler-arm.cpp:2803:26: note: 'c' was declared here
15:04.07 Warning: -Wmaybe-uninitialized in /opt/FirefoxSource/mozilla-release/js/src/jit/arm/Assembler-arm.cpp: 'c' may be used uninitialized in this function
15:04.07 /opt/FirefoxSource/mozilla-release/js/src/jit/arm/Assembler-arm.cpp:2805:5: warning: 'c' may be used uninitialized in this function [-Wmaybe-uninitialized]
15:04.07 /opt/FirefoxSource/mozilla-release/js/src/jit/arm/Assembler-arm.cpp:2803:26: note: 'c' was declared here
15:04.07 In file included from /opt/FirefoxSource/mozilla-release/js/src/jit/arm/MacroAssembler-arm.h:14:0,
15:04.07                  from /opt/FirefoxSource/mozilla-release/js/src/jit/MacroAssembler.h:19,
15:04.07                  from /opt/FirefoxSource/mozilla-release/js/src/jit/MIR.h:23,
15:04.07                  from /opt/FirefoxSource/mozilla-release/js/src/jit/LIR.h:19,
15:04.07                  from /opt/FirefoxSource/mozilla-release/js/src/jit/Lowering.h:13,
15:04.07                  from /opt/FirefoxSource/mozilla-release/js/src/jit/TypePolicy.cpp:9,
15:04.07                  from /opt/FirefoxSource/mozilla-release/objdir-droid/js/src/Unified_cpp_js_src6.cpp:2:
15:04.07 /opt/FirefoxSource/mozilla-release/js/src/jit/arm/Assembler-arm.h: In member function 'void js::jit::Assembler::bind(js::jit::Label*, js::jit::BufferOffset)':
15:04.08 Warning: -Wmaybe-uninitialized in /opt/FirefoxSource/mozilla-release/js/src/jit/arm/Assembler-arm.h: 'c' may be used uninitialized in this function
15:04.08 /opt/FirefoxSource/mozilla-release/js/src/jit/arm/Assembler-arm.h:1832:85: warning: 'c' may be used uninitialized in this function [-Wmaybe-uninitialized]
15:04.08 In file included from /opt/FirefoxSource/mozilla-release/objdir-droid/js/src/Unified_cpp_js_src6.cpp:47:0:
15:04.08 /opt/FirefoxSource/mozilla-release/js/src/jit/arm/Assembler-arm.cpp:2496:23: note: 'c' was declared here
15:04.08 In file included from /opt/FirefoxSource/mozilla-release/js/src/jit/arm/MacroAssembler-arm.h:14:0,
15:04.08                  from /opt/FirefoxSource/mozilla-release/js/src/jit/MacroAssembler.h:19,
15:04.08                  from /opt/FirefoxSource/mozilla-release/js/src/jit/MIR.h:23,
15:04.08                  from /opt/FirefoxSource/mozilla-release/js/src/jit/LIR.h:19,
15:04.08                  from /opt/FirefoxSource/mozilla-release/js/src/jit/Lowering.h:13,
15:04.08                  from /opt/FirefoxSource/mozilla-release/js/src/jit/TypePolicy.cpp:9,
15:04.08                  from /opt/FirefoxSource/mozilla-release/objdir-droid/js/src/Unified_cpp_js_src6.cpp:2:
15:04.08 /opt/FirefoxSource/mozilla-release/js/src/jit/arm/Assembler-arm.h: In member function 'void js::jit::Assembler::retarget(js::jit::Label*, js::jit::Label*)':
15:04.08 Warning: -Wmaybe-uninitialized in /opt/FirefoxSource/mozilla-release/js/src/jit/arm/Assembler-arm.h: 'c' may be used uninitialized in this function
15:04.08 /opt/FirefoxSource/mozilla-release/js/src/jit/arm/Assembler-arm.h:1832:85: warning: 'c' may be used uninitialized in this function [-Wmaybe-uninitialized]
15:04.08 In file included from /opt/FirefoxSource/mozilla-release/objdir-droid/js/src/Unified_cpp_js_src6.cpp:47:0:
15:04.08 /opt/FirefoxSource/mozilla-release/js/src/jit/arm/Assembler-arm.cpp:2552:23: note: 'c' was declared here
15:04.08 In file included from /opt/FirefoxSource/mozilla-release/js/src/jit/arm/MacroAssembler-arm.h:14:0,
15:04.08                  from /opt/FirefoxSource/mozilla-release/js/src/jit/MacroAssembler.h:19,
15:04.08                  from /opt/FirefoxSource/mozilla-release/js/src/jit/MIR.h:23,
15:04.08                  from /opt/FirefoxSource/mozilla-release/js/src/jit/LIR.h:19,
15:04.08                  from /opt/FirefoxSource/mozilla-release/js/src/jit/Lowering.h:13,
15:04.08                  from /opt/FirefoxSource/mozilla-release/js/src/jit/TypePolicy.cpp:9,
15:04.08                  from /opt/FirefoxSource/mozilla-release/objdir-droid/js/src/Unified_cpp_js_src6.cpp:2:
15:04.08 /opt/FirefoxSource/mozilla-release/js/src/jit/arm/Assembler-arm.h: In member function 'void js::jit::AssemblerBufferWithConstantPools<SliceSize, InstSize, Inst, Asm>::executableCopy(uint8_t*) [with unsigned int SliceSize = 1024u; unsigned int InstSize = 4u; Inst = js::jit::Instruction; Asm = js::jit::Assembler; uint8_t = unsigned char]':
15:04.08 Warning: -Wmaybe-uninitialized in /opt/FirefoxSource/mozilla-release/js/src/jit/arm/Assembler-arm.h: 'c' may be used uninitialized in this function
15:04.08 /opt/FirefoxSource/mozilla-release/js/src/jit/arm/Assembler-arm.h:1832:85: warning: 'c' may be used uninitialized in this function [-Wmaybe-uninitialized]
15:04.08 In file included from /opt/FirefoxSource/mozilla-release/objdir-droid/js/src/Unified_cpp_js_src6.cpp:47:0:
15:04.08 /opt/FirefoxSource/mozilla-release/js/src/jit/arm/Assembler-arm.cpp:2630:26: note: 'c' was declared here
15:04.08 In file included from /opt/FirefoxSource/mozilla-release/js/src/jit/arm/MacroAssembler-arm.h:14:0,
15:04.08                  from /opt/FirefoxSource/mozilla-release/js/src/jit/MacroAssembler.h:19,
15:04.08                  from /opt/FirefoxSource/mozilla-release/js/src/jit/MIR.h:23,
15:04.08                  from /opt/FirefoxSource/mozilla-release/js/src/jit/LIR.h:19,
15:04.08                  from /opt/FirefoxSource/mozilla-release/js/src/jit/Lowering.h:13,
15:04.08                  from /opt/FirefoxSource/mozilla-release/js/src/jit/TypePolicy.cpp:9,
15:04.08                  from /opt/FirefoxSource/mozilla-release/objdir-droid/js/src/Unified_cpp_js_src6.cpp:2:
15:04.08 /opt/FirefoxSource/mozilla-release/js/src/jit/arm/Assembler-arm.h: In member function 'void js::jit::Assembler::bind(js::jit::RepatchLabel*)':
15:04.08 Warning: -Wmaybe-uninitialized in /opt/FirefoxSource/mozilla-release/js/src/jit/arm/Assembler-arm.h: 'cond' may be used uninitialized in this function
15:04.08 /opt/FirefoxSource/mozilla-release/js/src/jit/arm/Assembler-arm.h:1832:85: warning: 'cond' may be used uninitialized in this function [-Wmaybe-uninitialized]
15:04.08 In file included from /opt/FirefoxSource/mozilla-release/objdir-droid/js/src/Unified_cpp_js_src6.cpp:47:0:
15:04.08 /opt/FirefoxSource/mozilla-release/js/src/jit/arm/Assembler-arm.cpp:2523:19: note: 'cond' was declared here
15:31.48 In file included from /opt/FirefoxSource/mozilla-release/js/src/vm/Stack.h:17:0,
15:31.48                  from /opt/FirefoxSource/mozilla-release/js/src/vm/Runtime.h:43,
15:31.48                  from /opt/FirefoxSource/mozilla-release/js/src/builtin/MapObject.h:12,
15:31.48                  from /opt/FirefoxSource/mozilla-release/js/src/jsobjinlines.h:12,
15:31.48                  from /opt/FirefoxSource/mozilla-release/js/src/proxy/ScriptedDirectProxyHandler.cpp:13,
15:31.48                  from /opt/FirefoxSource/mozilla-release/objdir-droid/js/src/Unified_cpp_js_src9.cpp:2:
15:31.48 /opt/FirefoxSource/mozilla-release/js/src/jit/JitFrameIterator.h: In member function 'void js::jit::JitFrameIterator::unaliasedForEachActual(Op, js::jit::ReadFrameArgsBehavior) const [with Op = js::CopyToHeap]':
15:31.48 Warning: -Wmaybe-uninitialized in /opt/FirefoxSource/mozilla-release/js/src/jit/JitFrameIterator.h: 'end' may be used uninitialized in this function
15:31.48 /opt/FirefoxSource/mozilla-release/js/src/jit/JitFrameIterator.h:255:9: warning: 'end' may be used uninitialized in this function [-Wmaybe-uninitialized]
15:31.48 Warning: -Wmaybe-uninitialized in /opt/FirefoxSource/mozilla-release/js/src/jit/JitFrameIterator.h: 'start' may be used uninitialized in this function
15:31.48 /opt/FirefoxSource/mozilla-release/js/src/jit/JitFrameIterator.h:235:10: warning: 'start' may be used uninitialized in this function [-Wmaybe-uninitialized]
15:33.54 In file included from /opt/FirefoxSource/mozilla-release/js/src/vm/Shape-inl.h:22:0,
15:33.54                  from /opt/FirefoxSource/mozilla-release/js/src/jsscriptinlines.h:19,
15:33.54                  from /opt/FirefoxSource/mozilla-release/js/src/jsapi.cpp:91,
15:33.54                  from /opt/FirefoxSource/mozilla-release/objdir-droid/js/src/Unified_cpp_js_src7.cpp:20:
15:33.54 /opt/FirefoxSource/mozilla-release/js/src/jsgcinlines.h: In member function 'void js::gc::GCRuntime::sweepTypesAfterCompacting(JS::Zone*)':
15:33.54 Warning: -Wmaybe-uninitialized in /opt/FirefoxSource/mozilla-release/js/src/jsgcinlines.h: '*((void*)(& i)+12).js::gc::ArenaCellIterImpl::thing' may be used uninitialized in this function
15:33.54 /opt/FirefoxSource/mozilla-release/js/src/jsgcinlines.h:193:27: warning: '*((void*)(& i)+12).js::gc::ArenaCellIterImpl::thing' may be used uninitialized in this function [-Wmaybe-uninitialized]
15:33.54 In file included from /opt/FirefoxSource/mozilla-release/objdir-droid/js/src/Unified_cpp_js_src7.cpp:101:0:
15:33.54 /opt/FirefoxSource/mozilla-release/js/src/jsgc.cpp:2230:30: note: '*((void*)(& i)+12).js::gc::ArenaCellIterImpl::thing' was declared here
15:33.54 In file included from /opt/FirefoxSource/mozilla-release/js/src/gc/Barrier.h:12:0,
15:33.54                  from /opt/FirefoxSource/mozilla-release/js/src/jsobj.h:21,
15:33.54                  from /opt/FirefoxSource/mozilla-release/js/src/jsfun.h:14,
15:33.54                  from /opt/FirefoxSource/mozilla-release/js/src/jit/JitFrameIterator.h:10,
15:33.54                  from /opt/FirefoxSource/mozilla-release/js/src/jit/Bailouts.h:12,
15:33.54                  from /opt/FirefoxSource/mozilla-release/js/src/jit/LIR.h:15,
15:33.54                  from /opt/FirefoxSource/mozilla-release/js/src/jit/shared/Lowering-shared.h:13,
15:33.54                  from /opt/FirefoxSource/mozilla-release/js/src/jit/shared/Lowering-shared-inl.h:10,
15:33.54                  from /opt/FirefoxSource/mozilla-release/js/src/jit/shared/Lowering-shared.cpp:7,
15:33.54                  from /opt/FirefoxSource/mozilla-release/objdir-droid/js/src/Unified_cpp_js_src7.cpp:2:
15:33.54 Warning: -Wmaybe-uninitialized in /opt/FirefoxSource/mozilla-release/js/src/gc/Heap.h: '*((void*)(& i)+12).js::gc::ArenaCellIterImpl::span.js::gc::FreeSpan::last' may be used uninitialized in this function
15:33.54 /opt/FirefoxSource/mozilla-release/js/src/gc/Heap.h:304:48: warning: '*((void*)(& i)+12).js::gc::ArenaCellIterImpl::span.js::gc::FreeSpan::last' may be used uninitialized in this function [-Wmaybe-uninitialized]
15:33.54 In file included from /opt/FirefoxSource/mozilla-release/objdir-droid/js/src/Unified_cpp_js_src7.cpp:101:0:
15:33.54 /opt/FirefoxSource/mozilla-release/js/src/jsgc.cpp:2230:30: note: '*((void*)(& i)+12).js::gc::ArenaCellIterImpl::span.js::gc::FreeSpan::last' was declared here
15:33.54 In file included from /opt/FirefoxSource/mozilla-release/js/src/vm/Shape-inl.h:22:0,
15:33.54                  from /opt/FirefoxSource/mozilla-release/js/src/jsscriptinlines.h:19,
15:33.54                  from /opt/FirefoxSource/mozilla-release/js/src/jsapi.cpp:91,
15:33.54                  from /opt/FirefoxSource/mozilla-release/objdir-droid/js/src/Unified_cpp_js_src7.cpp:20:
15:33.54 Warning: -Wmaybe-uninitialized in /opt/FirefoxSource/mozilla-release/js/src/jsgcinlines.h: '*((void*)(& i)+12).js::gc::ArenaCellIterImpl::span.js::gc::FreeSpan::first' may be used uninitialized in this function
15:33.54 /opt/FirefoxSource/mozilla-release/js/src/jsgcinlines.h:134:9: warning: '*((void*)(& i)+12).js::gc::ArenaCellIterImpl::span.js::gc::FreeSpan::first' may be used uninitialized in this function [-Wmaybe-uninitialized]
15:33.54 In file included from /opt/FirefoxSource/mozilla-release/objdir-droid/js/src/Unified_cpp_js_src7.cpp:101:0:
15:33.54 /opt/FirefoxSource/mozilla-release/js/src/jsgc.cpp:2230:30: note: '*((void*)(& i)+12).js::gc::ArenaCellIterImpl::span.js::gc::FreeSpan::first' was declared here
15:33.54 In file included from /opt/FirefoxSource/mozilla-release/js/src/vm/Shape-inl.h:22:0,
15:33.55                  from /opt/FirefoxSource/mozilla-release/js/src/jsscriptinlines.h:19,
15:33.55                  from /opt/FirefoxSource/mozilla-release/js/src/jsapi.cpp:91,
15:33.55                  from /opt/FirefoxSource/mozilla-release/objdir-droid/js/src/Unified_cpp_js_src7.cpp:20:
15:33.55 Warning: -Wmaybe-uninitialized in /opt/FirefoxSource/mozilla-release/js/src/jsgcinlines.h: '*((void*)(& i)+12).js::gc::ArenaCellIterImpl::thing' may be used uninitialized in this function
15:33.55 /opt/FirefoxSource/mozilla-release/js/src/jsgcinlines.h:193:27: warning: '*((void*)(& i)+12).js::gc::ArenaCellIterImpl::thing' may be used uninitialized in this function [-Wmaybe-uninitialized]
15:33.55 In file included from /opt/FirefoxSource/mozilla-release/objdir-droid/js/src/Unified_cpp_js_src7.cpp:101:0:
15:33.55 /opt/FirefoxSource/mozilla-release/js/src/jsgc.cpp:2225:30: note: '*((void*)(& i)+12).js::gc::ArenaCellIterImpl::thing' was declared here
15:33.55 In file included from /opt/FirefoxSource/mozilla-release/js/src/gc/Barrier.h:12:0,
15:33.55                  from /opt/FirefoxSource/mozilla-release/js/src/jsobj.h:21,
15:33.55                  from /opt/FirefoxSource/mozilla-release/js/src/jsfun.h:14,
15:33.55                  from /opt/FirefoxSource/mozilla-release/js/src/jit/JitFrameIterator.h:10,
15:33.55                  from /opt/FirefoxSource/mozilla-release/js/src/jit/Bailouts.h:12,
15:33.55                  from /opt/FirefoxSource/mozilla-release/js/src/jit/LIR.h:15,
15:33.55                  from /opt/FirefoxSource/mozilla-release/js/src/jit/shared/Lowering-shared.h:13,
15:33.55                  from /opt/FirefoxSource/mozilla-release/js/src/jit/shared/Lowering-shared-inl.h:10,
15:33.55                  from /opt/FirefoxSource/mozilla-release/js/src/jit/shared/Lowering-shared.cpp:7,
15:33.55                  from /opt/FirefoxSource/mozilla-release/objdir-droid/js/src/Unified_cpp_js_src7.cpp:2:
15:33.55 Warning: -Wmaybe-uninitialized in /opt/FirefoxSource/mozilla-release/js/src/gc/Heap.h: '*((void*)(& i)+12).js::gc::ArenaCellIterImpl::span.js::gc::FreeSpan::last' may be used uninitialized in this function
15:33.55 /opt/FirefoxSource/mozilla-release/js/src/gc/Heap.h:304:48: warning: '*((void*)(& i)+12).js::gc::ArenaCellIterImpl::span.js::gc::FreeSpan::last' may be used uninitialized in this function [-Wmaybe-uninitialized]
15:33.55 In file included from /opt/FirefoxSource/mozilla-release/objdir-droid/js/src/Unified_cpp_js_src7.cpp:101:0:
15:33.55 /opt/FirefoxSource/mozilla-release/js/src/jsgc.cpp:2225:30: note: '*((void*)(& i)+12).js::gc::ArenaCellIterImpl::span.js::gc::FreeSpan::last' was declared here
15:33.55 In file included from /opt/FirefoxSource/mozilla-release/js/src/vm/Shape-inl.h:22:0,
15:33.55                  from /opt/FirefoxSource/mozilla-release/js/src/jsscriptinlines.h:19,
15:33.55                  from /opt/FirefoxSource/mozilla-release/js/src/jsapi.cpp:91,
15:33.55                  from /opt/FirefoxSource/mozilla-release/objdir-droid/js/src/Unified_cpp_js_src7.cpp:20:
15:33.55 Warning: -Wmaybe-uninitialized in /opt/FirefoxSource/mozilla-release/js/src/jsgcinlines.h: '*((void*)(& i)+12).js::gc::ArenaCellIterImpl::span.js::gc::FreeSpan::first' may be used uninitialized in this function
15:33.55 /opt/FirefoxSource/mozilla-release/js/src/jsgcinlines.h:134:9: warning: '*((void*)(& i)+12).js::gc::ArenaCellIterImpl::span.js::gc::FreeSpan::first' may be used uninitialized in this function [-Wmaybe-uninitialized]
15:33.55 In file included from /opt/FirefoxSource/mozilla-release/objdir-droid/js/src/Unified_cpp_js_src7.cpp:101:0:
15:33.55 /opt/FirefoxSource/mozilla-release/js/src/jsgc.cpp:2225:30: note: '*((void*)(& i)+12).js::gc::ArenaCellIterImpl::span.js::gc::FreeSpan::first' was declared here
15:33.55 In file included from /opt/FirefoxSource/mozilla-release/js/src/vm/Shape-inl.h:22:0,
15:33.55                  from /opt/FirefoxSource/mozilla-release/js/src/jsscriptinlines.h:19,
15:33.55                  from /opt/FirefoxSource/mozilla-release/js/src/jsapi.cpp:91,
15:33.55                  from /opt/FirefoxSource/mozilla-release/objdir-droid/js/src/Unified_cpp_js_src7.cpp:20:
15:33.55 /opt/FirefoxSource/mozilla-release/js/src/jsgcinlines.h: In function 'void js::ReleaseAllJITCode(js::FreeOp*)':
15:33.55 Warning: -Wmaybe-uninitialized in /opt/FirefoxSource/mozilla-release/js/src/jsgcinlines.h: '*((void*)(& i)+12).js::gc::ArenaCellIterImpl::thing' may be used uninitialized in this function
15:33.55 /opt/FirefoxSource/mozilla-release/js/src/jsgcinlines.h:193:27: warning: '*((void*)(& i)+12).js::gc::ArenaCellIterImpl::thing' may be used uninitialized in this function [-Wmaybe-uninitialized]
15:33.55 In file included from /opt/FirefoxSource/mozilla-release/objdir-droid/js/src/Unified_cpp_js_src7.cpp:101:0:
15:33.55 /opt/FirefoxSource/mozilla-release/js/src/jsgc.cpp:6724:27: note: '*((void*)(& i)+12).js::gc::ArenaCellIterImpl::thing' was declared here
15:33.55 In file included from /opt/FirefoxSource/mozilla-release/js/src/gc/Barrier.h:12:0,
15:33.55                  from /opt/FirefoxSource/mozilla-release/js/src/jsobj.h:21,
15:33.55                  from /opt/FirefoxSource/mozilla-release/js/src/jsfun.h:14,
15:33.55                  from /opt/FirefoxSource/mozilla-release/js/src/jit/JitFrameIterator.h:10,
15:33.55                  from /opt/FirefoxSource/mozilla-release/js/src/jit/Bailouts.h:12,
15:33.55                  from /opt/FirefoxSource/mozilla-release/js/src/jit/LIR.h:15,
15:33.55                  from /opt/FirefoxSource/mozilla-release/js/src/jit/shared/Lowering-shared.h:13,
15:33.55                  from /opt/FirefoxSource/mozilla-release/js/src/jit/shared/Lowering-shared-inl.h:10,
15:33.55                  from /opt/FirefoxSource/mozilla-release/js/src/jit/shared/Lowering-shared.cpp:7,
15:33.55                  from /opt/FirefoxSource/mozilla-release/objdir-droid/js/src/Unified_cpp_js_src7.cpp:2:
15:33.55 Warning: -Wmaybe-uninitialized in /opt/FirefoxSource/mozilla-release/js/src/gc/Heap.h: '*((void*)(& i)+12).js::gc::ArenaCellIterImpl::span.js::gc::FreeSpan::last' may be used uninitialized in this function
15:33.55 /opt/FirefoxSource/mozilla-release/js/src/gc/Heap.h:304:48: warning: '*((void*)(& i)+12).js::gc::ArenaCellIterImpl::span.js::gc::FreeSpan::last' may be used uninitialized in this function [-Wmaybe-uninitialized]
15:33.55 In file included from /opt/FirefoxSource/mozilla-release/objdir-droid/js/src/Unified_cpp_js_src7.cpp:101:0:
15:33.55 /opt/FirefoxSource/mozilla-release/js/src/jsgc.cpp:6724:27: note: '*((void*)(& i)+12).js::gc::ArenaCellIterImpl::span.js::gc::FreeSpan::last' was declared here
15:33.55 In file included from /opt/FirefoxSource/mozilla-release/js/src/vm/Shape-inl.h:22:0,
15:33.55                  from /opt/FirefoxSource/mozilla-release/js/src/jsscriptinlines.h:19,
15:33.55                  from /opt/FirefoxSource/mozilla-release/js/src/jsapi.cpp:91,
15:33.55                  from /opt/FirefoxSource/mozilla-release/objdir-droid/js/src/Unified_cpp_js_src7.cpp:20:
15:33.55 Warning: -Wmaybe-uninitialized in /opt/FirefoxSource/mozilla-release/js/src/jsgcinlines.h: '*((void*)(& i)+12).js::gc::ArenaCellIterImpl::span.js::gc::FreeSpan::first' may be used uninitialized in this function
15:33.55 /opt/FirefoxSource/mozilla-release/js/src/jsgcinlines.h:134:9: warning: '*((void*)(& i)+12).js::gc::ArenaCellIterImpl::span.js::gc::FreeSpan::first' may be used uninitialized in this function [-Wmaybe-uninitialized]
15:33.55 In file included from /opt/FirefoxSource/mozilla-release/objdir-droid/js/src/Unified_cpp_js_src7.cpp:101:0:
15:33.55 /opt/FirefoxSource/mozilla-release/js/src/jsgc.cpp:6724:27: note: '*((void*)(& i)+12).js::gc::ArenaCellIterImpl::span.js::gc::FreeSpan::first' was declared here
15:33.55 In file included from /opt/FirefoxSource/mozilla-release/js/src/vm/Shape-inl.h:22:0,
15:33.55                  from /opt/FirefoxSource/mozilla-release/js/src/jsscriptinlines.h:19,
15:33.55                  from /opt/FirefoxSource/mozilla-release/js/src/jsapi.cpp:91,
15:33.55                  from /opt/FirefoxSource/mozilla-release/objdir-droid/js/src/Unified_cpp_js_src7.cpp:20:
15:33.56 /opt/FirefoxSource/mozilla-release/js/src/jsgcinlines.h: In function 'void js::PurgeJITCaches(JS::Zone*)':
15:33.56 Warning: -Wmaybe-uninitialized in /opt/FirefoxSource/mozilla-release/js/src/jsgcinlines.h: '*((void*)(& i)+12).js::gc::ArenaCellIterImpl::thing' may be used uninitialized in this function
15:33.56 /opt/FirefoxSource/mozilla-release/js/src/jsgcinlines.h:193:27: warning: '*((void*)(& i)+12).js::gc::ArenaCellIterImpl::thing' may be used uninitialized in this function [-Wmaybe-uninitialized]
15:33.56 In file included from /opt/FirefoxSource/mozilla-release/objdir-droid/js/src/Unified_cpp_js_src7.cpp:101:0:
15:33.56 /opt/FirefoxSource/mozilla-release/js/src/jsgc.cpp:6742:30: note: '*((void*)(& i)+12).js::gc::ArenaCellIterImpl::thing' was declared here
15:33.56 In file included from /opt/FirefoxSource/mozilla-release/js/src/gc/Barrier.h:12:0,
15:33.56                  from /opt/FirefoxSource/mozilla-release/js/src/jsobj.h:21,
15:33.56                  from /opt/FirefoxSource/mozilla-release/js/src/jsfun.h:14,
15:33.56                  from /opt/FirefoxSource/mozilla-release/js/src/jit/JitFrameIterator.h:10,
15:33.56                  from /opt/FirefoxSource/mozilla-release/js/src/jit/Bailouts.h:12,
15:33.56                  from /opt/FirefoxSource/mozilla-release/js/src/jit/LIR.h:15,
15:33.56                  from /opt/FirefoxSource/mozilla-release/js/src/jit/shared/Lowering-shared.h:13,
15:33.56                  from /opt/FirefoxSource/mozilla-release/js/src/jit/shared/Lowering-shared-inl.h:10,
15:33.56                  from /opt/FirefoxSource/mozilla-release/js/src/jit/shared/Lowering-shared.cpp:7,
15:33.56                  from /opt/FirefoxSource/mozilla-release/objdir-droid/js/src/Unified_cpp_js_src7.cpp:2:
15:33.56 Warning: -Wmaybe-uninitialized in /opt/FirefoxSource/mozilla-release/js/src/gc/Heap.h: '*((void*)(& i)+12).js::gc::ArenaCellIterImpl::span.js::gc::FreeSpan::last' may be used uninitialized in this function
15:33.56 /opt/FirefoxSource/mozilla-release/js/src/gc/Heap.h:304:48: warning: '*((void*)(& i)+12).js::gc::ArenaCellIterImpl::span.js::gc::FreeSpan::last' may be used uninitialized in this function [-Wmaybe-uninitialized]
15:33.56 In file included from /opt/FirefoxSource/mozilla-release/objdir-droid/js/src/Unified_cpp_js_src7.cpp:101:0:
15:33.56 /opt/FirefoxSource/mozilla-release/js/src/jsgc.cpp:6742:30: note: '*((void*)(& i)+12).js::gc::ArenaCellIterImpl::span.js::gc::FreeSpan::last' was declared here
15:33.56 In file included from /opt/FirefoxSource/mozilla-release/js/src/vm/Shape-inl.h:22:0,
15:33.56                  from /opt/FirefoxSource/mozilla-release/js/src/jsscriptinlines.h:19,
15:33.56                  from /opt/FirefoxSource/mozilla-release/js/src/jsapi.cpp:91,
15:33.56                  from /opt/FirefoxSource/mozilla-release/objdir-droid/js/src/Unified_cpp_js_src7.cpp:20:
15:33.56 Warning: -Wmaybe-uninitialized in /opt/FirefoxSource/mozilla-release/js/src/jsgcinlines.h: '*((void*)(& i)+12).js::gc::ArenaCellIterImpl::span.js::gc::FreeSpan::first' may be used uninitialized in this function
15:33.56 /opt/FirefoxSource/mozilla-release/js/src/jsgcinlines.h:134:9: warning: '*((void*)(& i)+12).js::gc::ArenaCellIterImpl::span.js::gc::FreeSpan::first' may be used uninitialized in this function [-Wmaybe-uninitialized]
15:33.56 In file included from /opt/FirefoxSource/mozilla-release/objdir-droid/js/src/Unified_cpp_js_src7.cpp:101:0:
15:33.56 /opt/FirefoxSource/mozilla-release/js/src/jsgc.cpp:6742:30: note: '*((void*)(& i)+12).js::gc::ArenaCellIterImpl::span.js::gc::FreeSpan::first' was declared here
15:33.56 In file included from /opt/FirefoxSource/mozilla-release/js/src/jit/Bailouts.h:12:0,
15:33.56                  from /opt/FirefoxSource/mozilla-release/js/src/jit/LIR.h:15,
15:33.56                  from /opt/FirefoxSource/mozilla-release/js/src/jit/shared/Lowering-shared.h:13,
15:33.56                  from /opt/FirefoxSource/mozilla-release/js/src/jit/shared/Lowering-shared-inl.h:10,
15:33.56                  from /opt/FirefoxSource/mozilla-release/js/src/jit/shared/Lowering-shared.cpp:7,
15:33.56                  from /opt/FirefoxSource/mozilla-release/objdir-droid/js/src/Unified_cpp_js_src7.cpp:2:
15:33.56 /opt/FirefoxSource/mozilla-release/js/src/jit/JitFrameIterator.h: In member function 'void js::jit::JitFrameIterator::unaliasedForEachActual(Op, js::jit::ReadFrameArgsBehavior) const [with Op = js::CopyTo]':
15:33.56 Warning: -Wmaybe-uninitialized in /opt/FirefoxSource/mozilla-release/js/src/jit/JitFrameIterator.h: 'end' may be used uninitialized in this function
15:33.56 /opt/FirefoxSource/mozilla-release/js/src/jit/JitFrameIterator.h:235:10: warning: 'end' may be used uninitialized in this function [-Wmaybe-uninitialized]
15:33.56 Warning: -Wmaybe-uninitialized in /opt/FirefoxSource/mozilla-release/js/src/jit/JitFrameIterator.h: 'start' may be used uninitialized in this function
15:33.56 /opt/FirefoxSource/mozilla-release/js/src/jit/JitFrameIterator.h:235:10: warning: 'start' may be used uninitialized in this function [-Wmaybe-uninitialized]
15:33.66 libjs_static.a
15:35.68 Unified_cpp_js_src_shell0.oUnified_cpp_js_src_gdb0.oUnified_cpp_js_src_jsapi-tests0.o
15:35.68 
15:35.68 
15:35.68 Unified_cpp_js_src_jsapi-tests1.o
15:35.68 StaticXULComponentsStart.o
15:35.91 libxul_s.a.desc
15:35.91 libxul.so
15:38.29 gdb-tests
15:41.38 Unified_cpp_js_src_jsapi-tests2.o
15:43.32 Unified_cpp_js_src_jsapi-tests3.o
15:45.30 js
15:46.92 Unified_cpp_js_src_jsapi-tests4.o
15:47.09 Unified_cpp_js_src_jsapi-tests5.o
15:58.95 jsapi-tests
17:29.66 TestComponent.o
17:29.66 TestAudioEventTimeline.o
17:29.66 triplescat.o
17:29.66 PropertiesTest.o
17:29.66 ReadNTLM.o
17:29.97 libtest656331.so
17:30.10 TestComponent.o
17:30.31 libtestcomponent.so
17:30.34 triplescat
17:30.48 test_tone.o
17:30.93 TestCSPParser.o
17:30.93 TestGetURL.o
17:30.95 test_tone
17:31.07 TestTXMgr.o
17:31.19 TestBlockingSocket.o
17:31.62 TestCallbacks.o
17:31.67 TestAudioEventTimeline
17:31.86 rdfpoll.o
17:32.44 TestNativeXMLHttpRequest.o
17:32.50 rdfpoll
17:32.64 test_AsXXX_helpers.o
17:32.64 test_async_callbacks_with_spun_event_loops.o
17:33.01 TestDNS.o
17:33.10 TestPlainTextSerializer.o
17:33.16 TestTXMgr
17:33.25 test_asyncStatementExecution_transaction.o
17:33.60 TestComponent.o
17:33.78 libtestcompnoaslr.so
17:33.85 test_binding_params.o
17:34.08 TestAudioChannelService.o
17:34.30 TestIncrementalDownload.o
17:34.31 TestCSPParser
17:34.31 TestGetURL
17:34.41 TestNativeXMLHttpRequest
17:34.49 TestPlainTextSerializer
17:34.67 xpcshell.o
17:34.73 TestOpen.o
17:34.86 test_file_perms.o
17:34.86 xpcshell
17:34.95 Unified_cpp_components_native0.o
17:35.39 TestAudioChannelService
17:35.47 test_mutex.o
17:35.74 libxpctest.so
17:36.09 TestLineBreak.o
17:36.19 test_service_init_background_thread.o
17:36.21 Unified_cpp_xpcom_sample0.o
17:36.32 TestProtocols.o
17:36.71 libxpcomsample.so
17:36.91 test_statement_scoper.o
17:36.96 TestAppShellSteadyState.o
17:37.01 TestLineBreak
17:37.09 TestServ.o
17:37.54 TestStandardURL.o
17:37.66 test_StatementCache.o
17:38.43 test_transaction_helper.o
17:38.70 TestStreamLoader.o
17:38.85 TestUpload.o
17:39.15 TestAppShellSteadyState
17:39.19 Unified_cpp_streamconv_test0.o
17:39.28 nsIFileEnumerator.o
17:39.29 TestArguments.o
17:39.53 test_true_async.o
17:39.61 TestBlockingProcess.o
17:39.69 TestCallTemplates.o
17:39.72 TestINIParser.o
17:39.81 TestStreamConv
17:39.89 test_unlock_notify.o
17:39.95 TestPRIntN.o
17:40.09 TestURLParser.o
17:40.36 TestQuickReturn.o
17:40.40 TestRacingServiceManager.o
17:40.44 TestRegistrationOrder.o
17:40.76 test_AsXXX_helpers
17:40.76 test_async_callbacks_with_spun_event_loops
17:40.85 test_asyncStatementExecution_transaction
17:41.08 TestThreadPoolListener.o
17:41.15 TestStartupCache.o
17:41.41 test_binding_params
17:41.41 urltest.o
17:41.51 test_file_perms
17:41.61 test_mutex
17:41.65 TestTimers.o
17:41.68 test_service_init_background_thread
17:41.76 test_statement_scoper
17:41.77 TestBind.o
17:41.84 test_StatementCache
17:41.92 test_transaction_helper
17:41.99 test_true_async
17:42.05 TestStartupCache
17:42.11 test_unlock_notify
17:42.13 TestCookie.o
17:42.29 TestUnicodeArguments.o
17:42.30 ShowAlignments.o
17:42.34 TestAutoPtr.o
17:42.36 TestAutoRef.o
17:42.45 TestSTSParser.o
17:42.83 TestUDPSocket.o
17:42.90 TestCOMArray.o
17:42.95 TestWebGLElementArrayCache.o
17:43.36 TestCOMPtr.o
17:44.03 TestCOMPtrEq.o
17:44.31 TestWebGLElementArrayCache
17:44.36 PropertiesTest
17:44.36 TestDeque.o
17:44.44 TestFile.o
17:44.47 TestMinStringAPI.o
17:44.54 TestHashtables.o
17:45.08 TestID.o
17:45.11 TestMinStringAPI
17:45.23 rdfcat.o
17:45.25 ReadNTLM
17:45.31 TestNsRefPtr.o
17:45.33 TestBlockingSocket
17:45.39 TestCallbacks
17:45.40 TestDNS
17:45.46 TestIncrementalDownload
17:45.48 TestOpen
17:45.54 TestProtocols
17:45.55 TestServ
17:45.62 TestStandardURL
17:45.63 TestStreamLoader
17:45.65 rdfcat
17:45.70 TestUpload
17:45.76 TestCertDB.o
17:45.78 NormalizationTest.o
17:45.78 UnicharSelfTest.o
17:45.78 TestURLParser
17:45.86 urltest
17:45.94 TestBind
17:45.95 TestCertDB
17:46.02 TestCookie
17:46.09 TestObserverArray.o
17:46.24 TestSTSParser
17:46.40 TestAudioBuffers.o
17:46.40 TestAudioMixer.o
17:46.44 TestUDPSocket
17:46.61 TestObserverService.o
17:46.77 TestPipe.o
17:47.15 TestPLDHash.o
17:47.28 NormalizationTest
17:47.28 UnicharSelfTest
17:47.31 TestAudioBuffers
17:47.31 TestAudioMixer
17:47.46 TestStringAPI.o
17:47.46 TestTArray.o
17:47.58 TestTextFormatter.o
17:47.63 TestThreadUtils.o
17:47.67 TestJemalloc.o
17:47.95 nsIFileEnumerator
17:47.95 TestArguments
17:48.05 TestBlockingProcess
17:48.11 TestCallTemplates
17:48.17 TestINIParser
17:48.25 TestPRIntN
17:48.33 TestQuickReturn
17:48.39 TestRacingServiceManager
17:48.43 TestRegistrationOrder
17:48.43 TestThreadPoolListener
17:48.46 TestTimers
17:48.51 TestUnicodeArguments
17:48.51 ShowAlignments
17:48.53 TestAutoPtr
17:48.57 TestAutoRef
17:48.59 TestCOMArray
17:48.60 TestCOMPtr
17:48.64 TestCOMPtrEq
17:48.67 TestDeque
17:48.68 TestFile
17:48.72 TestHashtables
17:48.76 TestID
17:48.80 TestNsRefPtr
17:48.82 TestObserverArray
17:48.84 TestObserverService
17:48.87 TestPipe
17:48.89 TestPLDHash
17:48.92 TestStringAPI
17:48.95 TestTextFormatter
17:48.97 TestThreadUtils
17:49.01 TestJemalloc
17:51.29 TestTArray
17:55.04 /opt/FirefoxSource/mozilla-release/toolkit/modules/GMPUtils.jsm: WARNING: no preprocessor directives found
17:56.15 /opt/FirefoxSource/mozilla-release/config/rules.mk:1512: warning: overriding recipe for target '../../../dist/bin/modules/LoginManagerParent.jsm'
17:56.15 /opt/FirefoxSource/mozilla-release/config/rules.mk:1447: warning: ignoring old recipe for target '../../../dist/bin/modules/LoginManagerParent.jsm'
17:57.58 Exporting extension to source/test/addons/packed.xpi.
17:57.63 Exporting extension to source/test/addons/simple-prefs.xpi.
17:57.69 Exporting extension to source/test/addons/l10n.xpi.
17:58.26 Exporting extension to source/test/addons/require.xpi.
17:58.49 Exporting extension to source/test/addons/child_process.xpi.
17:58.51 Exporting extension to source/test/addons/e10s.xpi.
17:58.64 Exporting extension to source/test/addons/addon-manager.xpi.
17:58.67 Exporting extension to source/test/addons/unpacked.xpi.
17:58.86 Exporting extension to source/test/addons/unsafe-content-script.xpi.
17:58.91 Exporting extension to source/test/addons/standard-id.xpi.
17:59.00 Exporting extension to source/test/addons/page-mod-debugger-pre.xpi.
17:59.13 Exporting extension to source/test/addons/translators.xpi.
17:59.18 /opt/FirefoxSource/mozilla-release/addon-sdk/source/python-lib/cuddlefish/xpi.py:22: UserWarning: Duplicate name: 'locale/'
17:59.18   zf.writestr(dirinfo, "")
17:59.18 Exporting extension to source/test/addons/l10n-properties.xpi.
17:59.29 Exporting extension to source/test/addons/places.xpi.
17:59.32 Exporting extension to source/test/addons/main.xpi.
17:59.37 Exporting extension to source/test/addons/content-permissions.xpi.
17:59.37 Exporting extension to source/test/addons/name-in-numbers.xpi.
17:59.48 Exporting extension to source/test/addons/self.xpi.
17:59.50 Exporting extension to source/test/addons/preferences-branch.xpi.
17:59.63 Exporting extension to source/test/addons/tab-close-on-startup.xpi.
17:59.67 Exporting extension to source/test/addons/curly-id.xpi.
17:59.68 Exporting extension to source/test/addons/e10s-tabs.xpi.
17:59.81 Exporting extension to source/test/addons/packaging.xpi.
17:59.85 Exporting extension to source/test/addons/contributors.xpi.
17:59.87 Exporting extension to source/test/addons/predefined-id-with-at.xpi.
17:59.89 Exporting extension to source/test/addons/private-browsing-supported.xpi.
17:59.92 Warning: missing module: ./toolkit-require-reload-child
17:60.00 Exporting extension to source/test/addons/name-in-numbers-plus.xpi.
18:00.14 Exporting extension to source/test/addons/toolkit-require-reload.xpi.
18:00.18 Exporting extension to source/test/addons/author-email.xpi.
18:00.20 Exporting extension to source/test/addons/symbiont.xpi.
18:00.45 Exporting extension to source/test/addons/e10s-content.xpi.
18:00.45 Exporting extension to source/test/addons/page-mod-debugger-post.xpi.
18:00.50 Exporting extension to source/test/addons/simple-prefs-regression.xpi.
18:00.55 Exporting extension to source/test/addons/chrome.xpi.
18:00.63 Exporting extension to source/test/addons/developers.xpi.
18:00.74 Exporting extension to source/test/addons/simple-prefs-l10n.xpi.
18:01.08 Exporting extension to source/test/addons/layout-change.xpi.
18:03.51 /opt/FirefoxSource/mozilla-release/netwerk/base/security-prefs.js: WARNING: no preprocessor directives found
18:08.93   adding: install.rdf (deflated 52%)
18:09.15   adding: plugins/libnptest.so (deflated 64%)
18:09.36   adding: plugins/libnpsecondtest.so (deflated 64%)
18:12.75 /opt/FirefoxSource/mozilla-release/config/rules.mk:1512: warning: overriding recipe for target '../../../dist/bin/modules/LoginManagerParent.jsm'
18:12.75 /opt/FirefoxSource/mozilla-release/config/rules.mk:1447: warning: ignoring old recipe for target '../../../dist/bin/modules/LoginManagerParent.jsm'
18:19.55 /opt/FirefoxSource/mozilla-release/mobile/android/thirdparty/jap/branding/locales/en-US/brand.properties: WARNING: no useful preprocessor directives found
18:19.68 /opt/FirefoxSource/mozilla-release/mobile/locales/en-US/overrides/netError.dtd: WARNING: no preprocessor directives found
18:19.70 /opt/FirefoxSource/mozilla-release/mobile/locales/en-US/overrides/appstrings.properties: WARNING: no useful preprocessor directives found
18:19.71 /opt/FirefoxSource/mozilla-release/mobile/locales/en-US/overrides/passwordmgr.properties: WARNING: no useful preprocessor directives found
18:20.28 /opt/FirefoxSource/mozilla-release/mobile/android/base/WebappManifestFragment.xml.frag.in: WARNING: no preprocessor directives found
18:20.38 make[5]: *** No rule to make target 'generated/preprocessed/org/mozilla/gecko/AppConstants.java', needed by 'constants.jar'.  Schluss.
18:20.38 make[5]: *** Warte auf noch nicht beendete Prozesse...
18:20.56 Read 3 engines: [u'Google', u'Yahoo', u'Bing']
18:20.56 Default engine is 'Google'.
18:20.56 /opt/FirefoxSource/mozilla-release/objdir-droid/mobile/android/base/res/raw/browsersearch.json updated
18:20.69 Reading 0 suggested sites: []
18:20.69 /opt/FirefoxSource/mozilla-release/objdir-droid/mobile/android/base/res/raw/suggestedsites.json updated
18:20.71 /opt/FirefoxSource/mozilla-release/config/recurse.mk:82: recipe for target 'mobile/android/base/libs' failed
18:20.71 make[4]: *** [mobile/android/base/libs] Error 2
18:20.71 /opt/FirefoxSource/mozilla-release/config/recurse.mk:36: recipe for target 'libs' failed
18:20.71 make[3]: *** [libs] Error 2
18:20.71 /opt/FirefoxSource/mozilla-release/config/rules.mk:541: recipe for target 'default' failed
18:20.71 make[2]: *** [default] Error 2
18:20.71 /opt/FirefoxSource/mozilla-release/client.mk:398: recipe for target 'realbuild' failed
18:20.71 make[1]: *** [realbuild] Error 2
18:20.71 client.mk:171: recipe for target 'build' failed
18:20.71 make: *** [build] Error 2
18:20.74 366 compiler warnings present.
18:21.24 Notification center failed: Install the python dbus module to get a notification when the build finishes.
Build step 'Shell ausführen' marked build as failure
[PostBuildScript] - Execution post build scripts.
[PostBuildScript] Build is not success : do not execute script
Finished: FAILURE