Console Output

Skipping 401 KB.. Full Log
22:16.67 /opt/FirefoxSource/mozilla-release/media/omx-plugin/include/gb/stagefright/MetaData.h:73:22: warning: multi-character character constant [-Wmultichar]
22:16.67 Warning: -Wmultichar in /opt/FirefoxSource/mozilla-release/media/omx-plugin/include/gb/stagefright/MetaData.h: multi-character character constant
22:16.67 /opt/FirefoxSource/mozilla-release/media/omx-plugin/include/gb/stagefright/MetaData.h:74:16: warning: multi-character character constant [-Wmultichar]
22:16.67 Warning: -Wmultichar in /opt/FirefoxSource/mozilla-release/media/omx-plugin/include/gb/stagefright/MetaData.h: multi-character character constant
22:16.67 /opt/FirefoxSource/mozilla-release/media/omx-plugin/include/gb/stagefright/MetaData.h:75:18: warning: multi-character character constant [-Wmultichar]
22:16.67 Warning: -Wmultichar in /opt/FirefoxSource/mozilla-release/media/omx-plugin/include/gb/stagefright/MetaData.h: multi-character character constant
22:16.67 /opt/FirefoxSource/mozilla-release/media/omx-plugin/include/gb/stagefright/MetaData.h:76:23: warning: multi-character character constant [-Wmultichar]
22:16.67 Warning: -Wmultichar in /opt/FirefoxSource/mozilla-release/media/omx-plugin/include/gb/stagefright/MetaData.h: multi-character character constant
22:16.67 /opt/FirefoxSource/mozilla-release/media/omx-plugin/include/gb/stagefright/MetaData.h:77:21: warning: multi-character character constant [-Wmultichar]
22:16.67 Warning: -Wmultichar in /opt/FirefoxSource/mozilla-release/media/omx-plugin/include/gb/stagefright/MetaData.h: multi-character character constant
22:16.67 /opt/FirefoxSource/mozilla-release/media/omx-plugin/include/gb/stagefright/MetaData.h:80:24: warning: multi-character character constant [-Wmultichar]
22:16.67 Warning: -Wmultichar in /opt/FirefoxSource/mozilla-release/media/omx-plugin/include/gb/stagefright/MetaData.h: multi-character character constant
22:16.67 /opt/FirefoxSource/mozilla-release/media/omx-plugin/include/gb/stagefright/MetaData.h:81:22: warning: multi-character character constant [-Wmultichar]
22:16.67 Warning: -Wmultichar in /opt/FirefoxSource/mozilla-release/media/omx-plugin/include/gb/stagefright/MetaData.h: multi-character character constant
22:16.67 /opt/FirefoxSource/mozilla-release/media/omx-plugin/include/gb/stagefright/MetaData.h:84:27: warning: multi-character character constant [-Wmultichar]
22:16.67 Warning: -Wmultichar in /opt/FirefoxSource/mozilla-release/media/omx-plugin/include/gb/stagefright/MetaData.h: multi-character character constant
22:16.67 /opt/FirefoxSource/mozilla-release/media/omx-plugin/include/gb/stagefright/MetaData.h:85:26: warning: multi-character character constant [-Wmultichar]
22:16.67 Warning: -Wmultichar in /opt/FirefoxSource/mozilla-release/media/omx-plugin/include/gb/stagefright/MetaData.h: multi-character character constant
22:16.67 /opt/FirefoxSource/mozilla-release/media/omx-plugin/include/gb/stagefright/MetaData.h:90:20: warning: multi-character character constant [-Wmultichar]
22:16.67 Warning: -Wmultichar in /opt/FirefoxSource/mozilla-release/media/omx-plugin/include/gb/stagefright/MetaData.h: multi-character character constant
22:16.67 /opt/FirefoxSource/mozilla-release/media/omx-plugin/include/gb/stagefright/MetaData.h:94:27: warning: multi-character character constant [-Wmultichar]
22:16.67 Warning: -Wmultichar in /opt/FirefoxSource/mozilla-release/media/omx-plugin/include/gb/stagefright/MetaData.h: multi-character character constant
22:16.67 /opt/FirefoxSource/mozilla-release/media/omx-plugin/include/gb/stagefright/MetaData.h:95:26: warning: multi-character character constant [-Wmultichar]
22:16.67 Warning: -Wmultichar in /opt/FirefoxSource/mozilla-release/media/omx-plugin/include/gb/stagefright/MetaData.h: multi-character character constant
22:16.68 /opt/FirefoxSource/mozilla-release/media/omx-plugin/include/gb/stagefright/MetaData.h:97:23: warning: multi-character character constant [-Wmultichar]
22:16.68 Warning: -Wmultichar in /opt/FirefoxSource/mozilla-release/media/omx-plugin/include/gb/stagefright/MetaData.h: multi-character character constant
22:16.68 /opt/FirefoxSource/mozilla-release/media/omx-plugin/include/gb/stagefright/MetaData.h:100:20: warning: multi-character character constant [-Wmultichar]
22:16.68 Warning: -Wmultichar in /opt/FirefoxSource/mozilla-release/media/omx-plugin/include/gb/stagefright/MetaData.h: multi-character character constant
22:16.68 /opt/FirefoxSource/mozilla-release/media/omx-plugin/include/gb/stagefright/MetaData.h:102:24: warning: multi-character character constant [-Wmultichar]
22:16.68 Warning: -Wmultichar in /opt/FirefoxSource/mozilla-release/media/omx-plugin/include/gb/stagefright/MetaData.h: multi-character character constant
22:16.68 /opt/FirefoxSource/mozilla-release/media/omx-plugin/include/gb/stagefright/MetaData.h:104:24: warning: multi-character character constant [-Wmultichar]
22:16.68 Warning: -Wmultichar in /opt/FirefoxSource/mozilla-release/media/omx-plugin/include/gb/stagefright/MetaData.h: multi-character character constant
22:16.68 /opt/FirefoxSource/mozilla-release/media/omx-plugin/include/gb/stagefright/MetaData.h:108:17: warning: multi-character character constant [-Wmultichar]
22:16.68 Warning: -Wmultichar in /opt/FirefoxSource/mozilla-release/media/omx-plugin/include/gb/stagefright/MetaData.h: multi-character character constant
22:16.68 /opt/FirefoxSource/mozilla-release/media/omx-plugin/include/gb/stagefright/MetaData.h:109:17: warning: multi-character character constant [-Wmultichar]
22:16.68 Warning: -Wmultichar in /opt/FirefoxSource/mozilla-release/media/omx-plugin/include/gb/stagefright/MetaData.h: multi-character character constant
22:16.68 /opt/FirefoxSource/mozilla-release/media/omx-plugin/include/gb/stagefright/MetaData.h:118:21: warning: multi-character character constant [-Wmultichar]
22:16.68 Warning: -Wmultichar in /opt/FirefoxSource/mozilla-release/media/omx-plugin/include/gb/stagefright/MetaData.h: multi-character character constant
22:16.68 /opt/FirefoxSource/mozilla-release/media/omx-plugin/include/gb/stagefright/MetaData.h:119:25: warning: multi-character character constant [-Wmultichar]
22:16.68 Warning: -Wmultichar in /opt/FirefoxSource/mozilla-release/media/omx-plugin/include/gb/stagefright/MetaData.h: multi-character character constant
22:16.68 /opt/FirefoxSource/mozilla-release/media/omx-plugin/include/gb/stagefright/MetaData.h:120:22: warning: multi-character character constant [-Wmultichar]
22:16.68 Warning: -Wmultichar in /opt/FirefoxSource/mozilla-release/media/omx-plugin/include/gb/stagefright/MetaData.h: multi-character character constant
22:16.68 /opt/FirefoxSource/mozilla-release/media/omx-plugin/include/gb/stagefright/MetaData.h:121:22: warning: multi-character character constant [-Wmultichar]
22:16.68 Warning: -Wmultichar in /opt/FirefoxSource/mozilla-release/media/omx-plugin/include/gb/stagefright/MetaData.h: multi-character character constant
22:16.68 /opt/FirefoxSource/mozilla-release/media/omx-plugin/include/gb/stagefright/MetaData.h:122:22: warning: multi-character character constant [-Wmultichar]
22:16.68 Warning: -Wmultichar in /opt/FirefoxSource/mozilla-release/media/omx-plugin/include/gb/stagefright/MetaData.h: multi-character character constant
22:16.68 /opt/FirefoxSource/mozilla-release/media/omx-plugin/include/gb/stagefright/MetaData.h:123:24: warning: multi-character character constant [-Wmultichar]
22:16.68 libstagefright.so
22:16.76 TestJSImplInheritanceGenBinding.o
22:17.50 TestRefPtr.o
22:17.64 TestRollingMean.o
22:17.85 TestSegmentedVector.o
22:18.14 TestSHA1.o
22:18.59 TestSplayTree.o
22:18.67 TestTypedEnum.o
22:18.88 TestTypeTraits.o
22:29.47 TestUniquePtr.o
22:29.58 TestVector.o
22:30.35 TestTypedefBinding.o
22:30.37 TestWeakPtr.o
22:30.56 TestPoisonArea.o
22:30.90 TestArrayUtils
22:30.90 TestAtomics
22:31.13 TestBinarySearch
22:31.25 TestBloomFilter
22:31.50 TestCasting
22:31.61 TestCeilingFloor
22:31.72 TestCheckedInt
22:31.84 TestCountPopulation
22:31.97 TestCountZeroes
22:32.08 TestEndian
22:32.19 TestEnumSet
22:32.31 TestFloatingPoint
22:32.42 TestIntegerPrintfMacros
22:32.55 TestJSONWriter
22:32.67 TestMacroArgs
22:32.78 TestMacroForEach
22:32.89 TestMaybe
22:33.00 TestPair
22:33.11 TestRefPtr
22:33.22 TestRollingMean
22:33.34 TestSegmentedVector
22:33.48 TestSHA1
22:33.61 TestSplayTree
22:33.74 TestTypedEnum
22:33.87 TestTypeTraits
22:34.01 TestUniquePtr
22:34.14 TestVector
22:34.25 TestWeakPtr
22:34.38 TestPoisonArea
22:34.74 OmxPlugin.o
22:35.55 libomxplugin.so
22:35.69 BionicGlue.o
22:35.69 arm.o
22:35.71 libstagefright.o
22:36.04 In file included from /opt/FirefoxSource/mozilla-release/media/omx-plugin/lib/gb235/libstagefright/../../gb/libstagefright/libstagefright.cpp:12:0,
22:36.04                  from /opt/FirefoxSource/mozilla-release/media/omx-plugin/lib/gb235/libstagefright/libstagefright.cpp:8:
22:36.04 Warning: -Wmultichar in /opt/FirefoxSource/mozilla-release/media/omx-plugin/include/gb/stagefright/MetaData.h: multi-character character constant
22:36.04 /opt/FirefoxSource/mozilla-release/media/omx-plugin/include/gb/stagefright/MetaData.h:32:20: warning: multi-character character constant [-Wmultichar]
22:36.04 Warning: -Wmultichar in /opt/FirefoxSource/mozilla-release/media/omx-plugin/include/gb/stagefright/MetaData.h: multi-character character constant
22:36.04 /opt/FirefoxSource/mozilla-release/media/omx-plugin/include/gb/stagefright/MetaData.h:33:17: warning: multi-character character constant [-Wmultichar]
22:36.04 Warning: -Wmultichar in /opt/FirefoxSource/mozilla-release/media/omx-plugin/include/gb/stagefright/MetaData.h: multi-character character constant
22:36.04 /opt/FirefoxSource/mozilla-release/media/omx-plugin/include/gb/stagefright/MetaData.h:34:18: warning: multi-character character constant [-Wmultichar]
22:36.04 Warning: -Wmultichar in /opt/FirefoxSource/mozilla-release/media/omx-plugin/include/gb/stagefright/MetaData.h: multi-character character constant
22:36.04 /opt/FirefoxSource/mozilla-release/media/omx-plugin/include/gb/stagefright/MetaData.h:35:20: warning: multi-character character constant [-Wmultichar]
22:36.04 Warning: -Wmultichar in /opt/FirefoxSource/mozilla-release/media/omx-plugin/include/gb/stagefright/MetaData.h: multi-character character constant
22:36.04 /opt/FirefoxSource/mozilla-release/media/omx-plugin/include/gb/stagefright/MetaData.h:36:27: warning: multi-character character constant [-Wmultichar]
22:36.04 Warning: -Wmultichar in /opt/FirefoxSource/mozilla-release/media/omx-plugin/include/gb/stagefright/MetaData.h: multi-character character constant
22:36.04 /opt/FirefoxSource/mozilla-release/media/omx-plugin/include/gb/stagefright/MetaData.h:37:18: warning: multi-character character constant [-Wmultichar]
22:36.04 Warning: -Wmultichar in /opt/FirefoxSource/mozilla-release/media/omx-plugin/include/gb/stagefright/MetaData.h: multi-character character constant
22:36.05 /opt/FirefoxSource/mozilla-release/media/omx-plugin/include/gb/stagefright/MetaData.h:38:23: warning: multi-character character constant [-Wmultichar]
22:36.05 Warning: -Wmultichar in /opt/FirefoxSource/mozilla-release/media/omx-plugin/include/gb/stagefright/MetaData.h: multi-character character constant
22:36.05 /opt/FirefoxSource/mozilla-release/media/omx-plugin/include/gb/stagefright/MetaData.h:39:24: warning: multi-character character constant [-Wmultichar]
22:36.05 Warning: -Wmultichar in /opt/FirefoxSource/mozilla-release/media/omx-plugin/include/gb/stagefright/MetaData.h: multi-character character constant
22:36.05 /opt/FirefoxSource/mozilla-release/media/omx-plugin/include/gb/stagefright/MetaData.h:40:22: warning: multi-character character constant [-Wmultichar]
22:36.05 Warning: -Wmultichar in /opt/FirefoxSource/mozilla-release/media/omx-plugin/include/gb/stagefright/MetaData.h: multi-character character constant
22:36.05 /opt/FirefoxSource/mozilla-release/media/omx-plugin/include/gb/stagefright/MetaData.h:41:19: warning: multi-character character constant [-Wmultichar]
22:36.05 Warning: -Wmultichar in /opt/FirefoxSource/mozilla-release/media/omx-plugin/include/gb/stagefright/MetaData.h: multi-character character constant
22:36.05 /opt/FirefoxSource/mozilla-release/media/omx-plugin/include/gb/stagefright/MetaData.h:42:16: warning: multi-character character constant [-Wmultichar]
22:36.05 Warning: -Wmultichar in /opt/FirefoxSource/mozilla-release/media/omx-plugin/include/gb/stagefright/MetaData.h: multi-character character constant
22:36.05 /opt/FirefoxSource/mozilla-release/media/omx-plugin/include/gb/stagefright/MetaData.h:43:16: warning: multi-character character constant [-Wmultichar]
22:36.05 Warning: -Wmultichar in /opt/FirefoxSource/mozilla-release/media/omx-plugin/include/gb/stagefright/MetaData.h: multi-character character constant
22:36.05 /opt/FirefoxSource/mozilla-release/media/omx-plugin/include/gb/stagefright/MetaData.h:44:22: warning: multi-character character constant [-Wmultichar]
22:36.05 Warning: -Wmultichar in /opt/FirefoxSource/mozilla-release/media/omx-plugin/include/gb/stagefright/MetaData.h: multi-character character constant
22:36.05 /opt/FirefoxSource/mozilla-release/media/omx-plugin/include/gb/stagefright/MetaData.h:45:23: warning: multi-character character constant [-Wmultichar]
22:36.05 Warning: -Wmultichar in /opt/FirefoxSource/mozilla-release/media/omx-plugin/include/gb/stagefright/MetaData.h: multi-character character constant
22:36.05 /opt/FirefoxSource/mozilla-release/media/omx-plugin/include/gb/stagefright/MetaData.h:46:29: warning: multi-character character constant [-Wmultichar]
22:36.05 Warning: -Wmultichar in /opt/FirefoxSource/mozilla-release/media/omx-plugin/include/gb/stagefright/MetaData.h: multi-character character constant
22:36.05 /opt/FirefoxSource/mozilla-release/media/omx-plugin/include/gb/stagefright/MetaData.h:47:23: warning: multi-character character constant [-Wmultichar]
22:36.05 Warning: -Wmultichar in /opt/FirefoxSource/mozilla-release/media/omx-plugin/include/gb/stagefright/MetaData.h: multi-character character constant
22:36.05 /opt/FirefoxSource/mozilla-release/media/omx-plugin/include/gb/stagefright/MetaData.h:48:25: warning: multi-character character constant [-Wmultichar]
22:36.05 Warning: -Wmultichar in /opt/FirefoxSource/mozilla-release/media/omx-plugin/include/gb/stagefright/MetaData.h: multi-character character constant
22:36.05 /opt/FirefoxSource/mozilla-release/media/omx-plugin/include/gb/stagefright/MetaData.h:49:16: warning: multi-character character constant [-Wmultichar]
22:36.05 Warning: -Wmultichar in /opt/FirefoxSource/mozilla-release/media/omx-plugin/include/gb/stagefright/MetaData.h: multi-character character constant
22:36.05 /opt/FirefoxSource/mozilla-release/media/omx-plugin/include/gb/stagefright/MetaData.h:50:19: warning: multi-character character constant [-Wmultichar]
22:36.05 Warning: -Wmultichar in /opt/FirefoxSource/mozilla-release/media/omx-plugin/include/gb/stagefright/MetaData.h: multi-character character constant
22:36.05 /opt/FirefoxSource/mozilla-release/media/omx-plugin/include/gb/stagefright/MetaData.h:51:22: warning: multi-character character constant [-Wmultichar]
22:36.05 Warning: -Wmultichar in /opt/FirefoxSource/mozilla-release/media/omx-plugin/include/gb/stagefright/MetaData.h: multi-character character constant
22:36.05 /opt/FirefoxSource/mozilla-release/media/omx-plugin/include/gb/stagefright/MetaData.h:52:21: warning: multi-character character constant [-Wmultichar]
22:36.05 Warning: -Wmultichar in /opt/FirefoxSource/mozilla-release/media/omx-plugin/include/gb/stagefright/MetaData.h: multi-character character constant
22:36.05 /opt/FirefoxSource/mozilla-release/media/omx-plugin/include/gb/stagefright/MetaData.h:53:22: warning: multi-character character constant [-Wmultichar]
22:36.05 Warning: -Wmultichar in /opt/FirefoxSource/mozilla-release/media/omx-plugin/include/gb/stagefright/MetaData.h: multi-character character constant
22:36.05 /opt/FirefoxSource/mozilla-release/media/omx-plugin/include/gb/stagefright/MetaData.h:54:20: warning: multi-character character constant [-Wmultichar]
22:36.05 Warning: -Wmultichar in /opt/FirefoxSource/mozilla-release/media/omx-plugin/include/gb/stagefright/MetaData.h: multi-character character constant
22:36.05 /opt/FirefoxSource/mozilla-release/media/omx-plugin/include/gb/stagefright/MetaData.h:55:23: warning: multi-character character constant [-Wmultichar]
22:36.05 Warning: -Wmultichar in /opt/FirefoxSource/mozilla-release/media/omx-plugin/include/gb/stagefright/MetaData.h: multi-character character constant
22:36.05 /opt/FirefoxSource/mozilla-release/media/omx-plugin/include/gb/stagefright/MetaData.h:56:27: warning: multi-character character constant [-Wmultichar]
22:36.06 Warning: -Wmultichar in /opt/FirefoxSource/mozilla-release/media/omx-plugin/include/gb/stagefright/MetaData.h: multi-character character constant
22:36.06 /opt/FirefoxSource/mozilla-release/media/omx-plugin/include/gb/stagefright/MetaData.h:57:28: warning: multi-character character constant [-Wmultichar]
22:36.06 Warning: -Wmultichar in /opt/FirefoxSource/mozilla-release/media/omx-plugin/include/gb/stagefright/MetaData.h: multi-character character constant
22:36.06 /opt/FirefoxSource/mozilla-release/media/omx-plugin/include/gb/stagefright/MetaData.h:58:20: warning: multi-character character constant [-Wmultichar]
22:36.06 Warning: -Wmultichar in /opt/FirefoxSource/mozilla-release/media/omx-plugin/include/gb/stagefright/MetaData.h: multi-character character constant
22:36.06 /opt/FirefoxSource/mozilla-release/media/omx-plugin/include/gb/stagefright/MetaData.h:59:24: warning: multi-character character constant [-Wmultichar]
22:36.06 Warning: -Wmultichar in /opt/FirefoxSource/mozilla-release/media/omx-plugin/include/gb/stagefright/MetaData.h: multi-character character constant
22:36.06 /opt/FirefoxSource/mozilla-release/media/omx-plugin/include/gb/stagefright/MetaData.h:60:25: warning: multi-character character constant [-Wmultichar]
22:36.06 Warning: -Wmultichar in /opt/FirefoxSource/mozilla-release/media/omx-plugin/include/gb/stagefright/MetaData.h: multi-character character constant
22:36.06 /opt/FirefoxSource/mozilla-release/media/omx-plugin/include/gb/stagefright/MetaData.h:62:17: warning: multi-character character constant [-Wmultichar]
22:36.06 Warning: -Wmultichar in /opt/FirefoxSource/mozilla-release/media/omx-plugin/include/gb/stagefright/MetaData.h: multi-character character constant
22:36.06 /opt/FirefoxSource/mozilla-release/media/omx-plugin/include/gb/stagefright/MetaData.h:63:18: warning: multi-character character constant [-Wmultichar]
22:36.06 Warning: -Wmultichar in /opt/FirefoxSource/mozilla-release/media/omx-plugin/include/gb/stagefright/MetaData.h: multi-character character constant
22:36.06 /opt/FirefoxSource/mozilla-release/media/omx-plugin/include/gb/stagefright/MetaData.h:64:23: warning: multi-character character constant [-Wmultichar]
22:36.06 Warning: -Wmultichar in /opt/FirefoxSource/mozilla-release/media/omx-plugin/include/gb/stagefright/MetaData.h: multi-character character constant
22:36.06 /opt/FirefoxSource/mozilla-release/media/omx-plugin/include/gb/stagefright/MetaData.h:65:20: warning: multi-character character constant [-Wmultichar]
22:36.06 Warning: -Wmultichar in /opt/FirefoxSource/mozilla-release/media/omx-plugin/include/gb/stagefright/MetaData.h: multi-character character constant
22:36.07 /opt/FirefoxSource/mozilla-release/media/omx-plugin/include/gb/stagefright/MetaData.h:66:17: warning: multi-character character constant [-Wmultichar]
22:36.07 Warning: -Wmultichar in /opt/FirefoxSource/mozilla-release/media/omx-plugin/include/gb/stagefright/MetaData.h: multi-character character constant
22:36.07 /opt/FirefoxSource/mozilla-release/media/omx-plugin/include/gb/stagefright/MetaData.h:67:17: warning: multi-character character constant [-Wmultichar]
22:36.07 Warning: -Wmultichar in /opt/FirefoxSource/mozilla-release/media/omx-plugin/include/gb/stagefright/MetaData.h: multi-character character constant
22:36.07 /opt/FirefoxSource/mozilla-release/media/omx-plugin/include/gb/stagefright/MetaData.h:68:16: warning: multi-character character constant [-Wmultichar]
22:36.07 Warning: -Wmultichar in /opt/FirefoxSource/mozilla-release/media/omx-plugin/include/gb/stagefright/MetaData.h: multi-character character constant
22:36.07 /opt/FirefoxSource/mozilla-release/media/omx-plugin/include/gb/stagefright/MetaData.h:69:20: warning: multi-character character constant [-Wmultichar]
22:36.07 Warning: -Wmultichar in /opt/FirefoxSource/mozilla-release/media/omx-plugin/include/gb/stagefright/MetaData.h: multi-character character constant
22:36.07 /opt/FirefoxSource/mozilla-release/media/omx-plugin/include/gb/stagefright/MetaData.h:70:24: warning: multi-character character constant [-Wmultichar]
22:36.07 Warning: -Wmultichar in /opt/FirefoxSource/mozilla-release/media/omx-plugin/include/gb/stagefright/MetaData.h: multi-character character constant
22:36.07 /opt/FirefoxSource/mozilla-release/media/omx-plugin/include/gb/stagefright/MetaData.h:71:18: warning: multi-character character constant [-Wmultichar]
22:36.07 Warning: -Wmultichar in /opt/FirefoxSource/mozilla-release/media/omx-plugin/include/gb/stagefright/MetaData.h: multi-character character constant
22:36.07 /opt/FirefoxSource/mozilla-release/media/omx-plugin/include/gb/stagefright/MetaData.h:72:25: warning: multi-character character constant [-Wmultichar]
22:36.07 Warning: -Wmultichar in /opt/FirefoxSource/mozilla-release/media/omx-plugin/include/gb/stagefright/MetaData.h: multi-character character constant
22:36.07 /opt/FirefoxSource/mozilla-release/media/omx-plugin/include/gb/stagefright/MetaData.h:73:22: warning: multi-character character constant [-Wmultichar]
22:36.07 Warning: -Wmultichar in /opt/FirefoxSource/mozilla-release/media/omx-plugin/include/gb/stagefright/MetaData.h: multi-character character constant
22:36.07 /opt/FirefoxSource/mozilla-release/media/omx-plugin/include/gb/stagefright/MetaData.h:74:16: warning: multi-character character constant [-Wmultichar]
22:36.07 Warning: -Wmultichar in /opt/FirefoxSource/mozilla-release/media/omx-plugin/include/gb/stagefright/MetaData.h: multi-character character constant
22:36.07 /opt/FirefoxSource/mozilla-release/media/omx-plugin/include/gb/stagefright/MetaData.h:75:18: warning: multi-character character constant [-Wmultichar]
22:36.07 Warning: -Wmultichar in /opt/FirefoxSource/mozilla-release/media/omx-plugin/include/gb/stagefright/MetaData.h: multi-character character constant
22:36.07 /opt/FirefoxSource/mozilla-release/media/omx-plugin/include/gb/stagefright/MetaData.h:76:23: warning: multi-character character constant [-Wmultichar]
22:36.07 Warning: -Wmultichar in /opt/FirefoxSource/mozilla-release/media/omx-plugin/include/gb/stagefright/MetaData.h: multi-character character constant
22:36.07 /opt/FirefoxSource/mozilla-release/media/omx-plugin/include/gb/stagefright/MetaData.h:77:21: warning: multi-character character constant [-Wmultichar]
22:36.07 Warning: -Wmultichar in /opt/FirefoxSource/mozilla-release/media/omx-plugin/include/gb/stagefright/MetaData.h: multi-character character constant
22:36.07 /opt/FirefoxSource/mozilla-release/media/omx-plugin/include/gb/stagefright/MetaData.h:80:24: warning: multi-character character constant [-Wmultichar]
22:36.07 Warning: -Wmultichar in /opt/FirefoxSource/mozilla-release/media/omx-plugin/include/gb/stagefright/MetaData.h: multi-character character constant
22:36.07 /opt/FirefoxSource/mozilla-release/media/omx-plugin/include/gb/stagefright/MetaData.h:81:22: warning: multi-character character constant [-Wmultichar]
22:36.07 Warning: -Wmultichar in /opt/FirefoxSource/mozilla-release/media/omx-plugin/include/gb/stagefright/MetaData.h: multi-character character constant
22:36.07 /opt/FirefoxSource/mozilla-release/media/omx-plugin/include/gb/stagefright/MetaData.h:84:27: warning: multi-character character constant [-Wmultichar]
22:36.07 Warning: -Wmultichar in /opt/FirefoxSource/mozilla-release/media/omx-plugin/include/gb/stagefright/MetaData.h: multi-character character constant
22:36.08 /opt/FirefoxSource/mozilla-release/media/omx-plugin/include/gb/stagefright/MetaData.h:85:26: warning: multi-character character constant [-Wmultichar]
22:36.08 Warning: -Wmultichar in /opt/FirefoxSource/mozilla-release/media/omx-plugin/include/gb/stagefright/MetaData.h: multi-character character constant
22:36.08 /opt/FirefoxSource/mozilla-release/media/omx-plugin/include/gb/stagefright/MetaData.h:90:20: warning: multi-character character constant [-Wmultichar]
22:36.08 Warning: -Wmultichar in /opt/FirefoxSource/mozilla-release/media/omx-plugin/include/gb/stagefright/MetaData.h: multi-character character constant
22:36.08 /opt/FirefoxSource/mozilla-release/media/omx-plugin/include/gb/stagefright/MetaData.h:94:27: warning: multi-character character constant [-Wmultichar]
22:36.08 Warning: -Wmultichar in /opt/FirefoxSource/mozilla-release/media/omx-plugin/include/gb/stagefright/MetaData.h: multi-character character constant
22:36.08 /opt/FirefoxSource/mozilla-release/media/omx-plugin/include/gb/stagefright/MetaData.h:95:26: warning: multi-character character constant [-Wmultichar]
22:36.08 Warning: -Wmultichar in /opt/FirefoxSource/mozilla-release/media/omx-plugin/include/gb/stagefright/MetaData.h: multi-character character constant
22:36.08 /opt/FirefoxSource/mozilla-release/media/omx-plugin/include/gb/stagefright/MetaData.h:97:23: warning: multi-character character constant [-Wmultichar]
22:36.08 Warning: -Wmultichar in /opt/FirefoxSource/mozilla-release/media/omx-plugin/include/gb/stagefright/MetaData.h: multi-character character constant
22:36.08 /opt/FirefoxSource/mozilla-release/media/omx-plugin/include/gb/stagefright/MetaData.h:100:20: warning: multi-character character constant [-Wmultichar]
22:36.08 Warning: -Wmultichar in /opt/FirefoxSource/mozilla-release/media/omx-plugin/include/gb/stagefright/MetaData.h: multi-character character constant
22:36.08 /opt/FirefoxSource/mozilla-release/media/omx-plugin/include/gb/stagefright/MetaData.h:102:24: warning: multi-character character constant [-Wmultichar]
22:36.08 Warning: -Wmultichar in /opt/FirefoxSource/mozilla-release/media/omx-plugin/include/gb/stagefright/MetaData.h: multi-character character constant
22:36.08 /opt/FirefoxSource/mozilla-release/media/omx-plugin/include/gb/stagefright/MetaData.h:104:24: warning: multi-character character constant [-Wmultichar]
22:36.08 Warning: -Wmultichar in /opt/FirefoxSource/mozilla-release/media/omx-plugin/include/gb/stagefright/MetaData.h: multi-character character constant
22:36.08 /opt/FirefoxSource/mozilla-release/media/omx-plugin/include/gb/stagefright/MetaData.h:108:17: warning: multi-character character constant [-Wmultichar]
22:36.09 Warning: -Wmultichar in /opt/FirefoxSource/mozilla-release/media/omx-plugin/include/gb/stagefright/MetaData.h: multi-character character constant
22:36.09 /opt/FirefoxSource/mozilla-release/media/omx-plugin/include/gb/stagefright/MetaData.h:109:17: warning: multi-character character constant [-Wmultichar]
22:36.09 Warning: -Wmultichar in /opt/FirefoxSource/mozilla-release/media/omx-plugin/include/gb/stagefright/MetaData.h: multi-character character constant
22:36.09 /opt/FirefoxSource/mozilla-release/media/omx-plugin/include/gb/stagefright/MetaData.h:118:21: warning: multi-character character constant [-Wmultichar]
22:36.09 Warning: -Wmultichar in /opt/FirefoxSource/mozilla-release/media/omx-plugin/include/gb/stagefright/MetaData.h: multi-character character constant
22:36.09 /opt/FirefoxSource/mozilla-release/media/omx-plugin/include/gb/stagefright/MetaData.h:119:25: warning: multi-character character constant [-Wmultichar]
22:36.09 Warning: -Wmultichar in /opt/FirefoxSource/mozilla-release/media/omx-plugin/include/gb/stagefright/MetaData.h: multi-character character constant
22:36.09 /opt/FirefoxSource/mozilla-release/media/omx-plugin/include/gb/stagefright/MetaData.h:120:22: warning: multi-character character constant [-Wmultichar]
22:36.09 Warning: -Wmultichar in /opt/FirefoxSource/mozilla-release/media/omx-plugin/include/gb/stagefright/MetaData.h: multi-character character constant
22:36.09 /opt/FirefoxSource/mozilla-release/media/omx-plugin/include/gb/stagefright/MetaData.h:121:22: warning: multi-character character constant [-Wmultichar]
22:36.09 Warning: -Wmultichar in /opt/FirefoxSource/mozilla-release/media/omx-plugin/include/gb/stagefright/MetaData.h: multi-character character constant
22:36.09 /opt/FirefoxSource/mozilla-release/media/omx-plugin/include/gb/stagefright/MetaData.h:122:22: warning: multi-character character constant [-Wmultichar]
22:36.09 Warning: -Wmultichar in /opt/FirefoxSource/mozilla-release/media/omx-plugin/include/gb/stagefright/MetaData.h: multi-character character constant
22:36.09 /opt/FirefoxSource/mozilla-release/media/omx-plugin/include/gb/stagefright/MetaData.h:123:24: warning: multi-character character constant [-Wmultichar]
22:36.09 libstagefright.so
22:36.16 libmozglue.so
22:36.22 libgkmedias.a.desc
22:36.27 OmxPlugin236.o
22:36.66 OmxPluginHoneycomb.o
22:36.86 OmxPlugin235.o
22:36.99 libomxplugingb.so
22:37.48 libomxpluginhc.so
22:37.59 Unified_cpp_memory_mozalloc0.o
22:37.62 libomxplugingb235.so
22:37.88 quickder.c: In function 'DecodeItem':
22:37.95 quickder.c:666:12: warning: variable 'optional' set but not used [-Wunused-but-set-variable]
22:37.95 In file included from /opt/FirefoxSource/mozilla-release/objdir-droid/memory/mozalloc/Unified_cpp_memory_mozalloc0.cpp:11:0:
22:37.95 /opt/FirefoxSource/mozilla-release/memory/mozalloc/mozalloc_abort.cpp: In function 'void abort()':
22:37.95 Warning: enabled by default in /opt/FirefoxSource/mozilla-release/memory/mozalloc/mozalloc_abort.cpp: 'noreturn' function does return
22:37.95 /opt/FirefoxSource/mozilla-release/memory/mozalloc/mozalloc_abort.cpp:76:1: warning: 'noreturn' function does return [enabled by default]
22:37.95 libmozalloc.so
22:38.20 derenc.c: In function 'der_encode':
22:38.21 derenc.c:282:22: warning: variable 'optional' set but not used [-Wunused-but-set-variable]
22:38.42 sechash.c: In function 'HASH_ResultLen':
22:38.42 sechash.c:263:5: warning: comparison of unsigned expression < 0 is always false [-Wtype-limits]
22:38.42 sechash.c: In function 'HASH_HashBuf':
22:38.42 sechash.c:288:5: warning: comparison of unsigned expression < 0 is always false [-Wtype-limits]
22:38.42 sechash.c: In function 'HASH_Create':
22:38.42 sechash.c:310:5: warning: comparison of unsigned expression < 0 is always false [-Wtype-limits]
22:38.82 nssb64e.c: In function 'NSSBase64_EncodeItem_Util':
22:38.82 nssb64e.c:684:15: warning: 'out_len' may be used uninitialized in this function [-Wmaybe-uninitialized]
22:39.28 ocsp.c: In function 'ocsp_RemoveCacheItem':
22:39.28 ocsp.c:562:12: warning: variable 'couldRemoveFromHashTable' set but not used [-Wunused-but-set-variable]
22:39.92 certhigh.c: In function 'CERT_MatchNickname':
22:39.92 certhigh.c:28:9: warning: variable 'len' set but not used [-Wunused-but-set-variable]
22:40.40 pk11akey.c: In function 'pk11_get_Decoded_ECPoint':
22:40.40 pk11akey.c:406:26: warning: comparison between signed and unsigned integer expressions [-Wsign-compare]
22:40.40 pk11akey.c:420:63: warning: comparison between signed and unsigned integer expressions [-Wsign-compare]
22:40.86 secoid.c: In function 'SECOID_Init':
22:40.86 secoid.c:1922:19: warning: variable 'c' set but not used [-Wunused-but-set-variable]
22:41.30 certvfypkix.c: In function 'setRevocationMethod':
22:41.30 certvfypkix.c:1422:17: warning: comparison between signed and unsigned integer expressions [-Wsign-compare]
22:41.54 pk11cert.c: In function 'pk11_fastCert':
22:41.54 pk11cert.c:231:14: warning: variable 'status' set but not used [-Wunused-but-set-variable]
22:41.54 pk11cert.c: In function 'PK11_TraverseCertsForNicknameInSlot':
22:41.54 pk11cert.c:2008:28: warning: variable 'pk11cb' set but not used [-Wunused-but-set-variable]
22:41.67 utilmod.c: In function 'nssutil_DeleteSecmodDBEntry.isra.1':
22:41.67 utilmod.c:545:12: warning: 'lib_len' may be used uninitialized in this function [-Wmaybe-uninitialized]
22:42.10 alg1485.c: In function 'cert_AVAOidTagToMaxLen':
22:42.10 alg1485.c:162:57: warning: signed and unsigned type in conditional expression [-Wsign-compare]
22:42.10 alg1485.c: In function 'AppendAVA':
22:42.10 alg1485.c:963:40: warning: signed and unsigned type in conditional expression [-Wsign-compare]
22:42.11 utilpars.c: In function 'nssutil_mkSlotFlags':
22:42.11 utilpars.c:679:17: warning: comparison between signed and unsigned integer expressions [-Wsign-compare]
22:42.11 utilpars.c: In function 'nssutil_mkCipherFlags':
22:42.11 utilpars.c:891:17: warning: comparison between signed and unsigned integer expressions [-Wsign-compare]
22:42.11 utilpars.c:910:17: warning: comparison between signed and unsigned integer expressions [-Wsign-compare]
22:42.68 certificate.c: In function 'nssCertificateList_DoCallback':
22:42.68 certificate.c:898:14: warning: variable 'nssrv' set but not used [-Wunused-but-set-variable]
22:42.90 certdb.c: In function 'CERT_ImportCerts':
22:42.90 certdb.c:2446:15: warning: variable 'rv' set but not used [-Wunused-but-set-variable]
22:42.90 certdb.c: In function 'CERT_UnlockCertRefCount':
22:42.90 certdb.c:2896:14: warning: variable 'prstat' set but not used [-Wunused-but-set-variable]
22:42.90 certdb.c: In function 'CERT_UnlockCertTrust':
22:42.90 certdb.c:2976:14: warning: variable 'prstat' set but not used [-Wunused-but-set-variable]
22:43.51 trustdomain.c: In function 'NSSTrustDomain_TraverseCertificates':
22:43.51 trustdomain.c:994:14: warning: variable 'status' set but not used [-Wunused-but-set-variable]
22:43.58 In file included from pk11load.c:26:0:
22:43.58 debug_module.c: In function 'log_handle':
22:43.58 debug_module.c:339:28: warning: comparison between signed and unsigned integer expressions [-Wsign-compare]
22:43.58 debug_module.c:343:28: warning: comparison between signed and unsigned integer expressions [-Wsign-compare]
22:43.58 pk11load.c: In function 'SECMOD_UnloadModule':
22:43.58 pk11load.c:592:28: warning: unused variable 'status' [-Wunused-variable]
22:43.84 tdcache.c: In function 'add_cert_to_cache':
22:43.84 tdcache.c:779:9: warning: variable 'handle' set but not used [-Wunused-but-set-variable]
22:43.84 tdcache.c: In function 'nssTrustDomain_RemoveCertFromCacheLOCKED':
22:43.84 tdcache.c:272:16: warning: 'nickname' may be used uninitialized in this function [-Wmaybe-uninitialized]
22:43.84 tdcache.c:332:14: note: 'nickname' was declared here
22:43.99 crl.c: In function 'crl_storeCRL':
22:43.99 crl.c:630:15: warning: variable 'rv' set but not used [-Wunused-but-set-variable]
22:43.99 crl.c: In function 'cert_CheckCertRevocationStatus':
22:43.99 crl.c:2696:27: warning: unused variable 'rv2' [-Wunused-variable]
22:43.99 crl.c: In function 'cert_CacheCRLByGeneralName':
22:43.99 crl.c:3053:32: warning: variable 'rv2' set but not used [-Wunused-but-set-variable]
22:44.57 pk11merge.c: In function 'pk11_matchAcrossTokens':
22:44.57 pk11merge.c:100:32: warning: comparison between signed and unsigned integer expressions [-Wsign-compare]
22:44.67 pkibase.c: In function 'nssPKIObjectCollection_Traverse':
22:44.67 pkibase.c:906:14: warning: variable 'status' set but not used [-Wunused-but-set-variable]
22:44.67 pkibase.c: In function 'nssCertificateCollection_Create':
22:44.67 pkibase.c:1060:14: warning: variable 'status' set but not used [-Wunused-but-set-variable]
22:44.67 pkibase.c: In function 'nssCRLCollection_Create':
22:44.67 pkibase.c:1167:14: warning: variable 'status' set but not used [-Wunused-but-set-variable]
22:45.17 pki3hack.c: In function 'DeleteCertTrustMatchingSlot':
22:45.17 pki3hack.c:1280:27: warning: comparison between signed and unsigned integer expressions [-Wsign-compare]
22:45.17 pki3hack.c: In function 'STAN_DeleteCertTrustMatchingSlot':
22:45.17 pki3hack.c:1340:19: warning: comparison between signed and unsigned integer expressions [-Wsign-compare]
22:45.60 pk11obj.c: In function 'PK11_MatchItem':
22:45.60 pk11obj.c:1799:72: warning: comparison between signed and unsigned integer expressions [-Wsign-compare]
22:45.60 pk11obj.c:1784:22: warning: variable 'parent' set but not used [-Wunused-but-set-variable]
22:46.00 devtoken.c: In function 'nssToken_TraverseCertificates':
22:46.00 devtoken.c:1469:14: warning: variable 'status' set but not used [-Wunused-but-set-variable]
22:46.00 pk11pars.c: In function 'secmod_ParseModuleSpecForTokens':
22:46.00 pk11pars.c:364:47: warning: suggest braces around empty body in an 'else' statement [-Wempty-body]
22:46.00 pk11pars.c:366:47: warning: suggest braces around empty body in an 'else' statement [-Wempty-body]
22:46.00 pk11pars.c:375:6: warning: suggest braces around empty body in an 'else' statement [-Wempty-body]
22:46.00 pk11pars.c:384:7: warning: suggest braces around empty body in an 'else' statement [-Wempty-body]
22:46.00 pk11pars.c:393:7: warning: suggest braces around empty body in an 'else' statement [-Wempty-body]
22:46.00 pk11pars.c:402:7: warning: suggest braces around empty body in an 'else' statement [-Wempty-body]
22:46.00 pk11pars.c: In function 'secmod_MkAppendTokensList':
22:46.01 pk11pars.c:767:13: warning: comparison between signed and unsigned integer expressions [-Wsign-compare]
22:46.01 pk11pars.c:804:13: warning: comparison between signed and unsigned integer expressions [-Wsign-compare]
22:46.62 pk11pk12.c: In function 'PK11_ImportPrivateKeyInfoAndReturnKey':
22:46.62 pk11pk12.c:425:17: warning: variable 'keyType' set but not used [-Wunused-but-set-variable]
22:46.65 ckhelper.c: In function 'nssCKObject_GetAttributes':
22:46.65 ckhelper.c:139:36: warning: comparison between signed and unsigned integer expressions [-Wsign-compare]
22:46.66 ckhelper.c: In function 'nssCryptokiTrust_GetAttributes':
22:46.66 ckhelper.c:442:36: warning: comparison between signed and unsigned integer expressions [-Wsign-compare]
22:46.73 list.c: In function 'nssList_Add':
22:46.73 list.c:220:14: warning: variable 'nssrv' set but not used [-Wunused-but-set-variable]
22:46.87 pk11pqg.c: In function 'PK11_PQG_ParamGenSeedLen':
22:46.87 pk11pqg.c:230:56: warning: signed and unsigned type in conditional expression [-Wsign-compare]
22:46.87 pk11pqg.c: In function 'PK11_PQG_ParamGen':
22:46.87 pk11pqg.c:241:56: warning: signed and unsigned type in conditional expression [-Wsign-compare]
22:46.87 pk11pqg.c: In function 'PK11_PQG_VerifyParams':
22:46.87 pk11pqg.c:295:19: warning: comparison between signed and unsigned integer expressions [-Wsign-compare]
22:47.81 pk11skey.c: In function 'pk11_TokenKeyGenWithFlagsAndKeyType':
22:47.81 pk11skey.c:926:17: warning: comparison between signed and unsigned integer expressions [-Wsign-compare]
22:47.81 pk11skey.c: In function 'pk11_HandUnwrap':
22:47.81 pk11skey.c:2296:40: warning: signed and unsigned type in conditional expression [-Wsign-compare]
22:48.62 pk11slot.c: In function 'PK11_InitToken':
22:48.62 pk11slot.c:1108:11: warning: variable 'tmp' set but not used [-Wunused-but-set-variable]
22:48.62 pk11slot.c: In function 'PK11_InitSlot':
22:48.62 pk11slot.c:1352:11: warning: variable 'tmp' set but not used [-Wunused-but-set-variable]
22:48.62 pk11slot.c: In function 'PK11_GetBestSlotMultipleWithAttributes':
22:48.62 pk11slot.c:2076:17: warning: comparison between signed and unsigned integer expressions [-Wsign-compare]
22:48.62 pk11slot.c:2094:18: warning: comparison between signed and unsigned integer expressions [-Wsign-compare]
22:48.62 pk11slot.c: In function 'PK11_ResetToken':
22:48.62 pk11slot.c:2317:22: warning: comparison between signed and unsigned integer expressions [-Wsign-compare]
22:48.62 pk11slot.c:2322:22: warning: comparison between signed and unsigned integer expressions [-Wsign-compare]
22:49.02 pkix_revocationchecker.c: In function 'PKIX_RevocationChecker_Check':
22:49.02 pkix_revocationchecker.c:353:25: warning: comparison between signed and unsigned integer expressions [-Wsign-compare]
22:49.10 pk11util.c: In function 'SECMOD_UpdateSlotList':
22:49.10 pk11util.c:931:15: warning: comparison between signed and unsigned integer expressions [-Wsign-compare]
22:50.90 pkix_tools.c: In function 'pkix_i2hex':
22:50.90 pkix_tools.c:482:9: warning: comparison is always true due to limited range of data type [-Wtype-limits]
22:51.57 pkix_errpaths.c: In function 'PKIX_DoReturn':
22:51.57 pkix_errpaths.c:58:2: warning: suggest braces around empty body in an 'if' statement [-Wempty-body]
22:52.90 pkix_build.c: In function 'pkix_Build_SelectCertsFromTrustAnchors':
22:52.90 pkix_build.c:1548:38: warning: comparison between signed and unsigned integer expressions [-Wsign-compare]
22:53.93 pkix_pl_cert.c: In function 'PKIX_PL_Cert_Create':
22:53.93 pkix_pl_cert.c:1518:22: warning: variable 'copyDER' set but not used [-Wunused-but-set-variable]
22:54.30 pkix_pl_lifecycle.c: In function 'pkix_pl_lifecycle_ObjectLeakCheck':
22:54.30 pkix_pl_lifecycle.c:87:55: warning: comparison between signed and unsigned integer expressions [-Wsign-compare]
22:54.30 pkix_pl_lifecycle.c: In function 'PKIX_PL_Shutdown':
22:54.30 pkix_pl_lifecycle.c:248:21: warning: variable 'numLeakedObjects' set but not used [-Wunused-but-set-variable]
22:55.16 pkix_pl_httpdefaultclient.c: In function 'pkix_pl_HttpDefaultClient_HdrCheckComplete':
22:55.16 pkix_pl_httpdefaultclient.c:268:32: warning: comparison between signed and unsigned integer expressions [-Wsign-compare]
22:55.16 pkix_pl_httpdefaultclient.c:285:41: warning: comparison between signed and unsigned integer expressions [-Wsign-compare]
22:55.16 pkix_pl_httpdefaultclient.c:293:40: warning: comparison between signed and unsigned integer expressions [-Wsign-compare]
22:55.16 pkix_pl_httpdefaultclient.c: In function 'pkix_pl_HttpDefaultClient_RecvBody':
22:55.16 pkix_pl_httpdefaultclient.c:925:39: warning: comparison between signed and unsigned integer expressions [-Wsign-compare]
22:55.16 pkix_pl_httpdefaultclient.c:940:31: warning: comparison between signed and unsigned integer expressions [-Wsign-compare]
22:55.16 pkix_pl_httpdefaultclient.c:945:31: warning: comparison between signed and unsigned integer expressions [-Wsign-compare]
22:55.16 pkix_pl_httpdefaultclient.c:951:38: warning: comparison between signed and unsigned integer expressions [-Wsign-compare]
22:55.16 pkix_pl_httpdefaultclient.c:995:39: warning: comparison between signed and unsigned integer expressions [-Wsign-compare]
22:55.16 pkix_pl_httpdefaultclient.c:1005:43: warning: comparison between signed and unsigned integer expressions [-Wsign-compare]
22:55.16 pkix_pl_httpdefaultclient.c: In function 'pkix_pl_HttpDefaultClient_KeepAliveSession':
22:55.16 pkix_pl_httpdefaultclient.c:1135:36: warning: variable 'client' set but not used [-Wunused-but-set-variable]
22:55.16 pkix_pl_httpdefaultclient.c: In function 'pkix_pl_HttpDefaultClient_TrySendAndReceive':
22:55.16 pkix_pl_httpdefaultclient.c:1429:63: warning: comparison between signed and unsigned integer expressions [-Wsign-compare]
22:55.16 pkix_pl_httpdefaultclient.c: In function 'pkix_pl_HttpDefaultClient_Cancel':
22:55.16 pkix_pl_httpdefaultclient.c:1487:36: warning: variable 'client' set but not used [-Wunused-but-set-variable]
22:55.39 pkix_pl_crl.c: In function 'pkix_pl_CRL_ToString':
22:55.39 pkix_pl_crl.c:455:58: warning: 'crlVersion' may be used uninitialized in this function [-Wmaybe-uninitialized]
22:55.39 pkix_pl_crl.c:354:21: note: 'crlVersion' was declared here
22:55.41 pkix_pl_object.c: In function 'pkix_pl_Object_GetHeader':
22:55.41 pkix_pl_object.c:115:34: warning: comparison between signed and unsigned integer expressions [-Wsign-compare]
22:56.48 pkix_pl_ldaprequest.c: In function 'pkix_pl_LdapRequest_Destroy':
22:56.48 pkix_pl_ldaprequest.c:266:30: warning: variable 'ldapRq' set but not used [-Wunused-but-set-variable]
22:57.20 nssinit.c: In function 'NSS_VersionCheck':
22:57.20 nssinit.c:1250:19: warning: variable 'c' set but not used [-Wunused-but-set-variable]
22:57.39 pkix_pl_ldapdefaultclient.c: In function 'pkix_pl_LdapDefaultClient_VerifyBindResponse':
22:57.39 pkix_pl_ldapdefaultclient.c:371:21: warning: '*((void *)&msg+16).resultCode.data' may be used uninitialized in this function [-Wmaybe-uninitialized]
22:57.39 pkix_pl_ldapdefaultclient.c:354:21: note: '*((void *)&msg+16).resultCode.data' was declared here
22:58.20 pkix_pl_publickey.c: In function 'pkix_pl_PublicKey_Hashcode':
22:58.20 pkix_pl_publickey.c:214:21: warning: variable 'fullHash' set but not used [-Wunused-but-set-variable]
22:58.24 pkix_pl_pk11certstore.c: In function 'NameCacheHasFetchedCrlInfo':
22:58.24 pkix_pl_pk11certstore.c:382:22: warning: variable 'cert' set but not used [-Wunused-but-set-variable]
22:58.24 pkix_pl_pk11certstore.c: In function 'RemovePartitionedDpsFromList':
22:58.24 pkix_pl_pk11certstore.c:701:20: warning: comparison between signed and unsigned integer expressions [-Wsign-compare]
22:58.24 pkix_pl_pk11certstore.c: In function 'DownloadCrl':
22:58.24 pkix_pl_pk11certstore.c:782:16: warning: variable 'savedError' set but not used [-Wunused-but-set-variable]
22:58.62 nsTestSample.o
22:58.85 nsTestSample
22:58.98 ShowSSEConfig.o
22:59.03 ShowSSEConfig
22:59.06 dtlscon.c: In function 'ssl3_DisableNonDTLSSuites':
22:59.06 dtlscon.c:107:19: warning: unused variable 'rv' [-Wunused-variable]
22:59.06 dtlscon.c: In function 'dtls_HandleHandshake':
22:59.06 dtlscon.c:399:37: warning: comparison between signed and unsigned integer expressions [-Wsign-compare]
22:59.06 dtlscon.c:428:48: warning: comparison between signed and unsigned integer expressions [-Wsign-compare]
22:59.06 dtlscon.c: In function 'dtls_TransmitMessageFlight':
22:59.06 dtlscon.c:679:60: warning: comparison between signed and unsigned integer expressions [-Wsign-compare]
22:59.06 dtlscon.c:679:120: warning: signed and unsigned type in conditional expression [-Wsign-compare]
22:59.06 dtlscon.c:717:26: warning: comparison between signed and unsigned integer expressions [-Wsign-compare]
22:59.06 dtlscon.c: In function 'dtls_SetMTU':
22:59.06 dtlscon.c:952:19: warning: comparison between signed and unsigned integer expressions [-Wsign-compare]
22:59.38 ssl3gthr.c: In function 'ssl3_GatherData':
22:59.38 ssl3gthr.c:75:9: warning: comparison between signed and unsigned integer expressions [-Wsign-compare]
22:59.61 certread.c: In function 'CERT_DecodeCertPackage':
22:59.61 certread.c:419:16: warning: comparison between signed and unsigned integer expressions [-Wsign-compare]
22:59.61 certread.c:447:13: warning: comparison between signed and unsigned integer expressions [-Wsign-compare]
23:00.16 p12e.c: In function 'sec_PKCS12CreateSafeBag':
23:00.16 p12e.c:698:12: warning: variable 'setName' set but not used [-Wunused-but-set-variable]
23:00.16 p12e.c: In function 'sec_pkcs12_encoder_start_context':
23:00.16 p12e.c:1535:12: warning: variable 'rv' set but not used [-Wunused-but-set-variable]
23:00.54 p7decode.c: In function 'sec_pkcs7_verify_signature':
23:00.54 p7decode.c:1293:21: warning: variable 'crls' set but not used [-Wunused-but-set-variable]
23:00.82 p7encode.c: In function 'sec_pkcs7_encoder_start_encrypt':
23:00.82 p7encode.c:62:18: warning: variable 'wincx' set but not used [-Wunused-but-set-variable]
23:00.98 p12d.c: In function 'SEC_PKCS12DecoderRenameCertNicknames':
23:00.98 p12d.c:2813:5: warning: suggest parentheses around assignment used as truth value [-Wparentheses]
23:01.10 p7local.c: In function 'sec_PKCS7Decrypt':
23:01.10 p7local.c:556:28: warning: comparison between signed and unsigned integer expressions [-Wsign-compare]
23:01.58 /opt/FirefoxSource/mozilla-release/config/external/nss/nss.def: WARNING: no preprocessor directives found
23:01.60 /opt/FirefoxSource/mozilla-release/config/external/nss/nspr-dummy.def: WARNING: no preprocessor directives found
23:01.88 cmscipher.c: In function 'NSS_CMSCipherContext_Decrypt':
23:01.88 cmscipher.c:525:28: warning: comparison between signed and unsigned integer expressions [-Wsign-compare]
23:01.90 ssl3con.c: In function 'ssl3_CompressMACEncryptRecord':
23:01.90 ssl3con.c:2559:12: warning: comparison between signed and unsigned integer expressions [-Wsign-compare]
23:01.90 ssl3con.c: In function 'ssl3_FlushHandshakeMessages':
23:01.90 ssl3con.c:3122:19: warning: comparison between signed and unsigned integer expressions [-Wsign-compare]
23:01.90 ssl3con.c: In function 'ssl3_HandleClientHello':
23:01.90 ssl3con.c:7781:23: warning: comparison between signed and unsigned integer expressions [-Wsign-compare]
23:01.90 ssl3con.c:8285:28: warning: comparison between signed and unsigned integer expressions [-Wsign-compare]
23:01.90 ssl3con.c: In function 'ssl3_HandleRSAClientKeyExchange':
23:01.90 ssl3con.c:9211:13: warning: variable 'pmsItem' set but not used [-Wunused-but-set-variable]
23:01.90 ssl3con.c:9207:12: warning: variable 'isTLS' set but not used [-Wunused-but-set-variable]
23:01.90 ssl3con.c: In function 'ssl3_HandleCertificateStatus':
23:01.90 ssl3con.c:9779:13: warning: comparison between signed and unsigned integer expressions [-Wsign-compare]
23:01.90 ssl3con.c: In function 'ssl3_HandleHandshakeMessage':
23:01.90 ssl3con.c:6950:22: warning: 'preferSha1' may be used uninitialized in this function [-Wmaybe-uninitialized]
23:01.90 ssl3con.c:6916:12: note: 'preferSha1' was declared here
23:01.90 ssl3con.c: In function 'ssl3_HandleRecord':
23:01.90 ssl3con.c:11589:21: warning: 'dtls_seq_num' may be used uninitialized in this function [-Wmaybe-uninitialized]
23:01.90 ssl3con.c:11309:14: note: 'dtls_seq_num' was declared here
23:02.09 sslauth.c: In function 'SSL_AuthCertificate':
23:02.09 sslauth.c:267:18: warning: unused variable 'error' [-Wunused-variable]
23:02.28 crmfpop.c: In function 'CRMF_CertReqMsgSetRAVerifiedPOP':
23:02.28 crmfpop.c:36:14: warning: variable 'dummy' set but not used [-Wunused-but-set-variable]
23:02.28 crmfpop.c: In function 'crmf_generic_encoder_callback':
23:02.28 crmfpop.c:119:38: warning: comparison between signed and unsigned integer expressions [-Wsign-compare]
23:02.28 crmfpop.c: In function 'crmf_encode_popoprivkey':
23:02.28 crmfpop.c:349:33: warning: comparison between signed and unsigned integer expressions [-Wsign-compare]
23:02.78 cmsencode.c: In function 'nss_cms_encoder_notify':
23:02.78 cmsencode.c:125:18: warning: variable 'poolp' set but not used [-Wunused-but-set-variable]
23:02.78 cmsencode.c: In function 'nss_cms_before_data':
23:02.78 cmsencode.c:204:18: warning: variable 'poolp' set but not used [-Wunused-but-set-variable]
23:02.98 crmfcont.c: In function 'CRMF_CreateEncryptedKeyWithEncryptedValue':
23:02.98 crmfcont.c:860:25: warning: variable 'dummy' set but not used [-Wunused-but-set-variable]
23:02.99 sslcon.c: In function 'ssl2_SendClear':
23:02.99 sslcon.c:865:17: warning: comparison between signed and unsigned integer expressions [-Wsign-compare]
23:02.99 sslcon.c:894:19: warning: comparison between signed and unsigned integer expressions [-Wsign-compare]
23:02.99 sslcon.c: In function 'ssl2_SendStream':
23:02.99 sslcon.c:944:13: warning: comparison between signed and unsigned integer expressions [-Wsign-compare]
23:02.99 sslcon.c:991:19: warning: comparison between signed and unsigned integer expressions [-Wsign-compare]
23:02.99 sslcon.c: In function 'ssl2_SendBlock':
23:02.99 sslcon.c:1058:13: warning: comparison between signed and unsigned integer expressions [-Wsign-compare]
23:02.99 sslcon.c: In function 'ssl2_ServerSetupSessionCypher':
23:02.99 sslcon.c:1624:15: warning: comparison between signed and unsigned integer expressions [-Wsign-compare]
23:02.99 sslcon.c:1648:20: warning: comparison between signed and unsigned integer expressions [-Wsign-compare]
23:02.99 sslcon.c: In function 'ssl2_HandleMessage':
23:02.99 sslcon.c:2498:9: warning: variable 'rv2' set but not used [-Wunused-but-set-variable]
23:02.99 sslcon.c: In function 'ssl2_HandleServerHelloMessage':
23:02.99 sslcon.c:2802:51: warning: comparison between signed and unsigned integer expressions [-Wsign-compare]
23:02.99 sslcon.c:2813:16: warning: comparison between signed and unsigned integer expressions [-Wsign-compare]
23:02.99 sslcon.c:2815:23: warning: comparison between signed and unsigned integer expressions [-Wsign-compare]
23:02.99 sslcon.c:2815:65: warning: signed and unsigned type in conditional expression [-Wsign-compare]
23:02.99 sslcon.c: In function 'NSSSSL_VersionCheck':
23:02.99 sslcon.c:3687:19: warning: variable 'c' set but not used [-Wunused-but-set-variable]
23:03.44 cmsrecinfo.c: In function 'NSS_CMSRecipientInfo_UnwrapBulkKey':
23:03.44 cmsrecinfo.c:529:21: warning: variable 'encalg' set but not used [-Wunused-but-set-variable]
23:03.64 cmmfchal.c: In function 'cmmf_create_witness_and_challenge':
23:03.64 cmmfchal.c:33:22: warning: variable 'id' set but not used [-Wunused-but-set-variable]
23:04.25 ssl3ext.c: In function 'arrayContainsExtension':
23:04.25 ssl3ext.c:310:19: warning: comparison between signed and unsigned integer expressions [-Wsign-compare]
23:04.25 ssl3ext.c: In function 'ssl3_HandleServerNameXtn':
23:04.25 ssl3ext.c:417:43: warning: comparison between signed and unsigned integer expressions [-Wsign-compare]
23:04.25 ssl3ext.c:425:17: warning: variable 'type' set but not used [-Wunused-but-set-variable]
23:04.25 ssl3ext.c:457:22: warning: comparison between signed and unsigned integer expressions [-Wsign-compare]
23:04.25 ssl3ext.c:458:31: warning: comparison between signed and unsigned integer expressions [-Wsign-compare]
23:04.25 ssl3ext.c: In function 'ssl3_SendSessionTicketXtn':
23:04.25 ssl3ext.c:538:28: warning: comparison between signed and unsigned integer expressions [-Wsign-compare]
23:04.25 ssl3ext.c:561:25: warning: comparison between signed and unsigned integer expressions [-Wsign-compare]
23:04.25 ssl3ext.c: In function 'ssl3_ServerHandleAppProtoXtn':
23:04.25 ssl3ext.c:681:15: warning: comparison between signed and unsigned integer expressions [-Wsign-compare]
23:04.25 ssl3ext.c: In function 'ssl3_ClientSendNextProtoNegoXtn':
23:04.25 ssl3ext.c:782:28: warning: comparison between signed and unsigned integer expressions [-Wsign-compare]
23:04.25 ssl3ext.c:792:25: warning: comparison between signed and unsigned integer expressions [-Wsign-compare]
23:04.25 ssl3ext.c: In function 'ssl3_ClientSendAppProtoXtn':
23:04.25 ssl3ext.c:817:28: warning: comparison between signed and unsigned integer expressions [-Wsign-compare]
23:04.25 ssl3ext.c:857:25: warning: comparison between signed and unsigned integer expressions [-Wsign-compare]
23:04.25 ssl3ext.c: In function 'ssl3_ServerSendAppProtoXtn':
23:04.25 ssl3ext.c:886:28: warning: comparison between signed and unsigned integer expressions [-Wsign-compare]
23:04.25 ssl3ext.c:905:25: warning: comparison between signed and unsigned integer expressions [-Wsign-compare]
23:04.25 ssl3ext.c: In function 'ssl3_ServerSendStatusRequestXtn':
23:04.25 ssl3ext.c:953:28: warning: comparison between signed and unsigned integer expressions [-Wsign-compare]
23:04.26 ssl3ext.c: In function 'ssl3_ClientSendStatusRequestXtn':
23:04.26 ssl3ext.c:986:28: warning: comparison between signed and unsigned integer expressions [-Wsign-compare]
23:04.26 ssl3ext.c:1014:25: warning: comparison between signed and unsigned integer expressions [-Wsign-compare]
23:04.26 ssl3ext.c: In function 'ssl3_SendNewSessionTicket':
23:04.26 ssl3ext.c:1250:19: warning: comparison between signed and unsigned integer expressions [-Wsign-compare]
23:04.26 ssl3ext.c: In function 'ssl3_ServerHandleSessionTicketXtn':
23:04.26 ssl3ext.c:1589:23: warning: comparison between signed and unsigned integer expressions [-Wsign-compare]
23:04.26 ssl3ext.c: In function 'ssl3_SendRenegotiationInfoXtn':
23:04.26 ssl3ext.c:1983:28: warning: comparison between signed and unsigned integer expressions [-Wsign-compare]
23:04.26 ssl3ext.c: In function 'ssl3_ClientSendSigAlgsXtn':
23:04.26 ssl3ext.c:2358:28: warning: comparison between signed and unsigned integer expressions [-Wsign-compare]
23:04.26 ssl3ext.c:2372:25: warning: comparison between signed and unsigned integer expressions [-Wsign-compare]
23:04.26 ssl3ext.c: In function 'ssl3_ClientSendDraftVersionXtn':
23:04.26 ssl3ext.c:2448:28: warning: comparison between signed and unsigned integer expressions [-Wsign-compare]
23:04.26 ssl3ext.c:2461:25: warning: comparison between signed and unsigned integer expressions [-Wsign-compare]
23:05.00 smimeutil.c: In function 'NSSSMIME_VersionCheck':
23:05.00 smimeutil.c:772:19: warning: variable 'c' set but not used [-Wunused-but-set-variable]
23:05.11 basicutil.c: In function 'SECU_PrintPRandOSError':
23:05.11 basicutil.c:628:30: warning: comparison between signed and unsigned integer expressions [-Wsign-compare]
23:05.11 basicutil.c:632:30: warning: comparison between signed and unsigned integer expressions [-Wsign-compare]
23:05.11 basicutil.c: In function 'SECU_SECItemHexStringToBinary':
23:05.11 basicutil.c:705:16: warning: comparison between signed and unsigned integer expressions [-Wsign-compare]
23:05.11 basicutil.c:716:16: warning: comparison between signed and unsigned integer expressions [-Wsign-compare]
23:05.11 basicutil.c: In function 'SECU_PrintAsHex':
23:05.11 basicutil.c:286:13: warning: 'column' may be used uninitialized in this function [-Wmaybe-uninitialized]
23:05.45 sslsecur.c: In function 'SSL_ConfigSecureServerWithCertChain':
23:05.45 sslsecur.c:847:5: warning: comparison of unsigned expression < 0 is always false [-Wtype-limits]
23:05.45 sslsecur.c: In function 'ssl_SecureRecv':
23:05.45 sslsecur.c:1180:22: warning: variable 'sec' set but not used [-Wunused-but-set-variable]
23:05.48 derprint.c: In function 'prettyPrintLength':
23:05.48 derprint.c:454:20: warning: comparison between signed and unsigned integer expressions [-Wsign-compare]
23:06.27 secutil.c: In function 'SECU_ChangePW2':
23:06.27 secutil.c:336:15: warning: variable 'rv' set but not used [-Wunused-but-set-variable]
23:06.27 secutil.c: In function 'SECU_PrintDumpDerIssuerAndSerial':
23:06.27 secutil.c:1554:19: warning: comparison between signed and unsigned integer expressions [-Wsign-compare]
23:06.27 secutil.c: In function 'SECU_PrintCertificateBasicInfo':
23:06.27 secutil.c:2420:9: warning: unused variable 'iv' [-Wunused-variable]
23:06.27 secutil.c: In function 'secu_PrintPKCS7Signed':
23:06.27 secutil.c:2746:11: warning: passing argument 5 of 'SECU_PrintSignedData' from incompatible pointer type [enabled by default]
23:06.28 In file included from secutil.c:19:0:
23:06.28 secutil.h:263:12: note: expected 'SECU_PPFunc' but argument is of type 'int (*)(struct FILE *, const struct SECItem *, const char *, int)'
23:06.28 secutil.c: In function 'secu_PrintPKCS7SignedAndEnveloped':
23:06.28 secutil.c:2865:11: warning: passing argument 5 of 'SECU_PrintSignedData' from incompatible pointer type [enabled by default]
23:06.28 In file included from secutil.c:19:0:
23:06.28 secutil.h:263:12: note: expected 'SECU_PPFunc' but argument is of type 'int (*)(struct FILE *, const struct SECItem *, const char *, int)'
23:06.28 secutil.c: In function 'SEC_PrintCertificateAndTrust':
23:06.28 secutil.c:3195:10: warning: passing argument 5 of 'SECU_PrintSignedData' from incompatible pointer type [enabled by default]
23:06.28 secutil.c:3168:5: note: expected 'SECU_PPFunc' but argument is of type 'int (*)(struct FILE *, const struct SECItem *, const char *, int)'
23:06.28 secutil.c: In function 'SECU_StoreCRL':
23:06.28 secutil.c:3367:62: warning: comparison between signed and unsigned integer expressions [-Wsign-compare]
23:06.58 jarsign.c: In function 'jar_create_pk7':
23:06.58 jarsign.c:174:11: warning: variable 'errstring' set but not used [-Wunused-but-set-variable]
23:06.79 jar.c: In function 'JAR_find_next':
23:06.79 jar.c:423:30: warning: comparison between signed and unsigned integer expressions [-Wsign-compare]
23:06.79 jar.c: In function 'jar_find_first_cert':
23:06.79 jar.c:462:24: warning: comparison between signed and unsigned integer expressions [-Wsign-compare]
23:06.85 sslsock.c: In function 'ssl_WriteV':
23:06.85 sslsock.c:2524:30: warning: comparison between signed and unsigned integer expressions [-Wsign-compare]
23:06.85 sslsock.c:2537:68: warning: comparison between signed and unsigned integer expressions [-Wsign-compare]
23:06.85 sslsock.c:2556:28: warning: comparison between signed and unsigned integer expressions [-Wsign-compare]
23:06.85 sslsock.c:2556:59: warning: signed and unsigned type in conditional expression [-Wsign-compare]
23:06.85 sslsock.c:2559:23: warning: comparison between signed and unsigned integer expressions [-Wsign-compare]
23:06.85 sslsock.c:2565:56: warning: comparison between signed and unsigned integer expressions [-Wsign-compare]
23:07.07 sslinfo.c: In function 'SSL_DisableDefaultExportCipherSuites':
23:07.07 sslinfo.c:247:15: warning: variable 'rv' set but not used [-Wunused-but-set-variable]
23:07.07 sslinfo.c: In function 'SSL_DisableExportCipherSuites':
23:07.07 sslinfo.c:268:15: warning: variable 'rv' set but not used [-Wunused-but-set-variable]
23:07.09 jarfile.c: In function 'jar_physical_inflate':
23:07.09 jarfile.c:341:32: warning: comparison between signed and unsigned integer expressions [-Wsign-compare]
23:07.09 jarfile.c:356:38: warning: comparison between signed and unsigned integer expressions [-Wsign-compare]
23:07.09 jarfile.c: In function 'jar_extract_mf':
23:07.09 jarfile.c:578:14: warning: comparison between signed and unsigned integer expressions [-Wsign-compare]
23:07.09 jarfile.c: In function 'jar_listzip':
23:07.09 jarfile.c:702:47: warning: comparison between signed and unsigned integer expressions [-Wsign-compare]
23:07.09 jarfile.c:768:43: warning: comparison between signed and unsigned integer expressions [-Wsign-compare]
23:07.09 jarfile.c: In function 'jar_listtar':
23:07.09 jarfile.c:830:45: warning: comparison between signed and unsigned integer expressions [-Wsign-compare]
23:07.09 jarfile.c:824:12: warning: variable 'when' set but not used [-Wunused-but-set-variable]
23:07.09 jarfile.c:823:14: warning: variable 'mode' set but not used [-Wunused-but-set-variable]
23:07.30 ssl3ecc.c: In function 'ssl3_DisableECCSuites':
23:07.30 ssl3ecc.c:969:19: warning: unused variable 'rv' [-Wunused-variable]
23:07.30 ssl3ecc.c: In function 'ssl3_SendSupportedCurvesXtn':
23:07.30 ssl3ecc.c:1130:28: warning: comparison between signed and unsigned integer expressions [-Wsign-compare]
23:07.30 ssl3ecc.c: In function 'ssl3_HandleSupportedCurvesXtn':
23:07.30 ssl3ecc.c:1238:35: warning: comparison between signed and unsigned integer expressions [-Wsign-compare]
23:07.32 libnss3.so
23:09.98 shlibsign.c: In function 'writeItem':
23:09.98 shlibsign.c:150:22: warning: comparison between signed and unsigned integer expressions [-Wsign-compare]
23:09.98 shlibsign.c: In function 'main':
23:09.98 shlibsign.c:908:40: warning: comparison between signed and unsigned integer expressions [-Wsign-compare]
23:10.00 cd mangle; /usr/bin/make libs
23:10.68 loader.c: In function 'freebl_LoadDSO':
23:10.68 loader.c:135:14: warning: variable 'status' set but not used [-Wunused-but-set-variable]
23:10.68 loader.c: In function 'BL_Unload':
23:10.68 loader.c:904:20: warning: unused variable 'status' [-Wunused-variable]
23:10.74 mkdir: das Verzeichnis „/opt/FirefoxSource/mozilla-release/objdir-droid/security/nss/lib/freebl“ kann nicht angelegt werden: Die Datei existiert bereits
23:10.88 ldvector.c: In function 'FREEBL_GetVector':
23:10.88 ldvector.c:301:19: warning: variable 'c' set but not used [-Wunused-but-set-variable]
23:11.69 token.c: In function 'nssCKFWToken_GetUTCTime':
23:11.69 token.c:1261:27: warning: variable 'z' set but not used [-Wunused-but-set-variable]
23:12.38 keystuff.c: In function 'UpdateRNG':
23:12.38 keystuff.c:96:18: warning: comparison between signed and unsigned integer expressions [-Wsign-compare]
23:12.82 pk12util.c: In function 'P12U_ListPKCS12File':
23:12.82 pk12util.c:759:30: warning: passing argument 5 of 'SECU_PrintSignedData' from incompatible pointer type [enabled by default]
23:12.82 In file included from pk12util.c:11:0:
23:12.82 /opt/FirefoxSource/mozilla-release/objdir-droid/dist/private/nss/secutil.h:263:12: note: expected 'SECU_PPFunc' but argument is of type 'int (*)(struct FILE *, const struct SECItem *, const char *, int)'
23:12.88 cd builtins; /usr/bin/make libs
23:13.31 sha512.c: In function 'SHA512_Compress':
23:13.31 sha512.c:933:14: warning: unused variable 't1' [-Wunused-variable]
23:13.31 sha512.c:955:18: warning: unused variable 't2' [-Wunused-variable]
23:13.31 sha512.c:955:14: warning: unused variable 't1' [-Wunused-variable]
23:13.31 sha512.c: In function 'SHA512_End':
23:13.31 sha512.c:1229:14: warning: unused variable 't1' [-Wunused-variable]
23:13.31 sha512.c: In function 'SHA512_EndRaw':
23:13.31 sha512.c:1274:14: warning: unused variable 't1' [-Wunused-variable]
23:13.42 bfind.c: In function 'builtins_attrmatch':
23:13.42 bfind.c:122:11: warning: comparison between signed and unsigned integer expressions [-Wsign-compare]
23:13.50 rawhash.c: In function 'HASH_GetRawHashObject':
23:13.50 rawhash.c:156:5: warning: comparison of unsigned expression < 0 is always false [-Wtype-limits]
23:13.53 binst.c: In function 'builtins_mdInstance_GetLibraryVersion':
23:13.54 binst.c:70:17: warning: variable 'c' set but not used [-Wunused-but-set-variable]
23:13.65 pk11.c: In function 'ListModule':
23:13.65 pk11.c:612:16: warning: comparison between signed and unsigned integer expressions [-Wsign-compare]
23:14.24 ytab.c: In function 'Pk11Install_yyparse':
23:14.24 ytab.c:219:5: warning: suggest parentheses around assignment used as truth value [-Wparentheses]
23:14.84 cts.c: In function 'CTS_DecryptUpdate':
23:14.84 cts.c:226:23: warning: comparison between signed and unsigned integer expressions [-Wsign-compare]
23:14.96 lex.Pk11Install_yy.cpp:1060:13: warning: 'Pkcs11Install_yyunput' defined but not used [-Wunused-function]
23:14.96 lex.Pk11Install_yy.cpp:1106:12: warning: 'input' defined but not used [-Wunused-function]
23:15.05 gcm.c: In function 'gcm_getX':
23:15.05 gcm.c:223:13: warning: comparison between signed and unsigned integer expressions [-Wsign-compare]
23:15.41 dh.c: In function 'DH_Derive':
23:15.41 dh.c:271:13: warning: comparison between signed and unsigned integer expressions [-Wsign-compare]
23:15.56 ecdecode.c: In function 'gf_populate_params':
23:15.56 ecdecode.c:120:5: warning: comparison of unsigned expression < 0 is always false [-Wtype-limits]
23:15.65 ec.c: In function 'ec_points_mul':
23:15.65 ec.c:89:17: warning: comparison between signed and unsigned integer expressions [-Wsign-compare]
23:15.65 ec.c: In function 'EC_ValidatePublicKey':
23:15.65 ec.c:450:33: warning: comparison between signed and unsigned integer expressions [-Wsign-compare]
23:15.88 dsa.c: In function 'DSA_VerifyDigest':
23:15.88 dsa.c:518:25: warning: comparison between signed and unsigned integer expressions [-Wsign-compare]
23:15.88 dsa.c:530:27: warning: comparison between signed and unsigned integer expressions [-Wsign-compare]
23:16.14 pqg.c: In function 'makePrimefromPrimesShaweTaylor':
23:16.14 pqg.c:617:34: warning: comparison between signed and unsigned integer expressions [-Wsign-compare]
23:16.14 pqg.c:687:28: warning: comparison between signed and unsigned integer expressions [-Wsign-compare]
23:16.14 pqg.c: In function 'makePrimefromSeedShaweTaylor':
23:16.14 pqg.c:849:28: warning: comparison between signed and unsigned integer expressions [-Wsign-compare]
23:16.14 pqg.c: In function 'pqg_ParamGen':
23:16.14 pqg.c:1232:18: warning: variable 'b' set but not used [-Wunused-but-set-variable]
23:16.14 pqg.c: In function 'PQG_VerifyParams':
23:16.14 pqg.c:1614:50: warning: comparison between signed and unsigned integer expressions [-Wsign-compare]
23:16.14 pqg.c:1672:25: warning: comparison between signed and unsigned integer expressions [-Wsign-compare]
23:16.14 pqg.c:1708:18: warning: comparison between signed and unsigned integer expressions [-Wsign-compare]
23:16.14 pqg.c:1709:25: warning: comparison between signed and unsigned integer expressions [-Wsign-compare]
23:16.14 pqg.c:1710:33: warning: comparison between signed and unsigned integer expressions [-Wsign-compare]
23:16.14 pqg.c:1733:29: warning: comparison between signed and unsigned integer expressions [-Wsign-compare]
23:16.14 pqg.c:1775:27: warning: 'type' may be used uninitialized in this function [-Wmaybe-uninitialized]
23:16.14 pqg.c:1595:16: note: 'type' was declared here
23:16.14 pqg.c:1777:5: warning: 'hashtype' may be used uninitialized in this function [-Wmaybe-uninitialized]
23:16.14 pqg.c:1594:19: note: 'hashtype' was declared here
23:16.39 shvfy.c: In function 'readItem':
23:16.39 shvfy.c:267:19: warning: comparison between signed and unsigned integer expressions [-Wsign-compare]
23:16.39 rsa.c: In function 'RSA_NewKey':
23:16.39 rsa.c:251:29: warning: comparison between signed and unsigned integer expressions [-Wsign-compare]
23:16.39 rsa.c: In function 'rsa_get_primes_from_exponents':
23:16.39 rsa.c:482:52: warning: comparison between signed and unsigned integer expressions [-Wsign-compare]
23:16.86 mpi/mpprime.c: In function 'mpp_make_prime':
23:16.86 mpi/mpprime.c:445:47: warning: comparison between signed and unsigned integer expressions [-Wsign-compare]
23:17.02 mpi/mplogic.c: In function 'mpl_num_set':
23:17.02 mpi/mplogic.c:230:20: warning: comparison between signed and unsigned integer expressions [-Wsign-compare]
23:17.02 mpi/mplogic.c: In function 'mpl_num_clear':
23:17.02 mpi/mplogic.c:260:20: warning: comparison between signed and unsigned integer expressions [-Wsign-compare]
23:18.55 mpi/mpi.c: In function 'mp_expt':
23:18.55 mpi/mpi.c:1114:20: warning: comparison between signed and unsigned integer expressions [-Wsign-compare]
23:18.55 mpi/mpi.c:1118:22: warning: comparison between signed and unsigned integer expressions [-Wsign-compare]
23:18.55 mpi/mpi.c: In function 's_mp_exptmod':
23:18.55 mpi/mpi.c:1497:20: warning: comparison between signed and unsigned integer expressions [-Wsign-compare]
23:18.55 mpi/mpi.c:1501:22: warning: comparison between signed and unsigned integer expressions [-Wsign-compare]
23:18.55 mpi/mpi.c: In function 'mp_trailing_zeros':
23:18.55 mpi/mpi.c:2012:45: warning: comparison between signed and unsigned integer expressions [-Wsign-compare]
23:18.55 mpi/mpi.c: In function 's_mp_fixup_reciprocal':
23:18.55 mpi/mpi.c:2164:19: warning: comparison between signed and unsigned integer expressions [-Wsign-compare]
23:18.55 mpi/mpi.c:2164:51: warning: signed and unsigned type in conditional expression [-Wsign-compare]
23:18.55 mpi/mpi.c:2166:11: warning: comparison between signed and unsigned integer expressions [-Wsign-compare]
23:18.55 mpi/mpi.c: In function 's_mp_lshd':
23:18.55 mpi/mpi.c:2938:18: warning: comparison between signed and unsigned integer expressions [-Wsign-compare]
23:18.55 mpi/mpi.c: In function 's_mp_mul_2':
23:18.55 mpi/mpi.c:3063:12: warning: comparison between signed and unsigned integer expressions [-Wsign-compare]
23:18.55 mpi/mpi.c: In function 's_mp_todigit':
23:18.55 mpi/mpi.c:4600:10: warning: comparison between signed and unsigned integer expressions [-Wsign-compare]
23:18.55 mpi/mpi.c: In function 'mp_to_unsigned_octets':
23:18.55 mpi/mpi.c:4720:29: warning: comparison between signed and unsigned integer expressions [-Wsign-compare]
23:18.55 mpi/mpi.c: In function 'mp_to_signed_octets':
23:18.55 mpi/mpi.c:4752:29: warning: comparison between signed and unsigned integer expressions [-Wsign-compare]
23:18.55 mpi/mpi.c:4766:20: warning: comparison between signed and unsigned integer expressions [-Wsign-compare]
23:18.55 mpi/mpi.c:4767:18: warning: comparison between signed and unsigned integer expressions [-Wsign-compare]
23:18.55 mpi/mpi.c: In function 'mp_to_fixlen_octets':
23:18.55 mpi/mpi.c:4792:29: warning: comparison between signed and unsigned integer expressions [-Wsign-compare]
23:18.55 mpi/mpi.c:4795:16: warning: comparison between signed and unsigned integer expressions [-Wsign-compare]
23:18.64 ecl/ecp_521.c: In function 'ec_GFp_nistp521_mod':
23:18.64 ecl/ecp_521.c:42:73: warning: comparison between signed and unsigned integer expressions [-Wsign-compare]
23:18.64 ecl/ecp_521.c:50:18: warning: comparison between signed and unsigned integer expressions [-Wsign-compare]
23:19.47 lgglue.c: In function 'sftkdb_resolvePath':
23:19.47 lgglue.c:44:24: warning: comparison between signed and unsigned integer expressions [-Wsign-compare]
23:19.85 lowpbe.c: In function 'nsspkcs5_PKCS12PBE':
23:19.85 lowpbe.c:519:22: warning: comparison between signed and unsigned integer expressions [-Wsign-compare]
23:20.48 pkcs11u.c: In function 'sftk_DeleteObject':
23:20.48 pkcs11u.c:1177:22: warning: unused variable 'to' [-Wunused-variable]
23:20.48 pkcs11u.c: In function 'sftk_NewTokenObject':
23:20.48 pkcs11u.c:1902:22: warning: variable 'tokObject' set but not used [-Wunused-but-set-variable]
23:20.91 pkcs11.c: In function 'sftk_GetPubKey':
23:20.91 pkcs11.c:1756:35: warning: comparison between signed and unsigned integer expressions [-Wsign-compare]
23:20.91 pkcs11.c:1764:35: warning: comparison between signed and unsigned integer expressions [-Wsign-compare]
23:20.91 pkcs11.c:1774:27: warning: comparison between signed and unsigned integer expressions [-Wsign-compare]
23:20.91 pkcs11.c: In function 'NSC_GetInfo':
23:20.91 pkcs11.c:3144:19: warning: variable 'c' set but not used [-Wunused-but-set-variable]
23:20.91 pkcs11.c: In function 'NSC_GetAttributeValue':
23:20.91 pkcs11.c:4314:58: warning: comparison between signed and unsigned integer expressions [-Wsign-compare]
23:20.91 pkcs11.c: In function 'sftk_emailhack':
23:20.91 pkcs11.c:4527:17: warning: comparison between signed and unsigned integer expressions [-Wsign-compare]
23:20.91 pkcs11.c: In function 'NSC_FindObjects':
23:20.91 pkcs11.c:4743:54: warning: signed and unsigned type in conditional expression [-Wsign-compare]
23:20.91 pkcs11.c: In function 'NSC_CreateObject':
23:20.91 pkcs11.c:4085:21: warning: 'moduleIndex' may be used uninitialized in this function [-Wmaybe-uninitialized]
23:20.91 pkcs11.c:4005:19: note: 'moduleIndex' was declared here
23:20.98 sdb.c: In function 'sdb_FindObjectsInit':
23:20.98 sdb.c:702:28: warning: comparison between signed and unsigned integer expressions [-Wsign-compare]
23:20.98 sdb.c:727:32: warning: comparison between signed and unsigned integer expressions [-Wsign-compare]
23:20.98 sdb.c: In function 'sdb_GetAttributeValueNoLock':
23:20.98 sdb.c:848:17: warning: comparison between signed and unsigned integer expressions [-Wsign-compare]
23:20.98 sdb.c:900:34: warning: comparison between signed and unsigned integer expressions [-Wsign-compare]
23:20.98 sdb.c: In function 'sdb_SetAttributeValue':
23:20.98 sdb.c:978:27: warning: comparison between signed and unsigned integer expressions [-Wsign-compare]
23:20.98 sdb.c:1007:17: warning: comparison between signed and unsigned integer expressions [-Wsign-compare]
23:20.98 sdb.c: In function 'sdb_CreateObject':
23:20.99 sdb.c:1138:42: warning: comparison between signed and unsigned integer expressions [-Wsign-compare]
23:20.99 sdb.c:1168:17: warning: comparison between signed and unsigned integer expressions [-Wsign-compare]
23:21.11 sftkhmac.c: In function 'sftk_HMACConstantTime_Update':
23:21.11 sftkhmac.c:149:15: warning: unused variable 'rv' [-Wunused-variable]
23:21.11 sftkhmac.c: In function 'sftk_SSLv3MACConstantTime_Update':
23:21.11 sftkhmac.c:163:15: warning: unused variable 'rv' [-Wunused-variable]
23:21.59 sftkdb.c: In function 'sftkdb_fixupTemplateOut':
23:21.59 sftkdb.c:328:22: warning: variable 'data' set but not used [-Wunused-but-set-variable]
23:21.59 sftkdb.c:345:69: warning: comparison between signed and unsigned integer expressions [-Wsign-compare]
23:21.59 sftkdb.c: In function 'sftk_signTemplate':
23:21.59 sftkdb.c:520:17: warning: comparison between signed and unsigned integer expressions [-Wsign-compare]
23:21.59 sftkdb.c: In function 'sftkdb_CreateObject':
23:21.59 sftkdb.c:576:12: warning: variable 'inTransaction' set but not used [-Wunused-but-set-variable]
23:21.59 sftkdb.c: In function 'sftk_ExtractTemplate':
23:21.59 sftkdb.c:619:17: warning: comparison between signed and unsigned integer expressions [-Wsign-compare]
23:21.59 sftkdb.c:632:17: warning: comparison between signed and unsigned integer expressions [-Wsign-compare]
23:21.59 sftkdb.c: In function 'sftkdb_resolveConflicts':
23:21.59 sftkdb.c:1045:13: warning: comparison between signed and unsigned integer expressions [-Wsign-compare]
23:21.59 sftkdb.c: In function 'sftkdb_FindObjects':
23:21.59 sftkdb.c:1261:14: warning: comparison between signed and unsigned integer expressions [-Wsign-compare]
23:21.59 sftkdb.c: In function 'sftkdb_GetObjectTemplate':
23:21.59 sftkdb.c:1613:14: warning: comparison between signed and unsigned integer expressions [-Wsign-compare]
23:21.59 sftkdb.c:1631:63: warning: comparison between signed and unsigned integer expressions [-Wsign-compare]
23:21.59 sftkdb.c: In function 'sftkdb_handleIDAndName':
23:21.59 sftkdb.c:2014:11: warning: variable 'crv' set but not used [-Wunused-but-set-variable]
23:21.60 sftkdb.c: In function 'sftkdb_mergeObject':
23:21.60 sftkdb.c:2196:17: warning: comparison between signed and unsigned integer expressions [-Wsign-compare]
23:21.60 sftkdb.c: In function 'sftkdb_Update':
23:21.60 sftkdb.c:2301:38: warning: comparison between signed and unsigned integer expressions [-Wsign-compare]
23:21.85 sftkpwd.c: In function 'sftk_updateMacs':
23:21.85 sftkpwd.c:908:17: warning: comparison between signed and unsigned integer expressions [-Wsign-compare]
23:21.85 sftkpwd.c:909:31: warning: comparison between signed and unsigned integer expressions [-Wsign-compare]
23:21.85 sftkpwd.c:930:17: warning: comparison between signed and unsigned integer expressions [-Wsign-compare]
23:21.85 sftkpwd.c:935:31: warning: comparison between signed and unsigned integer expressions [-Wsign-compare]
23:21.85 sftkpwd.c:868:11: warning: variable 'crv2' set but not used [-Wunused-but-set-variable]
23:21.85 sftkpwd.c:867:11: warning: variable 'crv' set but not used [-Wunused-but-set-variable]
23:21.85 sftkpwd.c: In function 'sftk_updateEncrypted':
23:21.85 sftkpwd.c:986:17: warning: comparison between signed and unsigned integer expressions [-Wsign-compare]
23:21.85 sftkpwd.c:993:31: warning: comparison between signed and unsigned integer expressions [-Wsign-compare]
23:21.85 sftkpwd.c: In function 'sftkdb_convertObjects':
23:21.85 sftkpwd.c:1125:38: warning: comparison between signed and unsigned integer expressions [-Wsign-compare]
23:22.08 pkcs11c.c: In function 'NSC_GenerateKeyPair':
23:22.08 pkcs11c.c:4340:9: warning: variable 'private_value_bits' set but not used [-Wunused-but-set-variable]
23:22.08 pkcs11c.c: In function 'sftk_PackagePrivateKey':
23:22.08 pkcs11c.c:4862:14: warning: variable 'fordebug' set but not used [-Wunused-but-set-variable]
23:22.08 pkcs11c.c: In function 'NSC_DeriveKey':
23:22.08 pkcs11c.c:6764:18: warning: comparison between signed and unsigned integer expressions [-Wsign-compare]
23:22.08 pkcs11c.c:6769:18: warning: comparison between signed and unsigned integer expressions [-Wsign-compare]
23:22.08 pkcs11c.c:6850:20: warning: comparison between signed and unsigned integer expressions [-Wsign-compare]
23:22.08 pkcs11c.c: In function 'NSC_GenerateKeyPair':
23:22.08 pkcs11c.c:4260:6: warning: 'subPrimeLen' may be used uninitialized in this function [-Wmaybe-uninitialized]
23:22.08 pkcs11c.c:4042:14: note: 'subPrimeLen' was declared here
23:22.08 pkcs11c.c:4212:23: warning: 'modulusLen' may be used uninitialized in this function [-Wmaybe-uninitialized]
23:22.09 pkcs11c.c:4041:14: note: 'modulusLen' was declared here
23:22.09 pkcs11c.c: In function 'NSC_GenerateKey':
23:22.09 pkcs11c.c:3968:13: warning: 'hashType' may be used uninitialized in this function [-Wmaybe-uninitialized]
23:22.16 libsqlite.a.desclibnspr.a.desc
23:22.17 libcrmf.a.desc
23:22.25 Unified_c_manager_ssl_src0.o
23:22.25 PSMContentListener.o
23:22.25 nsCryptoHash.o
23:22.42 nsNSSCertificateDB.o
23:22.78 libdombindings_test_s.a.desc
23:22.81 nsNSSComponent.o
23:23.08 nsNSSVersion.o
23:23.21 RegExp.o
23:23.21 CTypes.o
23:23.76 Unified_cpp_manager_ssl_src0.o
23:24.22 Unified_cpp_manager_ssl_src1.o
23:24.67 WriteArgument.o
23:24.78 WriteArgument
23:24.93 ssltunnel.o
23:24.98 Unified_cpp_manager_ssl_src2.o
23:26.35 ssltunnel
23:26.65 BadCertServer.o
23:26.66 ClientAuthServer.o
23:27.04 GenerateOCSPResponse.o
23:27.46 OCSPStaplingServer.o
23:28.28 BadCertServer
23:28.28 ClientAuthServer
23:28.42 GenerateOCSPResponse
23:28.59 OCSPStaplingServer
23:30.06 Library.o
23:31.39 Parser.o
23:32.70 ExecutableAllocatorPosix.o
23:33.78 jsarray.o
23:34.23 jsatom.o
23:34.38 libsecurity_manager_ssl_src.a.desc
23:34.42 jsmath.o
23:39.94 jsutil.o
23:43.46 /opt/FirefoxSource/mozilla-release/js/src/ctypes/CTypes.cpp: In function 'bool js::ctypes::ExplicitConvert(JSContext*, JS::HandleValue, JS::HandleObject, void*)':
23:43.46 Warning: -Wmaybe-uninitialized in /opt/FirefoxSource/mozilla-release/js/src/ctypes/CTypes.cpp: 'result' may be used uninitialized in this function
23:43.46 /opt/FirefoxSource/mozilla-release/js/src/ctypes/CTypes.cpp:2748:234: warning: 'result' may be used uninitialized in this function [-Wmaybe-uninitialized]
23:43.46 /opt/FirefoxSource/mozilla-release/js/src/ctypes/CTypes.cpp:2748:34: note: 'result' was declared here
23:43.46 Warning: -Wmaybe-uninitialized in /opt/FirefoxSource/mozilla-release/js/src/ctypes/CTypes.cpp: 'result' may be used uninitialized in this function
23:43.46 /opt/FirefoxSource/mozilla-release/js/src/ctypes/CTypes.cpp:2747:218: warning: 'result' may be used uninitialized in this function [-Wmaybe-uninitialized]
23:43.46 /opt/FirefoxSource/mozilla-release/js/src/ctypes/CTypes.cpp:2747:26: note: 'result' was declared here
23:43.46 Warning: -Wmaybe-uninitialized in /opt/FirefoxSource/mozilla-release/js/src/ctypes/CTypes.cpp: 'result' may be used uninitialized in this function
23:43.47 /opt/FirefoxSource/mozilla-release/js/src/ctypes/CTypes.cpp:2746:960: warning: 'result' may be used uninitialized in this function [-Wmaybe-uninitialized]
23:43.47 /opt/FirefoxSource/mozilla-release/js/src/ctypes/CTypes.cpp:2746:750: note: 'result' was declared here
23:43.47 pm_stub.o
23:43.59 TraceLogging.o
23:43.72 TraceLoggingGraph.o
23:44.73 TraceLoggingTypes.o
23:45.65 Unified_cpp_js_src0.o
23:45.97 Unified_cpp_js_src1.o
23:46.40 Unified_cpp_js_src10.o
23:49.24 Unified_cpp_js_src11.o
23:51.46 Unified_cpp_js_src12.o
24:15.08 In file included from /opt/FirefoxSource/mozilla-release/js/src/jsobjinlines.h:24:0,
24:15.08                  from /opt/FirefoxSource/mozilla-release/js/src/frontend/BytecodeCompiler.cpp:20,
24:15.08                  from /opt/FirefoxSource/mozilla-release/objdir-droid/js/src/Unified_cpp_js_src1.cpp:20:
24:15.08 /opt/FirefoxSource/mozilla-release/js/src/jsgcinlines.h: In function 'void js::IterateScripts(JSRuntime*, JSCompartment*, void*, js::IterateScriptCallback)':
24:15.08 Warning: -Wmaybe-uninitialized in /opt/FirefoxSource/mozilla-release/js/src/jsgcinlines.h: '*((void*)(& i)+12).js::gc::ArenaCellIterImpl::thing' may be used uninitialized in this function
24:15.08 /opt/FirefoxSource/mozilla-release/js/src/jsgcinlines.h:193:27: warning: '*((void*)(& i)+12).js::gc::ArenaCellIterImpl::thing' may be used uninitialized in this function [-Wmaybe-uninitialized]
24:15.08 In file included from /opt/FirefoxSource/mozilla-release/objdir-droid/js/src/Unified_cpp_js_src1.cpp:101:0:
24:15.08 /opt/FirefoxSource/mozilla-release/js/src/gc/Iteration.cpp:108:38: note: '*((void*)(& i)+12).js::gc::ArenaCellIterImpl::thing' was declared here
24:15.08 In file included from /opt/FirefoxSource/mozilla-release/js/src/gc/Barrier.h:12:0,
24:15.08                  from /opt/FirefoxSource/mozilla-release/js/src/jsatom.h:14,
24:15.08                  from /opt/FirefoxSource/mozilla-release/js/src/vm/Runtime.h:21,
24:15.08                  from /opt/FirefoxSource/mozilla-release/js/src/jscntxt.h:15,
24:15.08                  from /opt/FirefoxSource/mozilla-release/js/src/frontend/BytecodeCompiler.cpp:9,
24:15.08                  from /opt/FirefoxSource/mozilla-release/objdir-droid/js/src/Unified_cpp_js_src1.cpp:20:
24:15.08 Warning: -Wmaybe-uninitialized in /opt/FirefoxSource/mozilla-release/js/src/gc/Heap.h: '*((void*)(& i)+12).js::gc::ArenaCellIterImpl::span.js::gc::FreeSpan::last' may be used uninitialized in this function
24:15.08 /opt/FirefoxSource/mozilla-release/js/src/gc/Heap.h:304:48: warning: '*((void*)(& i)+12).js::gc::ArenaCellIterImpl::span.js::gc::FreeSpan::last' may be used uninitialized in this function [-Wmaybe-uninitialized]
24:15.08 In file included from /opt/FirefoxSource/mozilla-release/objdir-droid/js/src/Unified_cpp_js_src1.cpp:101:0:
24:15.08 /opt/FirefoxSource/mozilla-release/js/src/gc/Iteration.cpp:108:38: note: '*((void*)(& i)+12).js::gc::ArenaCellIterImpl::span.js::gc::FreeSpan::last' was declared here
24:15.08 In file included from /opt/FirefoxSource/mozilla-release/js/src/jsobjinlines.h:24:0,
24:15.08                  from /opt/FirefoxSource/mozilla-release/js/src/frontend/BytecodeCompiler.cpp:20,
24:15.08                  from /opt/FirefoxSource/mozilla-release/objdir-droid/js/src/Unified_cpp_js_src1.cpp:20:
24:15.08 Warning: -Wmaybe-uninitialized in /opt/FirefoxSource/mozilla-release/js/src/jsgcinlines.h: '*((void*)(& i)+12).js::gc::ArenaCellIterImpl::span.js::gc::FreeSpan::first' may be used uninitialized in this function
24:15.08 /opt/FirefoxSource/mozilla-release/js/src/jsgcinlines.h:134:9: warning: '*((void*)(& i)+12).js::gc::ArenaCellIterImpl::span.js::gc::FreeSpan::first' may be used uninitialized in this function [-Wmaybe-uninitialized]
24:15.08 In file included from /opt/FirefoxSource/mozilla-release/objdir-droid/js/src/Unified_cpp_js_src1.cpp:101:0:
24:15.08 /opt/FirefoxSource/mozilla-release/js/src/gc/Iteration.cpp:108:38: note: '*((void*)(& i)+12).js::gc::ArenaCellIterImpl::span.js::gc::FreeSpan::first' was declared here
24:15.08 In file included from /opt/FirefoxSource/mozilla-release/js/src/jsobjinlines.h:24:0,
24:15.08                  from /opt/FirefoxSource/mozilla-release/js/src/frontend/BytecodeCompiler.cpp:20,
24:15.08                  from /opt/FirefoxSource/mozilla-release/objdir-droid/js/src/Unified_cpp_js_src1.cpp:20:
24:15.08 /opt/FirefoxSource/mozilla-release/js/src/jsgcinlines.h: In member function 'void js::gc::GCRuntime::markRuntime(JSTracer*, js::gc::GCRuntime::TraceOrMarkRuntime, js::gc::GCRuntime::TraceRootsOrUsedSaved)':
24:15.08 Warning: -Wmaybe-uninitialized in /opt/FirefoxSource/mozilla-release/js/src/jsgcinlines.h: '*((void*)(& i)+12).js::gc::ArenaCellIterImpl::thing' may be used uninitialized in this function
24:15.08 /opt/FirefoxSource/mozilla-release/js/src/jsgcinlines.h:183:52: warning: '*((void*)(& i)+12).js::gc::ArenaCellIterImpl::thing' may be used uninitialized in this function [-Wmaybe-uninitialized]
24:15.08 In file included from /opt/FirefoxSource/mozilla-release/objdir-droid/js/src/Unified_cpp_js_src1.cpp:137:0:
24:15.08 /opt/FirefoxSource/mozilla-release/js/src/gc/RootMarking.cpp:480:38: note: '*((void*)(& i)+12).js::gc::ArenaCellIterImpl::thing' was declared here
24:15.08 In file included from /opt/FirefoxSource/mozilla-release/js/src/gc/Barrier.h:12:0,
24:15.08                  from /opt/FirefoxSource/mozilla-release/js/src/jsatom.h:14,
24:15.08                  from /opt/FirefoxSource/mozilla-release/js/src/vm/Runtime.h:21,
24:15.08                  from /opt/FirefoxSource/mozilla-release/js/src/jscntxt.h:15,
24:15.08                  from /opt/FirefoxSource/mozilla-release/js/src/frontend/BytecodeCompiler.cpp:9,
24:15.08                  from /opt/FirefoxSource/mozilla-release/objdir-droid/js/src/Unified_cpp_js_src1.cpp:20:
24:15.08 Warning: -Wmaybe-uninitialized in /opt/FirefoxSource/mozilla-release/js/src/gc/Heap.h: '*((void*)(& i)+12).js::gc::ArenaCellIterImpl::span.js::gc::FreeSpan::last' may be used uninitialized in this function
24:15.08 /opt/FirefoxSource/mozilla-release/js/src/gc/Heap.h:304:48: warning: '*((void*)(& i)+12).js::gc::ArenaCellIterImpl::span.js::gc::FreeSpan::last' may be used uninitialized in this function [-Wmaybe-uninitialized]
24:15.08 In file included from /opt/FirefoxSource/mozilla-release/objdir-droid/js/src/Unified_cpp_js_src1.cpp:137:0:
24:15.08 /opt/FirefoxSource/mozilla-release/js/src/gc/RootMarking.cpp:480:38: note: '*((void*)(& i)+12).js::gc::ArenaCellIterImpl::span.js::gc::FreeSpan::last' was declared here
24:15.08 In file included from /opt/FirefoxSource/mozilla-release/js/src/jsobjinlines.h:24:0,
24:15.08                  from /opt/FirefoxSource/mozilla-release/js/src/frontend/BytecodeCompiler.cpp:20,
24:15.08                  from /opt/FirefoxSource/mozilla-release/objdir-droid/js/src/Unified_cpp_js_src1.cpp:20:
24:15.08 Warning: -Wmaybe-uninitialized in /opt/FirefoxSource/mozilla-release/js/src/jsgcinlines.h: '*((void*)(& i)+12).js::gc::ArenaCellIterImpl::span.js::gc::FreeSpan::first' may be used uninitialized in this function
24:15.08 /opt/FirefoxSource/mozilla-release/js/src/jsgcinlines.h:134:9: warning: '*((void*)(& i)+12).js::gc::ArenaCellIterImpl::span.js::gc::FreeSpan::first' may be used uninitialized in this function [-Wmaybe-uninitialized]
24:15.08 In file included from /opt/FirefoxSource/mozilla-release/objdir-droid/js/src/Unified_cpp_js_src1.cpp:137:0:
24:15.08 /opt/FirefoxSource/mozilla-release/js/src/gc/RootMarking.cpp:480:38: note: '*((void*)(& i)+12).js::gc::ArenaCellIterImpl::span.js::gc::FreeSpan::first' was declared here
24:15.08 In file included from /opt/FirefoxSource/mozilla-release/js/src/jsobjinlines.h:24:0,
24:15.08                  from /opt/FirefoxSource/mozilla-release/js/src/frontend/BytecodeCompiler.cpp:20,
24:15.08                  from /opt/FirefoxSource/mozilla-release/objdir-droid/js/src/Unified_cpp_js_src1.cpp:20:
24:15.08 /opt/FirefoxSource/mozilla-release/js/src/jsgcinlines.h: In member function 'void js::gc::GCRuntime::_ZN2js2gc9GCRuntime11markRuntimeEP8JSTracerNS1_18TraceOrMarkRuntimeENS1_21TraceRootsOrUsedSavedE.constprop.487(JSTracer*)':
24:15.08 Warning: -Wmaybe-uninitialized in /opt/FirefoxSource/mozilla-release/js/src/jsgcinlines.h: '*((void*)(& i)+12).js::gc::ArenaCellIterImpl::thing' may be used uninitialized in this function
24:15.08 /opt/FirefoxSource/mozilla-release/js/src/jsgcinlines.h:183:52: warning: '*((void*)(& i)+12).js::gc::ArenaCellIterImpl::thing' may be used uninitialized in this function [-Wmaybe-uninitialized]
24:15.08 In file included from /opt/FirefoxSource/mozilla-release/objdir-droid/js/src/Unified_cpp_js_src1.cpp:137:0:
24:15.08 /opt/FirefoxSource/mozilla-release/js/src/gc/RootMarking.cpp:480:38: note: '*((void*)(& i)+12).js::gc::ArenaCellIterImpl::thing' was declared here
24:15.08 In file included from /opt/FirefoxSource/mozilla-release/js/src/gc/Barrier.h:12:0,
24:15.08                  from /opt/FirefoxSource/mozilla-release/js/src/jsatom.h:14,
24:15.08                  from /opt/FirefoxSource/mozilla-release/js/src/vm/Runtime.h:21,
24:15.08                  from /opt/FirefoxSource/mozilla-release/js/src/jscntxt.h:15,
24:15.09                  from /opt/FirefoxSource/mozilla-release/js/src/frontend/BytecodeCompiler.cpp:9,
24:15.09                  from /opt/FirefoxSource/mozilla-release/objdir-droid/js/src/Unified_cpp_js_src1.cpp:20:
24:15.09 Warning: -Wmaybe-uninitialized in /opt/FirefoxSource/mozilla-release/js/src/gc/Heap.h: '*((void*)(& i)+12).js::gc::ArenaCellIterImpl::span.js::gc::FreeSpan::last' may be used uninitialized in this function
24:15.09 /opt/FirefoxSource/mozilla-release/js/src/gc/Heap.h:304:48: warning: '*((void*)(& i)+12).js::gc::ArenaCellIterImpl::span.js::gc::FreeSpan::last' may be used uninitialized in this function [-Wmaybe-uninitialized]
24:15.09 In file included from /opt/FirefoxSource/mozilla-release/objdir-droid/js/src/Unified_cpp_js_src1.cpp:137:0:
24:15.09 /opt/FirefoxSource/mozilla-release/js/src/gc/RootMarking.cpp:480:38: note: '*((void*)(& i)+12).js::gc::ArenaCellIterImpl::span.js::gc::FreeSpan::last' was declared here
24:15.09 In file included from /opt/FirefoxSource/mozilla-release/js/src/jsobjinlines.h:24:0,
24:15.09                  from /opt/FirefoxSource/mozilla-release/js/src/frontend/BytecodeCompiler.cpp:20,
24:15.09                  from /opt/FirefoxSource/mozilla-release/objdir-droid/js/src/Unified_cpp_js_src1.cpp:20:
24:15.09 Warning: -Wmaybe-uninitialized in /opt/FirefoxSource/mozilla-release/js/src/jsgcinlines.h: '*((void*)(& i)+12).js::gc::ArenaCellIterImpl::span.js::gc::FreeSpan::first' may be used uninitialized in this function
24:15.09 /opt/FirefoxSource/mozilla-release/js/src/jsgcinlines.h:134:9: warning: '*((void*)(& i)+12).js::gc::ArenaCellIterImpl::span.js::gc::FreeSpan::first' may be used uninitialized in this function [-Wmaybe-uninitialized]
24:15.09 In file included from /opt/FirefoxSource/mozilla-release/objdir-droid/js/src/Unified_cpp_js_src1.cpp:137:0:
24:15.09 /opt/FirefoxSource/mozilla-release/js/src/gc/RootMarking.cpp:480:38: note: '*((void*)(& i)+12).js::gc::ArenaCellIterImpl::span.js::gc::FreeSpan::first' was declared here
24:15.09 Unified_cpp_js_src2.o
24:19.09 Unified_cpp_js_src3.o
24:26.52 Unified_cpp_js_src4.o
24:33.82 In file included from /opt/FirefoxSource/mozilla-release/objdir-droid/js/src/Unified_cpp_js_src0.cpp:38:0:
24:33.82 /opt/FirefoxSource/mozilla-release/js/src/asmjs/AsmJSValidate.cpp: In function 'js::AsmJSNumLit ExtractSimdValue({anonymous}::ModuleCompiler&, js::frontend::ParseNode*)':
24:33.82 Warning: -Wmaybe-uninitialized in /opt/FirefoxSource/mozilla-release/js/src/asmjs/AsmJSValidate.cpp: 'type' may be used uninitialized in this function
24:33.82 /opt/FirefoxSource/mozilla-release/js/src/asmjs/AsmJSValidate.cpp:2271:5: warning: 'type' may be used uninitialized in this function [-Wmaybe-uninitialized]
24:33.82 In file included from /opt/FirefoxSource/mozilla-release/objdir-droid/js/src/Unified_cpp_js_src0.cpp:20:0:
24:33.82 /opt/FirefoxSource/mozilla-release/js/src/asmjs/AsmJSModule.cpp: In member function 'void js::AsmJSModule::CodeRange::updateOffsets(js::jit::MacroAssembler&)':
24:33.82 Warning: -Wmaybe-uninitialized in /opt/FirefoxSource/mozilla-release/js/src/asmjs/AsmJSModule.cpp: 'profilingEpilogueBefore' may be used uninitialized in this function
24:33.82 /opt/FirefoxSource/mozilla-release/js/src/asmjs/AsmJSModule.cpp:1381:61: warning: 'profilingEpilogueBefore' may be used uninitialized in this function [-Wmaybe-uninitialized]
24:33.82 Warning: -Wmaybe-uninitialized in /opt/FirefoxSource/mozilla-release/js/src/asmjs/AsmJSModule.cpp: 'profilingJumpBefore' may be used uninitialized in this function
24:33.82 /opt/FirefoxSource/mozilla-release/js/src/asmjs/AsmJSModule.cpp:1381:61: warning: 'profilingJumpBefore' may be used uninitialized in this function [-Wmaybe-uninitialized]
24:33.82 Warning: -Wmaybe-uninitialized in /opt/FirefoxSource/mozilla-release/js/src/asmjs/AsmJSModule.cpp: 'entryBefore' may be used uninitialized in this function
24:33.82 /opt/FirefoxSource/mozilla-release/js/src/asmjs/AsmJSModule.cpp:1381:61: warning: 'entryBefore' may be used uninitialized in this function [-Wmaybe-uninitialized]
24:33.96 Unified_cpp_js_src5.o
24:43.40 Unified_cpp_js_src6.o
24:48.22 Unified_cpp_js_src7.o
25:17.29 In file included from /opt/FirefoxSource/mozilla-release/js/src/vm/Shape-inl.h:22:0,
25:17.29                  from /opt/FirefoxSource/mozilla-release/js/src/jsscriptinlines.h:19,
25:17.29                  from /opt/FirefoxSource/mozilla-release/js/src/jit/BaselineCompiler.cpp:25,
25:17.29                  from /opt/FirefoxSource/mozilla-release/objdir-droid/js/src/Unified_cpp_js_src3.cpp:2:
25:17.29 /opt/FirefoxSource/mozilla-release/js/src/jsgcinlines.h: In function 'void js::jit::ToggleBaselineTraceLoggerScripts(JSRuntime*, bool)':
25:17.29 Warning: -Wmaybe-uninitialized in /opt/FirefoxSource/mozilla-release/js/src/jsgcinlines.h: '*((void*)(& i)+12).js::gc::ArenaCellIterImpl::thing' may be used uninitialized in this function
25:17.29 /opt/FirefoxSource/mozilla-release/js/src/jsgcinlines.h:183:52: warning: '*((void*)(& i)+12).js::gc::ArenaCellIterImpl::thing' may be used uninitialized in this function [-Wmaybe-uninitialized]
25:17.29 In file included from /opt/FirefoxSource/mozilla-release/objdir-droid/js/src/Unified_cpp_js_src3.cpp:56:0:
25:17.29 /opt/FirefoxSource/mozilla-release/js/src/jit/BaselineJIT.cpp:1093:31: note: '*((void*)(& i)+12).js::gc::ArenaCellIterImpl::thing' was declared here
25:17.29 In file included from /opt/FirefoxSource/mozilla-release/js/src/gc/Barrier.h:12:0,
25:17.29                  from /opt/FirefoxSource/mozilla-release/js/src/jsatom.h:14,
25:17.29                  from /opt/FirefoxSource/mozilla-release/js/src/vm/Runtime.h:21,
25:17.29                  from /opt/FirefoxSource/mozilla-release/js/src/jscntxt.h:15,
25:17.29                  from /opt/FirefoxSource/mozilla-release/js/src/jit/Ion.h:12,
25:17.29                  from /opt/FirefoxSource/mozilla-release/js/src/jit/FixedList.h:12,
25:17.29                  from /opt/FirefoxSource/mozilla-release/js/src/jit/BaselineCompiler.h:10,
25:17.29                  from /opt/FirefoxSource/mozilla-release/js/src/jit/BaselineCompiler.cpp:7,
25:17.29                  from /opt/FirefoxSource/mozilla-release/objdir-droid/js/src/Unified_cpp_js_src3.cpp:2:
25:17.29 Warning: -Wmaybe-uninitialized in /opt/FirefoxSource/mozilla-release/js/src/gc/Heap.h: '*((void*)(& i)+12).js::gc::ArenaCellIterImpl::span.js::gc::FreeSpan::last' may be used uninitialized in this function
25:17.29 /opt/FirefoxSource/mozilla-release/js/src/gc/Heap.h:304:48: warning: '*((void*)(& i)+12).js::gc::ArenaCellIterImpl::span.js::gc::FreeSpan::last' may be used uninitialized in this function [-Wmaybe-uninitialized]
25:17.29 In file included from /opt/FirefoxSource/mozilla-release/objdir-droid/js/src/Unified_cpp_js_src3.cpp:56:0:
25:17.29 /opt/FirefoxSource/mozilla-release/js/src/jit/BaselineJIT.cpp:1093:31: note: '*((void*)(& i)+12).js::gc::ArenaCellIterImpl::span.js::gc::FreeSpan::last' was declared here
25:17.29 In file included from /opt/FirefoxSource/mozilla-release/js/src/vm/Shape-inl.h:22:0,
25:17.29                  from /opt/FirefoxSource/mozilla-release/js/src/jsscriptinlines.h:19,
25:17.29                  from /opt/FirefoxSource/mozilla-release/js/src/jit/BaselineCompiler.cpp:25,
25:17.29                  from /opt/FirefoxSource/mozilla-release/objdir-droid/js/src/Unified_cpp_js_src3.cpp:2:
25:17.29 Warning: -Wmaybe-uninitialized in /opt/FirefoxSource/mozilla-release/js/src/jsgcinlines.h: '*((void*)(& i)+12).js::gc::ArenaCellIterImpl::span.js::gc::FreeSpan::first' may be used uninitialized in this function
25:17.29 /opt/FirefoxSource/mozilla-release/js/src/jsgcinlines.h:134:9: warning: '*((void*)(& i)+12).js::gc::ArenaCellIterImpl::span.js::gc::FreeSpan::first' may be used uninitialized in this function [-Wmaybe-uninitialized]
25:17.29 In file included from /opt/FirefoxSource/mozilla-release/objdir-droid/js/src/Unified_cpp_js_src3.cpp:56:0:
25:17.29 /opt/FirefoxSource/mozilla-release/js/src/jit/BaselineJIT.cpp:1093:31: note: '*((void*)(& i)+12).js::gc::ArenaCellIterImpl::span.js::gc::FreeSpan::first' was declared here
25:17.30 Unified_cpp_js_src8.o
25:19.27 Unified_cpp_js_src9.o
25:26.88 In file included from /opt/FirefoxSource/mozilla-release/objdir-droid/js/src/Unified_cpp_js_src6.cpp:47:0:
25:26.88 /opt/FirefoxSource/mozilla-release/js/src/jit/arm/Assembler-arm.cpp: In static member function 'static void js::jit::Assembler::RetargetNearBranch(js::jit::Instruction*, int, bool)':
25:26.88 Warning: -Wmaybe-uninitialized in /opt/FirefoxSource/mozilla-release/js/src/jit/arm/Assembler-arm.cpp: 'c' may be used uninitialized in this function
25:26.88 /opt/FirefoxSource/mozilla-release/js/src/jit/arm/Assembler-arm.cpp:2632:44: warning: 'c' may be used uninitialized in this function [-Wmaybe-uninitialized]
25:26.88 In file included from /opt/FirefoxSource/mozilla-release/objdir-droid/js/src/Unified_cpp_js_src6.cpp:47:0:
25:26.88 /opt/FirefoxSource/mozilla-release/js/src/jit/arm/Assembler-arm.cpp: In function 'void js::jit::PatchJump(js::jit::CodeLocationJump&, js::jit::CodeLocationLabel)':
25:26.88 Warning: -Wmaybe-uninitialized in /opt/FirefoxSource/mozilla-release/js/src/jit/arm/Assembler-arm.cpp: 'c' may be used uninitialized in this function
25:26.88 /opt/FirefoxSource/mozilla-release/js/src/jit/arm/Assembler-arm.cpp:551:65: warning: 'c' may be used uninitialized in this function [-Wmaybe-uninitialized]
25:26.88 In file included from /opt/FirefoxSource/mozilla-release/objdir-droid/js/src/Unified_cpp_js_src6.cpp:47:0:
25:26.88 /opt/FirefoxSource/mozilla-release/js/src/jit/arm/Assembler-arm.cpp: In member function 'js::jit::Instruction* js::jit::Instruction::skipPool()':
25:26.88 Warning: -Wmaybe-uninitialized in /opt/FirefoxSource/mozilla-release/js/src/jit/arm/Assembler-arm.cpp: 'c' may be used uninitialized in this function
25:26.89 /opt/FirefoxSource/mozilla-release/js/src/jit/arm/Assembler-arm.cpp:2823:5: warning: 'c' may be used uninitialized in this function [-Wmaybe-uninitialized]
25:26.89 /opt/FirefoxSource/mozilla-release/js/src/jit/arm/Assembler-arm.cpp:2821:26: note: 'c' was declared here
25:26.89 Warning: -Wmaybe-uninitialized in /opt/FirefoxSource/mozilla-release/js/src/jit/arm/Assembler-arm.cpp: 'c' may be used uninitialized in this function
25:26.89 /opt/FirefoxSource/mozilla-release/js/src/jit/arm/Assembler-arm.cpp:2805:5: warning: 'c' may be used uninitialized in this function [-Wmaybe-uninitialized]
25:26.89 /opt/FirefoxSource/mozilla-release/js/src/jit/arm/Assembler-arm.cpp:2803:26: note: 'c' was declared here
25:26.89 /opt/FirefoxSource/mozilla-release/js/src/jit/arm/Assembler-arm.cpp: In member function 'js::jit::Instruction* js::jit::Instruction::next()':
25:26.89 Warning: -Wmaybe-uninitialized in /opt/FirefoxSource/mozilla-release/js/src/jit/arm/Assembler-arm.cpp: 'c' may be used uninitialized in this function
25:26.89 /opt/FirefoxSource/mozilla-release/js/src/jit/arm/Assembler-arm.cpp:2805:5: warning: 'c' may be used uninitialized in this function [-Wmaybe-uninitialized]
25:26.89 /opt/FirefoxSource/mozilla-release/js/src/jit/arm/Assembler-arm.cpp:2803:26: note: 'c' was declared here
25:26.89 Warning: -Wmaybe-uninitialized in /opt/FirefoxSource/mozilla-release/js/src/jit/arm/Assembler-arm.cpp: 'c' may be used uninitialized in this function
25:26.89 /opt/FirefoxSource/mozilla-release/js/src/jit/arm/Assembler-arm.cpp:2805:5: warning: 'c' may be used uninitialized in this function [-Wmaybe-uninitialized]
25:26.89 /opt/FirefoxSource/mozilla-release/js/src/jit/arm/Assembler-arm.cpp:2803:26: note: 'c' was declared here
25:26.89 In file included from /opt/FirefoxSource/mozilla-release/js/src/jit/arm/MacroAssembler-arm.h:14:0,
25:26.89                  from /opt/FirefoxSource/mozilla-release/js/src/jit/MacroAssembler.h:19,
25:26.89                  from /opt/FirefoxSource/mozilla-release/js/src/jit/MIR.h:23,
25:26.89                  from /opt/FirefoxSource/mozilla-release/js/src/jit/LIR.h:19,
25:26.89                  from /opt/FirefoxSource/mozilla-release/js/src/jit/Lowering.h:13,
25:26.89                  from /opt/FirefoxSource/mozilla-release/js/src/jit/TypePolicy.cpp:9,
25:26.89                  from /opt/FirefoxSource/mozilla-release/objdir-droid/js/src/Unified_cpp_js_src6.cpp:2:
25:26.89 /opt/FirefoxSource/mozilla-release/js/src/jit/arm/Assembler-arm.h: In member function 'void js::jit::Assembler::bind(js::jit::Label*, js::jit::BufferOffset)':
25:26.89 Warning: -Wmaybe-uninitialized in /opt/FirefoxSource/mozilla-release/js/src/jit/arm/Assembler-arm.h: 'c' may be used uninitialized in this function
25:26.89 /opt/FirefoxSource/mozilla-release/js/src/jit/arm/Assembler-arm.h:1832:85: warning: 'c' may be used uninitialized in this function [-Wmaybe-uninitialized]
25:26.89 In file included from /opt/FirefoxSource/mozilla-release/objdir-droid/js/src/Unified_cpp_js_src6.cpp:47:0:
25:26.89 /opt/FirefoxSource/mozilla-release/js/src/jit/arm/Assembler-arm.cpp:2496:23: note: 'c' was declared here
25:26.89 In file included from /opt/FirefoxSource/mozilla-release/js/src/jit/arm/MacroAssembler-arm.h:14:0,
25:26.89                  from /opt/FirefoxSource/mozilla-release/js/src/jit/MacroAssembler.h:19,
25:26.89                  from /opt/FirefoxSource/mozilla-release/js/src/jit/MIR.h:23,
25:26.89                  from /opt/FirefoxSource/mozilla-release/js/src/jit/LIR.h:19,
25:26.89                  from /opt/FirefoxSource/mozilla-release/js/src/jit/Lowering.h:13,
25:26.89                  from /opt/FirefoxSource/mozilla-release/js/src/jit/TypePolicy.cpp:9,
25:26.89                  from /opt/FirefoxSource/mozilla-release/objdir-droid/js/src/Unified_cpp_js_src6.cpp:2:
25:26.89 /opt/FirefoxSource/mozilla-release/js/src/jit/arm/Assembler-arm.h: In member function 'void js::jit::Assembler::retarget(js::jit::Label*, js::jit::Label*)':
25:26.89 Warning: -Wmaybe-uninitialized in /opt/FirefoxSource/mozilla-release/js/src/jit/arm/Assembler-arm.h: 'c' may be used uninitialized in this function
25:26.89 /opt/FirefoxSource/mozilla-release/js/src/jit/arm/Assembler-arm.h:1832:85: warning: 'c' may be used uninitialized in this function [-Wmaybe-uninitialized]
25:26.89 In file included from /opt/FirefoxSource/mozilla-release/objdir-droid/js/src/Unified_cpp_js_src6.cpp:47:0:
25:26.89 /opt/FirefoxSource/mozilla-release/js/src/jit/arm/Assembler-arm.cpp:2552:23: note: 'c' was declared here
25:26.89 In file included from /opt/FirefoxSource/mozilla-release/js/src/jit/arm/MacroAssembler-arm.h:14:0,
25:26.89                  from /opt/FirefoxSource/mozilla-release/js/src/jit/MacroAssembler.h:19,
25:26.89                  from /opt/FirefoxSource/mozilla-release/js/src/jit/MIR.h:23,
25:26.89                  from /opt/FirefoxSource/mozilla-release/js/src/jit/LIR.h:19,
25:26.89                  from /opt/FirefoxSource/mozilla-release/js/src/jit/Lowering.h:13,
25:26.89                  from /opt/FirefoxSource/mozilla-release/js/src/jit/TypePolicy.cpp:9,
25:26.89                  from /opt/FirefoxSource/mozilla-release/objdir-droid/js/src/Unified_cpp_js_src6.cpp:2:
25:26.89 /opt/FirefoxSource/mozilla-release/js/src/jit/arm/Assembler-arm.h: In member function 'void js::jit::AssemblerBufferWithConstantPools<SliceSize, InstSize, Inst, Asm>::executableCopy(uint8_t*) [with unsigned int SliceSize = 1024u; unsigned int InstSize = 4u; Inst = js::jit::Instruction; Asm = js::jit::Assembler; uint8_t = unsigned char]':
25:26.89 Warning: -Wmaybe-uninitialized in /opt/FirefoxSource/mozilla-release/js/src/jit/arm/Assembler-arm.h: 'c' may be used uninitialized in this function
25:26.89 /opt/FirefoxSource/mozilla-release/js/src/jit/arm/Assembler-arm.h:1832:85: warning: 'c' may be used uninitialized in this function [-Wmaybe-uninitialized]
25:26.89 In file included from /opt/FirefoxSource/mozilla-release/objdir-droid/js/src/Unified_cpp_js_src6.cpp:47:0:
25:26.89 /opt/FirefoxSource/mozilla-release/js/src/jit/arm/Assembler-arm.cpp:2630:26: note: 'c' was declared here
25:26.89 In file included from /opt/FirefoxSource/mozilla-release/js/src/jit/arm/MacroAssembler-arm.h:14:0,
25:26.89                  from /opt/FirefoxSource/mozilla-release/js/src/jit/MacroAssembler.h:19,
25:26.89                  from /opt/FirefoxSource/mozilla-release/js/src/jit/MIR.h:23,
25:26.89                  from /opt/FirefoxSource/mozilla-release/js/src/jit/LIR.h:19,
25:26.89                  from /opt/FirefoxSource/mozilla-release/js/src/jit/Lowering.h:13,
25:26.90                  from /opt/FirefoxSource/mozilla-release/js/src/jit/TypePolicy.cpp:9,
25:26.90                  from /opt/FirefoxSource/mozilla-release/objdir-droid/js/src/Unified_cpp_js_src6.cpp:2:
25:26.90 /opt/FirefoxSource/mozilla-release/js/src/jit/arm/Assembler-arm.h: In member function 'void js::jit::Assembler::bind(js::jit::RepatchLabel*)':
25:26.90 Warning: -Wmaybe-uninitialized in /opt/FirefoxSource/mozilla-release/js/src/jit/arm/Assembler-arm.h: 'cond' may be used uninitialized in this function
25:26.90 /opt/FirefoxSource/mozilla-release/js/src/jit/arm/Assembler-arm.h:1832:85: warning: 'cond' may be used uninitialized in this function [-Wmaybe-uninitialized]
25:26.90 In file included from /opt/FirefoxSource/mozilla-release/objdir-droid/js/src/Unified_cpp_js_src6.cpp:47:0:
25:26.90 /opt/FirefoxSource/mozilla-release/js/src/jit/arm/Assembler-arm.cpp:2523:19: note: 'cond' was declared here
25:58.22 In file included from /opt/FirefoxSource/mozilla-release/js/src/vm/Stack.h:17:0,
25:58.22                  from /opt/FirefoxSource/mozilla-release/js/src/vm/Runtime.h:43,
25:58.22                  from /opt/FirefoxSource/mozilla-release/js/src/builtin/MapObject.h:12,
25:58.22                  from /opt/FirefoxSource/mozilla-release/js/src/jsobjinlines.h:12,
25:58.22                  from /opt/FirefoxSource/mozilla-release/js/src/proxy/ScriptedDirectProxyHandler.cpp:13,
25:58.22                  from /opt/FirefoxSource/mozilla-release/objdir-droid/js/src/Unified_cpp_js_src9.cpp:2:
25:58.22 /opt/FirefoxSource/mozilla-release/js/src/jit/JitFrameIterator.h: In member function 'void js::jit::JitFrameIterator::unaliasedForEachActual(Op, js::jit::ReadFrameArgsBehavior) const [with Op = js::CopyToHeap]':
25:58.22 Warning: -Wmaybe-uninitialized in /opt/FirefoxSource/mozilla-release/js/src/jit/JitFrameIterator.h: 'end' may be used uninitialized in this function
25:58.22 /opt/FirefoxSource/mozilla-release/js/src/jit/JitFrameIterator.h:255:9: warning: 'end' may be used uninitialized in this function [-Wmaybe-uninitialized]
25:58.22 Warning: -Wmaybe-uninitialized in /opt/FirefoxSource/mozilla-release/js/src/jit/JitFrameIterator.h: 'start' may be used uninitialized in this function
25:58.22 /opt/FirefoxSource/mozilla-release/js/src/jit/JitFrameIterator.h:235:10: warning: 'start' may be used uninitialized in this function [-Wmaybe-uninitialized]
26:02.20 In file included from /opt/FirefoxSource/mozilla-release/js/src/vm/Shape-inl.h:22:0,
26:02.20                  from /opt/FirefoxSource/mozilla-release/js/src/jsscriptinlines.h:19,
26:02.20                  from /opt/FirefoxSource/mozilla-release/js/src/jsapi.cpp:91,
26:02.20                  from /opt/FirefoxSource/mozilla-release/objdir-droid/js/src/Unified_cpp_js_src7.cpp:20:
26:02.20 /opt/FirefoxSource/mozilla-release/js/src/jsgcinlines.h: In member function 'void js::gc::GCRuntime::sweepTypesAfterCompacting(JS::Zone*)':
26:02.20 Warning: -Wmaybe-uninitialized in /opt/FirefoxSource/mozilla-release/js/src/jsgcinlines.h: '*((void*)(& i)+12).js::gc::ArenaCellIterImpl::thing' may be used uninitialized in this function
26:02.20 /opt/FirefoxSource/mozilla-release/js/src/jsgcinlines.h:193:27: warning: '*((void*)(& i)+12).js::gc::ArenaCellIterImpl::thing' may be used uninitialized in this function [-Wmaybe-uninitialized]
26:02.20 In file included from /opt/FirefoxSource/mozilla-release/objdir-droid/js/src/Unified_cpp_js_src7.cpp:101:0:
26:02.20 /opt/FirefoxSource/mozilla-release/js/src/jsgc.cpp:2230:30: note: '*((void*)(& i)+12).js::gc::ArenaCellIterImpl::thing' was declared here
26:02.20 In file included from /opt/FirefoxSource/mozilla-release/js/src/gc/Barrier.h:12:0,
26:02.20                  from /opt/FirefoxSource/mozilla-release/js/src/jsobj.h:21,
26:02.20                  from /opt/FirefoxSource/mozilla-release/js/src/jsfun.h:14,
26:02.20                  from /opt/FirefoxSource/mozilla-release/js/src/jit/JitFrameIterator.h:10,
26:02.20                  from /opt/FirefoxSource/mozilla-release/js/src/jit/Bailouts.h:12,
26:02.20                  from /opt/FirefoxSource/mozilla-release/js/src/jit/LIR.h:15,
26:02.20                  from /opt/FirefoxSource/mozilla-release/js/src/jit/shared/Lowering-shared.h:13,
26:02.20                  from /opt/FirefoxSource/mozilla-release/js/src/jit/shared/Lowering-shared-inl.h:10,
26:02.20                  from /opt/FirefoxSource/mozilla-release/js/src/jit/shared/Lowering-shared.cpp:7,
26:02.20                  from /opt/FirefoxSource/mozilla-release/objdir-droid/js/src/Unified_cpp_js_src7.cpp:2:
26:02.20 Warning: -Wmaybe-uninitialized in /opt/FirefoxSource/mozilla-release/js/src/gc/Heap.h: '*((void*)(& i)+12).js::gc::ArenaCellIterImpl::span.js::gc::FreeSpan::last' may be used uninitialized in this function
26:02.20 /opt/FirefoxSource/mozilla-release/js/src/gc/Heap.h:304:48: warning: '*((void*)(& i)+12).js::gc::ArenaCellIterImpl::span.js::gc::FreeSpan::last' may be used uninitialized in this function [-Wmaybe-uninitialized]
26:02.20 In file included from /opt/FirefoxSource/mozilla-release/objdir-droid/js/src/Unified_cpp_js_src7.cpp:101:0:
26:02.20 /opt/FirefoxSource/mozilla-release/js/src/jsgc.cpp:2230:30: note: '*((void*)(& i)+12).js::gc::ArenaCellIterImpl::span.js::gc::FreeSpan::last' was declared here
26:02.20 In file included from /opt/FirefoxSource/mozilla-release/js/src/vm/Shape-inl.h:22:0,
26:02.20                  from /opt/FirefoxSource/mozilla-release/js/src/jsscriptinlines.h:19,
26:02.20                  from /opt/FirefoxSource/mozilla-release/js/src/jsapi.cpp:91,
26:02.20                  from /opt/FirefoxSource/mozilla-release/objdir-droid/js/src/Unified_cpp_js_src7.cpp:20:
26:02.20 Warning: -Wmaybe-uninitialized in /opt/FirefoxSource/mozilla-release/js/src/jsgcinlines.h: '*((void*)(& i)+12).js::gc::ArenaCellIterImpl::span.js::gc::FreeSpan::first' may be used uninitialized in this function
26:02.20 /opt/FirefoxSource/mozilla-release/js/src/jsgcinlines.h:134:9: warning: '*((void*)(& i)+12).js::gc::ArenaCellIterImpl::span.js::gc::FreeSpan::first' may be used uninitialized in this function [-Wmaybe-uninitialized]
26:02.20 In file included from /opt/FirefoxSource/mozilla-release/objdir-droid/js/src/Unified_cpp_js_src7.cpp:101:0:
26:02.20 /opt/FirefoxSource/mozilla-release/js/src/jsgc.cpp:2230:30: note: '*((void*)(& i)+12).js::gc::ArenaCellIterImpl::span.js::gc::FreeSpan::first' was declared here
26:02.20 In file included from /opt/FirefoxSource/mozilla-release/js/src/vm/Shape-inl.h:22:0,
26:02.20                  from /opt/FirefoxSource/mozilla-release/js/src/jsscriptinlines.h:19,
26:02.20                  from /opt/FirefoxSource/mozilla-release/js/src/jsapi.cpp:91,
26:02.20                  from /opt/FirefoxSource/mozilla-release/objdir-droid/js/src/Unified_cpp_js_src7.cpp:20:
26:02.20 Warning: -Wmaybe-uninitialized in /opt/FirefoxSource/mozilla-release/js/src/jsgcinlines.h: '*((void*)(& i)+12).js::gc::ArenaCellIterImpl::thing' may be used uninitialized in this function
26:02.20 /opt/FirefoxSource/mozilla-release/js/src/jsgcinlines.h:193:27: warning: '*((void*)(& i)+12).js::gc::ArenaCellIterImpl::thing' may be used uninitialized in this function [-Wmaybe-uninitialized]
26:02.20 In file included from /opt/FirefoxSource/mozilla-release/objdir-droid/js/src/Unified_cpp_js_src7.cpp:101:0:
26:02.20 /opt/FirefoxSource/mozilla-release/js/src/jsgc.cpp:2225:30: note: '*((void*)(& i)+12).js::gc::ArenaCellIterImpl::thing' was declared here
26:02.20 In file included from /opt/FirefoxSource/mozilla-release/js/src/gc/Barrier.h:12:0,
26:02.20                  from /opt/FirefoxSource/mozilla-release/js/src/jsobj.h:21,
26:02.20                  from /opt/FirefoxSource/mozilla-release/js/src/jsfun.h:14,
26:02.20                  from /opt/FirefoxSource/mozilla-release/js/src/jit/JitFrameIterator.h:10,
26:02.20                  from /opt/FirefoxSource/mozilla-release/js/src/jit/Bailouts.h:12,
26:02.20                  from /opt/FirefoxSource/mozilla-release/js/src/jit/LIR.h:15,
26:02.20                  from /opt/FirefoxSource/mozilla-release/js/src/jit/shared/Lowering-shared.h:13,
26:02.20                  from /opt/FirefoxSource/mozilla-release/js/src/jit/shared/Lowering-shared-inl.h:10,
26:02.20                  from /opt/FirefoxSource/mozilla-release/js/src/jit/shared/Lowering-shared.cpp:7,
26:02.20                  from /opt/FirefoxSource/mozilla-release/objdir-droid/js/src/Unified_cpp_js_src7.cpp:2:
26:02.21 Warning: -Wmaybe-uninitialized in /opt/FirefoxSource/mozilla-release/js/src/gc/Heap.h: '*((void*)(& i)+12).js::gc::ArenaCellIterImpl::span.js::gc::FreeSpan::last' may be used uninitialized in this function
26:02.21 /opt/FirefoxSource/mozilla-release/js/src/gc/Heap.h:304:48: warning: '*((void*)(& i)+12).js::gc::ArenaCellIterImpl::span.js::gc::FreeSpan::last' may be used uninitialized in this function [-Wmaybe-uninitialized]
26:02.21 In file included from /opt/FirefoxSource/mozilla-release/objdir-droid/js/src/Unified_cpp_js_src7.cpp:101:0:
26:02.21 /opt/FirefoxSource/mozilla-release/js/src/jsgc.cpp:2225:30: note: '*((void*)(& i)+12).js::gc::ArenaCellIterImpl::span.js::gc::FreeSpan::last' was declared here
26:02.21 In file included from /opt/FirefoxSource/mozilla-release/js/src/vm/Shape-inl.h:22:0,
26:02.21                  from /opt/FirefoxSource/mozilla-release/js/src/jsscriptinlines.h:19,
26:02.21                  from /opt/FirefoxSource/mozilla-release/js/src/jsapi.cpp:91,
26:02.21                  from /opt/FirefoxSource/mozilla-release/objdir-droid/js/src/Unified_cpp_js_src7.cpp:20:
26:02.21 Warning: -Wmaybe-uninitialized in /opt/FirefoxSource/mozilla-release/js/src/jsgcinlines.h: '*((void*)(& i)+12).js::gc::ArenaCellIterImpl::span.js::gc::FreeSpan::first' may be used uninitialized in this function
26:02.21 /opt/FirefoxSource/mozilla-release/js/src/jsgcinlines.h:134:9: warning: '*((void*)(& i)+12).js::gc::ArenaCellIterImpl::span.js::gc::FreeSpan::first' may be used uninitialized in this function [-Wmaybe-uninitialized]
26:02.21 In file included from /opt/FirefoxSource/mozilla-release/objdir-droid/js/src/Unified_cpp_js_src7.cpp:101:0:
26:02.21 /opt/FirefoxSource/mozilla-release/js/src/jsgc.cpp:2225:30: note: '*((void*)(& i)+12).js::gc::ArenaCellIterImpl::span.js::gc::FreeSpan::first' was declared here
26:02.21 In file included from /opt/FirefoxSource/mozilla-release/js/src/vm/Shape-inl.h:22:0,
26:02.21                  from /opt/FirefoxSource/mozilla-release/js/src/jsscriptinlines.h:19,
26:02.21                  from /opt/FirefoxSource/mozilla-release/js/src/jsapi.cpp:91,
26:02.21                  from /opt/FirefoxSource/mozilla-release/objdir-droid/js/src/Unified_cpp_js_src7.cpp:20:
26:02.21 /opt/FirefoxSource/mozilla-release/js/src/jsgcinlines.h: In function 'void js::ReleaseAllJITCode(js::FreeOp*)':
26:02.21 Warning: -Wmaybe-uninitialized in /opt/FirefoxSource/mozilla-release/js/src/jsgcinlines.h: '*((void*)(& i)+12).js::gc::ArenaCellIterImpl::thing' may be used uninitialized in this function
26:02.21 /opt/FirefoxSource/mozilla-release/js/src/jsgcinlines.h:193:27: warning: '*((void*)(& i)+12).js::gc::ArenaCellIterImpl::thing' may be used uninitialized in this function [-Wmaybe-uninitialized]
26:02.21 In file included from /opt/FirefoxSource/mozilla-release/objdir-droid/js/src/Unified_cpp_js_src7.cpp:101:0:
26:02.21 /opt/FirefoxSource/mozilla-release/js/src/jsgc.cpp:6724:27: note: '*((void*)(& i)+12).js::gc::ArenaCellIterImpl::thing' was declared here
26:02.21 In file included from /opt/FirefoxSource/mozilla-release/js/src/gc/Barrier.h:12:0,
26:02.21                  from /opt/FirefoxSource/mozilla-release/js/src/jsobj.h:21,
26:02.21                  from /opt/FirefoxSource/mozilla-release/js/src/jsfun.h:14,
26:02.21                  from /opt/FirefoxSource/mozilla-release/js/src/jit/JitFrameIterator.h:10,
26:02.21                  from /opt/FirefoxSource/mozilla-release/js/src/jit/Bailouts.h:12,
26:02.21                  from /opt/FirefoxSource/mozilla-release/js/src/jit/LIR.h:15,
26:02.21                  from /opt/FirefoxSource/mozilla-release/js/src/jit/shared/Lowering-shared.h:13,
26:02.21                  from /opt/FirefoxSource/mozilla-release/js/src/jit/shared/Lowering-shared-inl.h:10,
26:02.21                  from /opt/FirefoxSource/mozilla-release/js/src/jit/shared/Lowering-shared.cpp:7,
26:02.21                  from /opt/FirefoxSource/mozilla-release/objdir-droid/js/src/Unified_cpp_js_src7.cpp:2:
26:02.21 Warning: -Wmaybe-uninitialized in /opt/FirefoxSource/mozilla-release/js/src/gc/Heap.h: '*((void*)(& i)+12).js::gc::ArenaCellIterImpl::span.js::gc::FreeSpan::last' may be used uninitialized in this function
26:02.21 /opt/FirefoxSource/mozilla-release/js/src/gc/Heap.h:304:48: warning: '*((void*)(& i)+12).js::gc::ArenaCellIterImpl::span.js::gc::FreeSpan::last' may be used uninitialized in this function [-Wmaybe-uninitialized]
26:02.21 In file included from /opt/FirefoxSource/mozilla-release/objdir-droid/js/src/Unified_cpp_js_src7.cpp:101:0:
26:02.21 /opt/FirefoxSource/mozilla-release/js/src/jsgc.cpp:6724:27: note: '*((void*)(& i)+12).js::gc::ArenaCellIterImpl::span.js::gc::FreeSpan::last' was declared here
26:02.21 In file included from /opt/FirefoxSource/mozilla-release/js/src/vm/Shape-inl.h:22:0,
26:02.21                  from /opt/FirefoxSource/mozilla-release/js/src/jsscriptinlines.h:19,
26:02.21                  from /opt/FirefoxSource/mozilla-release/js/src/jsapi.cpp:91,
26:02.21                  from /opt/FirefoxSource/mozilla-release/objdir-droid/js/src/Unified_cpp_js_src7.cpp:20:
26:02.21 Warning: -Wmaybe-uninitialized in /opt/FirefoxSource/mozilla-release/js/src/jsgcinlines.h: '*((void*)(& i)+12).js::gc::ArenaCellIterImpl::span.js::gc::FreeSpan::first' may be used uninitialized in this function
26:02.21 /opt/FirefoxSource/mozilla-release/js/src/jsgcinlines.h:134:9: warning: '*((void*)(& i)+12).js::gc::ArenaCellIterImpl::span.js::gc::FreeSpan::first' may be used uninitialized in this function [-Wmaybe-uninitialized]
26:02.21 In file included from /opt/FirefoxSource/mozilla-release/objdir-droid/js/src/Unified_cpp_js_src7.cpp:101:0:
26:02.21 /opt/FirefoxSource/mozilla-release/js/src/jsgc.cpp:6724:27: note: '*((void*)(& i)+12).js::gc::ArenaCellIterImpl::span.js::gc::FreeSpan::first' was declared here
26:02.21 In file included from /opt/FirefoxSource/mozilla-release/js/src/vm/Shape-inl.h:22:0,
26:02.21                  from /opt/FirefoxSource/mozilla-release/js/src/jsscriptinlines.h:19,
26:02.21                  from /opt/FirefoxSource/mozilla-release/js/src/jsapi.cpp:91,
26:02.21                  from /opt/FirefoxSource/mozilla-release/objdir-droid/js/src/Unified_cpp_js_src7.cpp:20:
26:02.21 /opt/FirefoxSource/mozilla-release/js/src/jsgcinlines.h: In function 'void js::PurgeJITCaches(JS::Zone*)':
26:02.21 Warning: -Wmaybe-uninitialized in /opt/FirefoxSource/mozilla-release/js/src/jsgcinlines.h: '*((void*)(& i)+12).js::gc::ArenaCellIterImpl::thing' may be used uninitialized in this function
26:02.21 /opt/FirefoxSource/mozilla-release/js/src/jsgcinlines.h:193:27: warning: '*((void*)(& i)+12).js::gc::ArenaCellIterImpl::thing' may be used uninitialized in this function [-Wmaybe-uninitialized]
26:02.21 In file included from /opt/FirefoxSource/mozilla-release/objdir-droid/js/src/Unified_cpp_js_src7.cpp:101:0:
26:02.21 /opt/FirefoxSource/mozilla-release/js/src/jsgc.cpp:6742:30: note: '*((void*)(& i)+12).js::gc::ArenaCellIterImpl::thing' was declared here
26:02.21 In file included from /opt/FirefoxSource/mozilla-release/js/src/gc/Barrier.h:12:0,
26:02.21                  from /opt/FirefoxSource/mozilla-release/js/src/jsobj.h:21,
26:02.21                  from /opt/FirefoxSource/mozilla-release/js/src/jsfun.h:14,
26:02.21                  from /opt/FirefoxSource/mozilla-release/js/src/jit/JitFrameIterator.h:10,
26:02.21                  from /opt/FirefoxSource/mozilla-release/js/src/jit/Bailouts.h:12,
26:02.21                  from /opt/FirefoxSource/mozilla-release/js/src/jit/LIR.h:15,
26:02.21                  from /opt/FirefoxSource/mozilla-release/js/src/jit/shared/Lowering-shared.h:13,
26:02.21                  from /opt/FirefoxSource/mozilla-release/js/src/jit/shared/Lowering-shared-inl.h:10,
26:02.21                  from /opt/FirefoxSource/mozilla-release/js/src/jit/shared/Lowering-shared.cpp:7,
26:02.22                  from /opt/FirefoxSource/mozilla-release/objdir-droid/js/src/Unified_cpp_js_src7.cpp:2:
26:02.22 Warning: -Wmaybe-uninitialized in /opt/FirefoxSource/mozilla-release/js/src/gc/Heap.h: '*((void*)(& i)+12).js::gc::ArenaCellIterImpl::span.js::gc::FreeSpan::last' may be used uninitialized in this function
26:02.22 /opt/FirefoxSource/mozilla-release/js/src/gc/Heap.h:304:48: warning: '*((void*)(& i)+12).js::gc::ArenaCellIterImpl::span.js::gc::FreeSpan::last' may be used uninitialized in this function [-Wmaybe-uninitialized]
26:02.22 In file included from /opt/FirefoxSource/mozilla-release/objdir-droid/js/src/Unified_cpp_js_src7.cpp:101:0:
26:02.22 /opt/FirefoxSource/mozilla-release/js/src/jsgc.cpp:6742:30: note: '*((void*)(& i)+12).js::gc::ArenaCellIterImpl::span.js::gc::FreeSpan::last' was declared here
26:02.22 In file included from /opt/FirefoxSource/mozilla-release/js/src/vm/Shape-inl.h:22:0,
26:02.22                  from /opt/FirefoxSource/mozilla-release/js/src/jsscriptinlines.h:19,
26:02.22                  from /opt/FirefoxSource/mozilla-release/js/src/jsapi.cpp:91,
26:02.22                  from /opt/FirefoxSource/mozilla-release/objdir-droid/js/src/Unified_cpp_js_src7.cpp:20:
26:02.22 Warning: -Wmaybe-uninitialized in /opt/FirefoxSource/mozilla-release/js/src/jsgcinlines.h: '*((void*)(& i)+12).js::gc::ArenaCellIterImpl::span.js::gc::FreeSpan::first' may be used uninitialized in this function
26:02.22 /opt/FirefoxSource/mozilla-release/js/src/jsgcinlines.h:134:9: warning: '*((void*)(& i)+12).js::gc::ArenaCellIterImpl::span.js::gc::FreeSpan::first' may be used uninitialized in this function [-Wmaybe-uninitialized]
26:02.22 In file included from /opt/FirefoxSource/mozilla-release/objdir-droid/js/src/Unified_cpp_js_src7.cpp:101:0:
26:02.22 /opt/FirefoxSource/mozilla-release/js/src/jsgc.cpp:6742:30: note: '*((void*)(& i)+12).js::gc::ArenaCellIterImpl::span.js::gc::FreeSpan::first' was declared here
26:02.22 In file included from /opt/FirefoxSource/mozilla-release/js/src/jit/Bailouts.h:12:0,
26:02.22                  from /opt/FirefoxSource/mozilla-release/js/src/jit/LIR.h:15,
26:02.22                  from /opt/FirefoxSource/mozilla-release/js/src/jit/shared/Lowering-shared.h:13,
26:02.22                  from /opt/FirefoxSource/mozilla-release/js/src/jit/shared/Lowering-shared-inl.h:10,
26:02.22                  from /opt/FirefoxSource/mozilla-release/js/src/jit/shared/Lowering-shared.cpp:7,
26:02.22                  from /opt/FirefoxSource/mozilla-release/objdir-droid/js/src/Unified_cpp_js_src7.cpp:2:
26:02.22 /opt/FirefoxSource/mozilla-release/js/src/jit/JitFrameIterator.h: In member function 'void js::jit::JitFrameIterator::unaliasedForEachActual(Op, js::jit::ReadFrameArgsBehavior) const [with Op = js::CopyTo]':
26:02.22 Warning: -Wmaybe-uninitialized in /opt/FirefoxSource/mozilla-release/js/src/jit/JitFrameIterator.h: 'end' may be used uninitialized in this function
26:02.22 /opt/FirefoxSource/mozilla-release/js/src/jit/JitFrameIterator.h:235:10: warning: 'end' may be used uninitialized in this function [-Wmaybe-uninitialized]
26:02.22 Warning: -Wmaybe-uninitialized in /opt/FirefoxSource/mozilla-release/js/src/jit/JitFrameIterator.h: 'start' may be used uninitialized in this function
26:02.22 /opt/FirefoxSource/mozilla-release/js/src/jit/JitFrameIterator.h:235:10: warning: 'start' may be used uninitialized in this function [-Wmaybe-uninitialized]
26:02.22 libjs_static.a
26:04.30 Unified_cpp_js_src_shell0.o
26:04.30 StaticXULComponentsStart.o
26:04.31 Unified_cpp_js_src_gdb0.o
26:04.31 Unified_cpp_js_src_jsapi-tests0.o
26:04.31 Unified_cpp_js_src_jsapi-tests1.o
26:04.84 libxul_s.a.desc
26:04.84 libxul.so
26:07.13 gdb-tests
26:09.51 Unified_cpp_js_src_jsapi-tests2.o
26:12.71 Unified_cpp_js_src_jsapi-tests3.o
26:15.50 js
26:15.62 Unified_cpp_js_src_jsapi-tests4.o
26:17.73 Unified_cpp_js_src_jsapi-tests5.o
26:34.46 jsapi-tests
27:41.84 PropertiesTest.o
27:41.84 ReadNTLM.o
27:41.86 triplescat.o
27:41.95 TestComponent.o
27:42.15 TestAudioEventTimeline.o
27:42.24 libtest656331.so
27:42.38 TestComponent.o
27:42.58 libtestcomponent.so
27:42.79 test_tone.o
27:43.18 triplescat
27:43.34 test_tone
27:43.39 TestCSPParser.o
27:43.39 TestGetURL.o
27:43.48 TestTXMgr.o
27:44.63 TestAudioEventTimeline
27:44.75 TestBlockingSocket.o
27:44.85 rdfpoll.o
27:44.98 TestNativeXMLHttpRequest.o
27:45.16 TestCallbacks.o
27:45.39 rdfpoll
27:45.57 test_AsXXX_helpers.o
27:45.57 test_async_callbacks_with_spun_event_loops.o
27:45.68 TestPlainTextSerializer.o
27:45.71 TestTXMgr
27:45.82 TestComponent.o
27:45.99 libtestcompnoaslr.so
27:46.12 TestAudioChannelService.o
27:46.40 TestDNS.o
27:46.64 test_asyncStatementExecution_transaction.o
27:47.22 TestCSPParser
27:47.22 TestGetURL
27:47.31 TestNativeXMLHttpRequest
27:47.39 TestPlainTextSerializer
27:47.52 test_binding_params.o
27:47.69 xpcshell.o
27:47.70 TestAudioChannelService
27:47.82 TestIncrementalDownload.o
27:47.89 Unified_cpp_components_native0.o
27:47.89 xpcshell
27:48.07 TestLineBreak.o
27:48.38 TestOpen.o
27:48.75 test_file_perms.o
27:48.81 libxpctest.so
27:48.88 TestLineBreak
27:48.90 test_mutex.o
27:49.00 Unified_cpp_xpcom_sample0.o
27:49.42 libxpcomsample.so
27:49.70 TestProtocols.o
27:49.72 test_service_init_background_thread.o
27:49.74 test_statement_scoper.o
27:49.75 TestAppShellSteadyState.o
27:50.52 test_StatementCache.o
27:50.63 Unified_cpp_streamconv_test0.o
27:50.96 TestServ.o
27:51.27 TestStreamConv
27:51.38 test_transaction_helper.o
27:51.43 nsIFileEnumerator.o
27:51.43 TestArguments.o
27:51.81 TestBlockingProcess.o
27:51.87 TestCallTemplates.o
27:51.91 TestINIParser.o
27:52.21 TestPRIntN.o
27:52.47 TestAppShellSteadyState
27:52.58 test_true_async.o
27:52.61 TestStartupCache.o
27:52.64 TestQuickReturn.o
27:52.68 TestRacingServiceManager.o
27:52.72 TestRegistrationOrder.o
27:52.85 TestStandardURL.o
27:53.45 TestThreadPoolListener.o
27:53.61 TestStartupCache
27:53.64 test_unlock_notify.o
27:53.77 TestWebGLElementArrayCache.o
27:54.06 TestTimers.o
27:54.14 TestStreamLoader.o
27:54.56 TestUpload.o
27:54.72 TestUnicodeArguments.o
27:55.22 TestWebGLElementArrayCache
27:55.36 ShowAlignments.o
27:55.37 TestAutoPtr.o
27:55.44 TestMinStringAPI.o
27:55.47 TestAutoRef.o
27:55.59 test_AsXXX_helpers
27:55.59 test_async_callbacks_with_spun_event_loops
27:55.70 test_asyncStatementExecution_transaction
27:55.79 test_binding_params
27:55.87 test_file_perms
27:55.92 TestURLParser.o
27:55.97 test_mutex
27:56.08 test_service_init_background_thread
27:56.12 TestCOMArray.o
27:56.16 test_statement_scoper
27:56.20 TestMinStringAPI
27:56.25 test_StatementCache
27:56.32 rdfcat.o
27:56.37 test_transaction_helper
27:56.46 test_true_async
27:56.55 test_unlock_notify
27:56.67 TestCOMPtr.o
27:56.84 TestCertDB.o
27:56.92 rdfcat
27:57.01 TestCOMPtrEq.o
27:57.07 TestCertDB
27:57.16 TestDeque.o
27:57.34 TestFile.o
27:57.49 TestHashtables.o
27:57.53 TestID.o
27:57.53 urltest.o
27:57.96 TestBind.o
27:58.03 TestNsRefPtr.o
27:58.16 TestObserverArray.o
27:58.33 NormalizationTest.o
27:58.33 UnicharSelfTest.o
27:58.61 TestObserverService.o
27:58.70 TestCookie.o
27:58.87 NormalizationTest
27:58.88 TestSTSParser.o
27:59.18 UnicharSelfTest
27:59.43 TestAudioBuffers.o
27:59.43 TestAudioMixer.o
27:59.51 TestUDPSocket.o
27:59.74 TestPipe.o
28:00.16 TestPLDHash.o
28:00.54 TestAudioBuffers
28:00.54 TestAudioMixer
28:00.71 TestStringAPI.o
28:00.72 TestTArray.o
28:00.82 TestTextFormatter.o
28:01.15 PropertiesTest
28:01.15 ReadNTLM
28:01.21 TestThreadUtils.o
28:01.24 TestJemalloc.o
28:01.53 TestBlockingSocket
28:02.02 TestCallbacks
28:02.10 nsIFileEnumerator
28:02.10 TestDNS
28:02.14 TestArguments
28:02.19 TestIncrementalDownload
28:02.21 TestBlockingProcess
28:02.24 TestCallTemplates
28:02.28 TestOpen
28:02.28 TestProtocols
28:02.31 TestServ
28:02.37 TestStandardURL
28:02.37 TestStreamLoader
28:02.40 TestUpload
28:02.45 TestURLParser
28:02.46 TestINIParser
28:02.49 TestPRIntN
28:02.54 urltest
28:02.54 TestQuickReturn
28:02.58 TestRacingServiceManager
28:02.61 TestRegistrationOrder
28:02.62 TestBind
28:02.65 TestThreadPoolListener
28:02.70 TestTimers
28:02.71 TestCookie
28:02.74 TestUnicodeArguments
28:02.79 ShowAlignments
28:02.79 TestSTSParser
28:02.82 TestAutoPtr
28:02.86 TestAutoRef
28:02.89 TestUDPSocket
28:02.90 TestCOMArray
28:02.96 TestCOMPtr
28:02.98 TestCOMPtrEq
28:03.05 TestDeque
28:03.10 TestFile
28:03.12 TestHashtables
28:03.16 TestID
28:03.19 TestNsRefPtr
28:03.20 TestObserverArray
28:03.25 TestObserverService
28:03.28 TestPipe
28:03.30 TestPLDHash
28:03.34 TestStringAPI
28:03.37 TestTextFormatter
28:03.39 TestThreadUtils
28:03.43 TestJemalloc
28:04.93 TestTArray
28:16.50 /opt/FirefoxSource/mozilla-release/toolkit/modules/GMPUtils.jsm: WARNING: no preprocessor directives found
28:18.08 /opt/FirefoxSource/mozilla-release/config/rules.mk:1512: warning: overriding recipe for target '../../../dist/bin/modules/LoginManagerParent.jsm'
28:18.08 /opt/FirefoxSource/mozilla-release/config/rules.mk:1447: warning: ignoring old recipe for target '../../../dist/bin/modules/LoginManagerParent.jsm'
28:18.73 Exporting extension to source/test/addons/l10n.xpi.
28:18.74 Exporting extension to source/test/addons/packed.xpi.
28:18.74 Exporting extension to source/test/addons/simple-prefs.xpi.
28:18.89 Exporting extension to source/test/addons/require.xpi.
28:18.98 Exporting extension to source/test/addons/child_process.xpi.
28:19.04 Exporting extension to source/test/addons/e10s.xpi.
28:19.07 Exporting extension to source/test/addons/addon-manager.xpi.
28:19.12 Exporting extension to source/test/addons/unpacked.xpi.
28:19.26 Exporting extension to source/test/addons/unsafe-content-script.xpi.
28:19.44 Exporting extension to source/test/addons/page-mod-debugger-pre.xpi.
28:19.57 Exporting extension to source/test/addons/standard-id.xpi.
28:19.72 Exporting extension to source/test/addons/places.xpi.
28:19.75 /opt/FirefoxSource/mozilla-release/addon-sdk/source/python-lib/cuddlefish/xpi.py:22: UserWarning: Duplicate name: 'locale/'
28:19.75   zf.writestr(dirinfo, "")
28:19.76 Exporting extension to source/test/addons/l10n-properties.xpi.
28:19.79 Exporting extension to source/test/addons/translators.xpi.
28:19.96 Exporting extension to source/test/addons/main.xpi.
28:20.00 Exporting extension to source/test/addons/name-in-numbers.xpi.
28:20.13 Exporting extension to source/test/addons/content-permissions.xpi.
28:20.21 Exporting extension to source/test/addons/self.xpi.
28:20.26 Exporting extension to source/test/addons/preferences-branch.xpi.
28:20.47 Exporting extension to source/test/addons/e10s-tabs.xpi.
28:20.51 Exporting extension to source/test/addons/tab-close-on-startup.xpi.
28:20.73 Exporting extension to source/test/addons/packaging.xpi.
28:20.75 Exporting extension to source/test/addons/curly-id.xpi.
28:20.76 Exporting extension to source/test/addons/private-browsing-supported.xpi.
28:20.92 Exporting extension to source/test/addons/contributors.xpi.
28:20.96 Exporting extension to source/test/addons/name-in-numbers-plus.xpi.
28:20.96 Exporting extension to source/test/addons/predefined-id-with-at.xpi.
28:21.01 Warning: missing module: ./toolkit-require-reload-child
28:21.13 Exporting extension to source/test/addons/symbiont.xpi.
28:21.19 Exporting extension to source/test/addons/toolkit-require-reload.xpi.
28:21.32 Exporting extension to source/test/addons/author-email.xpi.
28:21.39 Exporting extension to source/test/addons/e10s-content.xpi.
28:21.47 Exporting extension to source/test/addons/page-mod-debugger-post.xpi.
28:21.49 Exporting extension to source/test/addons/chrome.xpi.
28:21.60 Exporting extension to source/test/addons/simple-prefs-regression.xpi.
28:21.62 Exporting extension to source/test/addons/developers.xpi.
28:21.75 Exporting extension to source/test/addons/simple-prefs-l10n.xpi.
28:21.90 Exporting extension to source/test/addons/layout-change.xpi.
28:25.84 /opt/FirefoxSource/mozilla-release/netwerk/base/security-prefs.js: WARNING: no preprocessor directives found
28:31.42   adding: install.rdf (deflated 52%)
28:31.69   adding: plugins/libnptest.so (deflated 64%)
28:31.93   adding: plugins/libnpsecondtest.so (deflated 64%)
28:34.74 /opt/FirefoxSource/mozilla-release/config/rules.mk:1512: warning: overriding recipe for target '../../../dist/bin/modules/LoginManagerParent.jsm'
28:34.74 /opt/FirefoxSource/mozilla-release/config/rules.mk:1447: warning: ignoring old recipe for target '../../../dist/bin/modules/LoginManagerParent.jsm'
28:40.42 /opt/FirefoxSource/mozilla-release/mobile/android/thirdparty/jap/branding/locales/en-US/brand.properties: WARNING: no useful preprocessor directives found
28:40.64 /opt/FirefoxSource/mozilla-release/mobile/locales/en-US/overrides/netError.dtd: WARNING: no preprocessor directives found
28:40.64 /opt/FirefoxSource/mozilla-release/mobile/locales/en-US/overrides/appstrings.properties: WARNING: no useful preprocessor directives found
28:40.65 /opt/FirefoxSource/mozilla-release/mobile/locales/en-US/overrides/passwordmgr.properties: WARNING: no useful preprocessor directives found
28:41.07 stumbler.jar
28:44.93 /opt/FirefoxSource/mozilla-release/mobile/android/base/WebappManifestFragment.xml.frag.in: WARNING: no preprocessor directives found
28:44.95 constants.jar
28:45.31 gecko-thirdparty.jar
28:45.54 sync-thirdparty.jar
28:45.64 Read 3 engines: [u'Google', u'Yahoo', u'Bing']
28:45.64 Default engine is 'Google'.
28:45.64 Region 'US': Read 3 engines: [u'Yahoo', u'Google', u'Bing']
28:45.64 Region 'US': Default engine is 'Yahoo'.
28:45.64 /opt/FirefoxSource/mozilla-release/objdir-droid/mobile/android/base/res/raw/browsersearch.json updated
28:46.62 Note: /opt/FirefoxSource/mozilla-release/mobile/android/base/SysInfo.java uses or overrides a deprecated API.
28:46.62 Note: Recompile with -Xlint:deprecation for details.
28:46.62 Reading 4 suggested sites: [u'mozilla', u'fxmarketplace', u'fxaddons', u'fxsupport']
28:46.62 Found 4 drawables in '/opt/FirefoxSource/mozilla-release/mobile/android/base/resources' for 'mozilla': ['drawable-hdpi/suggestedsites_mozilla.png', 'drawable-mdpi/suggestedsites_mozilla.png', 'drawable-xhdpi/suggestedsites_mozilla.png', 'drawable-xxhdpi/suggestedsites_mozilla.png']
28:46.62 Found 4 drawables in '/opt/FirefoxSource/mozilla-release/mobile/android/base/resources' for 'fxmarketplace': ['drawable-hdpi/suggestedsites_fxmarketplace.png', 'drawable-mdpi/suggestedsites_fxmarketplace.png', 'drawable-xhdpi/suggestedsites_fxmarketplace.png', 'drawable-xxhdpi/suggestedsites_fxmarketplace.png']
28:46.62 Found 4 drawables in '/opt/FirefoxSource/mozilla-release/mobile/android/base/resources' for 'fxaddons': ['drawable-hdpi/suggestedsites_fxaddons.png', 'drawable-mdpi/suggestedsites_fxaddons.png', 'drawable-xhdpi/suggestedsites_fxaddons.png', 'drawable-xxhdpi/suggestedsites_fxaddons.png']
28:46.62 Found 4 drawables in '/opt/FirefoxSource/mozilla-release/mobile/android/base/resources' for 'fxsupport': ['drawable-hdpi/suggestedsites_fxsupport.png', 'drawable-mdpi/suggestedsites_fxsupport.png', 'drawable-xhdpi/suggestedsites_fxsupport.png', 'drawable-xxhdpi/suggestedsites_fxsupport.png']
28:46.62 /opt/FirefoxSource/mozilla-release/objdir-droid/mobile/android/base/res/raw/suggestedsites.json updated
28:46.64 geckoview_resources.zip
28:46.72 gecko-mozglue.jar
28:47.27     (skipping file '.mkdir.done' due to ANDROID_AAPT_IGNORE pattern '.*')
28:47.27     (skipping file '.mkdir.done' due to ANDROID_AAPT_IGNORE pattern '.*')
28:47.28     (skipping file 'fxaccount_custom_server_view.xml.orig' due to ANDROID_AAPT_IGNORE pattern '*.orig')
28:47.66 /opt/FirefoxSource/mozilla-release/mobile/android/base/resources/drawable-hdpi/ab_search.png: libpng warning: iCCP: Not recognizing known sRGB profile that has been edited
28:47.66 /opt/FirefoxSource/mozilla-release/mobile/android/base/resources/drawable-mdpi/ab_search.png: libpng warning: iCCP: Not recognizing known sRGB profile that has been edited
28:47.76 /opt/FirefoxSource/mozilla-release/mobile/android/base/resources/drawable-xhdpi/ab_search.png: libpng warning: iCCP: Not recognizing known sRGB profile that has been edited
28:48.84 /opt/FirefoxSource/mozilla-release/mobile/android/base/resources/drawable-mdpi/favicon_search.png: libpng warning: iCCP: Not recognizing known sRGB profile that has been edited
28:48.84 /opt/FirefoxSource/mozilla-release/mobile/android/base/resources/drawable-hdpi/favicon_search.png: libpng warning: iCCP: Not recognizing known sRGB profile that has been edited
28:48.85 /opt/FirefoxSource/mozilla-release/mobile/android/base/resources/drawable-xhdpi/favicon_search.png: libpng warning: iCCP: Not recognizing known sRGB profile that has been edited
28:48.85 /opt/FirefoxSource/mozilla-release/mobile/android/base/resources/drawable-xxhdpi/favicon_search.png: libpng warning: iCCP: Not recognizing known sRGB profile that has been edited
28:48.88 /opt/FirefoxSource/mozilla-release/mobile/android/base/resources/drawable-mdpi/homepage_banner_firstrun.png: libpng warning: iCCP: Not recognizing known sRGB profile that has been edited
28:48.88 /opt/FirefoxSource/mozilla-release/mobile/android/base/resources/drawable-hdpi/homepage_banner_firstrun.png: libpng warning: iCCP: Not recognizing known sRGB profile that has been edited
28:48.89 /opt/FirefoxSource/mozilla-release/mobile/android/base/resources/drawable-xhdpi/homepage_banner_firstrun.png: libpng warning: iCCP: Not recognizing known sRGB profile that has been edited
28:48.89 /opt/FirefoxSource/mozilla-release/mobile/android/base/resources/drawable-xxhdpi/homepage_banner_firstrun.png: libpng warning: iCCP: Not recognizing known sRGB profile that has been edited
28:49.28 /opt/FirefoxSource/mozilla-release/mobile/android/base/resources/drawable-mdpi/network_error.png: libpng warning: iCCP: Not recognizing known sRGB profile that has been edited
28:49.29 /opt/FirefoxSource/mozilla-release/mobile/android/base/resources/drawable-hdpi/network_error.png: libpng warning: iCCP: Not recognizing known sRGB profile that has been edited
28:49.29 /opt/FirefoxSource/mozilla-release/mobile/android/base/resources/drawable-xxhdpi/network_error.png: libpng warning: iCCP: Not recognizing known sRGB profile that has been edited
28:49.29 /opt/FirefoxSource/mozilla-release/mobile/android/base/resources/drawable-xhdpi/network_error.png: libpng warning: iCCP: Not recognizing known sRGB profile that has been edited
28:49.54 /opt/FirefoxSource/mozilla-release/mobile/android/base/resources/drawable-mdpi/search_clear.png: libpng warning: iCCP: Not recognizing known sRGB profile that has been edited
28:49.54 /opt/FirefoxSource/mozilla-release/mobile/android/base/resources/drawable-hdpi/search_clear.png: libpng warning: iCCP: Not recognizing known sRGB profile that has been edited
28:49.54 /opt/FirefoxSource/mozilla-release/mobile/android/base/resources/drawable-xhdpi/search_clear.png: libpng warning: iCCP: Not recognizing known sRGB profile that has been edited
28:49.54 /opt/FirefoxSource/mozilla-release/mobile/android/base/resources/drawable-xxhdpi/search_clear.png: libpng warning: iCCP: Not recognizing known sRGB profile that has been edited
28:49.54 /opt/FirefoxSource/mozilla-release/mobile/android/base/resources/drawable-mdpi/search_icon_active.png: libpng warning: iCCP: Not recognizing known sRGB profile that has been edited
28:49.54 /opt/FirefoxSource/mozilla-release/mobile/android/base/resources/drawable-hdpi/search_icon_active.png: libpng warning: iCCP: Not recognizing known sRGB profile that has been edited
28:49.54 /opt/FirefoxSource/mozilla-release/mobile/android/base/resources/drawable-xhdpi/search_icon_active.png: libpng warning: iCCP: Not recognizing known sRGB profile that has been edited
28:49.54 /opt/FirefoxSource/mozilla-release/mobile/android/base/resources/drawable-mdpi/search_icon_inactive.png: libpng warning: iCCP: Not recognizing known sRGB profile that has been edited
28:49.54 /opt/FirefoxSource/mozilla-release/mobile/android/base/resources/drawable-xxhdpi/search_icon_active.png: libpng warning: iCCP: Not recognizing known sRGB profile that has been edited
28:49.54 /opt/FirefoxSource/mozilla-release/mobile/android/base/resources/drawable-hdpi/search_icon_inactive.png: libpng warning: iCCP: Not recognizing known sRGB profile that has been edited
28:49.54 /opt/FirefoxSource/mozilla-release/mobile/android/base/resources/drawable-xhdpi/search_icon_inactive.png: libpng warning: iCCP: Not recognizing known sRGB profile that has been edited
28:49.54 /opt/FirefoxSource/mozilla-release/mobile/android/base/resources/drawable-xxhdpi/search_icon_inactive.png: libpng warning: iCCP: Not recognizing known sRGB profile that has been edited
28:49.55 /opt/FirefoxSource/mozilla-release/mobile/android/base/resources/drawable-hdpi/search_launcher.png: libpng warning: iCCP: Not recognizing known sRGB profile that has been edited
28:49.55 /opt/FirefoxSource/mozilla-release/mobile/android/base/resources/drawable-xhdpi/search_launcher.png: libpng warning: iCCP: Not recognizing known sRGB profile that has been edited
28:49.56 /opt/FirefoxSource/mozilla-release/mobile/android/base/resources/drawable-mdpi/search_launcher.png: libpng warning: iCCP: Not recognizing known sRGB profile that has been edited
28:49.57 /opt/FirefoxSource/mozilla-release/mobile/android/base/resources/drawable-xxhdpi/search_launcher.png: libpng warning: iCCP: Not recognizing known sRGB profile that has been edited
28:49.57 /opt/FirefoxSource/mozilla-release/mobile/android/base/resources/drawable-xxxhdpi/search_launcher.png: libpng warning: iCCP: Not recognizing known sRGB profile that has been edited
28:49.59 /opt/FirefoxSource/mozilla-release/mobile/android/base/resources/drawable-mdpi/search_plus.png: libpng warning: iCCP: Not recognizing known sRGB profile that has been edited
28:49.59 /opt/FirefoxSource/mozilla-release/mobile/android/base/resources/drawable-hdpi/search_plus.png: libpng warning: iCCP: Not recognizing known sRGB profile that has been edited
28:49.59 /opt/FirefoxSource/mozilla-release/mobile/android/base/resources/drawable-xhdpi/search_plus.png: libpng warning: iCCP: Not recognizing known sRGB profile that has been edited
28:49.59 /opt/FirefoxSource/mozilla-release/mobile/android/base/resources/drawable-xxhdpi/search_plus.png: libpng warning: iCCP: Not recognizing known sRGB profile that has been edited
28:49.85 /opt/FirefoxSource/mozilla-release/mobile/android/base/resources/drawable-mdpi/suggestion_item_search.png: libpng warning: iCCP: Not recognizing known sRGB profile that has been edited
28:49.85 /opt/FirefoxSource/mozilla-release/mobile/android/base/resources/drawable-hdpi/suggestion_item_search.png: libpng warning: iCCP: Not recognizing known sRGB profile that has been edited
28:49.85 /opt/FirefoxSource/mozilla-release/mobile/android/base/resources/drawable-xhdpi/suggestion_item_search.png: libpng warning: iCCP: Not recognizing known sRGB profile that has been edited
28:49.86 /opt/FirefoxSource/mozilla-release/mobile/android/base/resources/drawable-xxhdpi/suggestion_item_search.png: libpng warning: iCCP: Not recognizing known sRGB profile that has been edited
28:49.92 /opt/FirefoxSource/mozilla-release/mobile/android/base/resources/drawable-mdpi/url_bar_entry_default.9.png: libpng warning: iCCP: Not recognizing known sRGB profile that has been edited
28:49.92 /opt/FirefoxSource/mozilla-release/mobile/android/base/resources/drawable-hdpi/url_bar_entry_default.9.png: libpng warning: iCCP: Not recognizing known sRGB profile that has been edited
28:49.93 /opt/FirefoxSource/mozilla-release/mobile/android/base/resources/drawable-xhdpi/url_bar_entry_default.9.png: libpng warning: iCCP: Not recognizing known sRGB profile that has been edited
28:49.94 /opt/FirefoxSource/mozilla-release/mobile/android/base/resources/drawable-xxhdpi/url_bar_entry_default.9.png: libpng warning: iCCP: Not recognizing known sRGB profile that has been edited
28:49.95 /opt/FirefoxSource/mozilla-release/mobile/android/base/resources/drawable-hdpi/url_bar_entry_default_pb.9.png: libpng warning: iCCP: Not recognizing known sRGB profile that has been edited
28:49.95 /opt/FirefoxSource/mozilla-release/mobile/android/base/resources/drawable-xhdpi/url_bar_entry_default_pb.9.png: libpng warning: iCCP: Not recognizing known sRGB profile that has been edited
28:49.95 /opt/FirefoxSource/mozilla-release/mobile/android/base/resources/drawable-mdpi/url_bar_entry_default_pb.9.png: libpng warning: iCCP: Not recognizing known sRGB profile that has been edited
28:49.95 /opt/FirefoxSource/mozilla-release/mobile/android/base/resources/drawable-xxhdpi/url_bar_entry_default_pb.9.png: libpng warning: iCCP: Not recognizing known sRGB profile that has been edited
28:49.95 /opt/FirefoxSource/mozilla-release/mobile/android/base/resources/drawable-mdpi/url_bar_entry_pressed.9.png: libpng warning: iCCP: Not recognizing known sRGB profile that has been edited
28:49.96 /opt/FirefoxSource/mozilla-release/mobile/android/base/resources/drawable-hdpi/url_bar_entry_pressed.9.png: libpng warning: iCCP: Not recognizing known sRGB profile that has been edited
28:49.96 /opt/FirefoxSource/mozilla-release/mobile/android/base/resources/drawable-xhdpi/url_bar_entry_pressed.9.png: libpng warning: iCCP: Not recognizing known sRGB profile that has been edited
28:49.96 /opt/FirefoxSource/mozilla-release/mobile/android/base/resources/drawable-xxhdpi/url_bar_entry_pressed.9.png: libpng warning: iCCP: Not recognizing known sRGB profile that has been edited
28:49.97 /opt/FirefoxSource/mozilla-release/mobile/android/base/resources/drawable-mdpi/url_bar_entry_pressed_pb.9.png: libpng warning: iCCP: Not recognizing known sRGB profile that has been edited
28:49.97 /opt/FirefoxSource/mozilla-release/mobile/android/base/resources/drawable-xhdpi/url_bar_entry_pressed_pb.9.png: libpng warning: iCCP: Not recognizing known sRGB profile that has been edited
28:49.97 /opt/FirefoxSource/mozilla-release/mobile/android/base/resources/drawable-hdpi/url_bar_entry_pressed_pb.9.png: libpng warning: iCCP: Not recognizing known sRGB profile that has been edited
28:49.98 /opt/FirefoxSource/mozilla-release/mobile/android/base/resources/drawable-xxhdpi/url_bar_entry_pressed_pb.9.png: libpng warning: iCCP: Not recognizing known sRGB profile that has been edited
28:49.98 /opt/FirefoxSource/mozilla-release/mobile/android/base/resources/drawable-xxhdpi/urlbar_stop.png: libpng warning: iCCP: Not recognizing known sRGB profile that has been edited
28:51.40 Note: Some input files use or override a deprecated API.
28:51.40 Note: Recompile with -Xlint:deprecation for details.
28:51.40 Note: Some input files use unchecked or unsafe operations.
28:51.40 Note: Recompile with -Xlint:unchecked for details.
28:51.64 /opt/FirefoxSource/mozilla-release/mobile/android/base/resources/layout/firstrun_welcome_fragment.xml:25: error: Error: No resource found that matches the given name (at 'src' with value '@drawable/large_icon').
28:51.64 /opt/FirefoxSource/mozilla-release/mobile/android/base/resources/layout-mdpi/firstrun_welcome_fragment.xml:25: error: Error: No resource found that matches the given name (at 'src' with value '@drawable/large_icon').
28:51.64 /opt/FirefoxSource/mozilla-release/mobile/android/base/resources/layout/keyguard_widget.xml:12: error: Error: No resource found that matches the given name (at 'src' with value '@drawable/widget_icon').
28:51.64 /opt/FirefoxSource/mozilla-release/mobile/android/base/resources/layout/search_widget.xml:15: error: Error: No resource found that matches the given name (at 'src' with value '@drawable/widget_icon').
28:51.64 /opt/FirefoxSource/mozilla-release/mobile/android/base/resources/xml/search_widget_info.xml:6: error: Error: No resource found that matches the given name (at 'previewImage' with value '@drawable/launcher_widget').
28:51.65 Makefile:435: recipe for target '.aapt.deps' failed
28:51.65 make[5]: *** [.aapt.deps] Error 1
28:51.65 make[5]: *** Deleting file '.aapt.deps'
28:51.67 make[5]: *** Warte auf noch nicht beendete Prozesse...
28:55.26 Note: Some input files use or override a deprecated API.
28:55.26 Note: Recompile with -Xlint:deprecation for details.
28:55.26 Note: Some input files use unchecked or unsafe operations.
28:55.26 Note: Recompile with -Xlint:unchecked for details.
28:55.64 /opt/FirefoxSource/mozilla-release/config/recurse.mk:82: recipe for target 'mobile/android/base/libs' failed
28:55.64 make[4]: *** [mobile/android/base/libs] Error 2
28:55.64 /opt/FirefoxSource/mozilla-release/config/recurse.mk:36: recipe for target 'libs' failed
28:55.64 make[3]: *** [libs] Error 2
28:55.64 /opt/FirefoxSource/mozilla-release/config/rules.mk:541: recipe for target 'default' failed
28:55.64 make[2]: *** [default] Error 2
28:55.65 /opt/FirefoxSource/mozilla-release/client.mk:398: recipe for target 'realbuild' failed
28:55.65 make[1]: *** [realbuild] Error 2
28:55.65 client.mk:171: recipe for target 'build' failed
28:55.65 make: *** [build] Error 2
28:55.66 366 compiler warnings present.
28:57.14 Notification center failed: Install the python dbus module to get a notification when the build finishes.
Build step 'Shell ausführen' marked build as failure
[PostBuildScript] - Execution post build scripts.
[PostBuildScript] Build is not success : do not execute script
Finished: FAILURE