Console Output

Skipping 530 KB.. Full Log
35:59.67 Warning: -Wmultichar in /opt/FirefoxSource/mozilla-release/media/omx-plugin/include/gb/stagefright/MetaData.h: multi-character character constant
35:59.67 /opt/FirefoxSource/mozilla-release/media/omx-plugin/include/gb/stagefright/MetaData.h:123:24: warning: multi-character character constant [-Wmultichar]
35:59.67 libstagefright.so
35:59.76 BadPlugin.o
35:59.76 GoodPlugin.o
35:59.83 BadPlugin
35:59.83 GoodPlugin
36:01.32 pkix_pl_httpdefaultclient.c: In function 'pkix_pl_HttpDefaultClient_HdrCheckComplete':
36:01.32 pkix_pl_httpdefaultclient.c:268:32: warning: comparison between signed and unsigned integer expressions [-Wsign-compare]
36:01.32 pkix_pl_httpdefaultclient.c:285:41: warning: comparison between signed and unsigned integer expressions [-Wsign-compare]
36:01.32 pkix_pl_httpdefaultclient.c:293:40: warning: comparison between signed and unsigned integer expressions [-Wsign-compare]
36:01.32 pkix_pl_httpdefaultclient.c: In function 'pkix_pl_HttpDefaultClient_RecvBody':
36:01.32 pkix_pl_httpdefaultclient.c:925:39: warning: comparison between signed and unsigned integer expressions [-Wsign-compare]
36:01.32 pkix_pl_httpdefaultclient.c:940:31: warning: comparison between signed and unsigned integer expressions [-Wsign-compare]
36:01.32 pkix_pl_httpdefaultclient.c:945:31: warning: comparison between signed and unsigned integer expressions [-Wsign-compare]
36:01.32 pkix_pl_httpdefaultclient.c:951:38: warning: comparison between signed and unsigned integer expressions [-Wsign-compare]
36:01.32 pkix_pl_httpdefaultclient.c:995:39: warning: comparison between signed and unsigned integer expressions [-Wsign-compare]
36:01.32 pkix_pl_httpdefaultclient.c:1005:43: warning: comparison between signed and unsigned integer expressions [-Wsign-compare]
36:01.32 pkix_pl_httpdefaultclient.c: In function 'pkix_pl_HttpDefaultClient_KeepAliveSession':
36:01.32 pkix_pl_httpdefaultclient.c:1135:36: warning: variable 'client' set but not used [-Wunused-but-set-variable]
36:01.32 pkix_pl_httpdefaultclient.c: In function 'pkix_pl_HttpDefaultClient_TrySendAndReceive':
36:01.32 pkix_pl_httpdefaultclient.c:1429:63: warning: comparison between signed and unsigned integer expressions [-Wsign-compare]
36:01.32 pkix_pl_httpdefaultclient.c: In function 'pkix_pl_HttpDefaultClient_Cancel':
36:01.32 pkix_pl_httpdefaultclient.c:1487:36: warning: variable 'client' set but not used [-Wunused-but-set-variable]
36:01.45 nssinit.c: In function 'NSS_VersionCheck':
36:01.45 nssinit.c:1250:19: warning: variable 'c' set but not used [-Wunused-but-set-variable]
36:02.12 pkix_pl_publickey.c: In function 'pkix_pl_PublicKey_Hashcode':
36:02.12 pkix_pl_publickey.c:214:21: warning: variable 'fullHash' set but not used [-Wunused-but-set-variable]
36:02.30 nsXHTMLContentSerializer.o
36:02.30 dtlscon.c: In function 'ssl3_DisableNonDTLSSuites':
36:02.30 dtlscon.c:107:19: warning: unused variable 'rv' [-Wunused-variable]
36:02.30 dtlscon.c: In function 'dtls_HandleHandshake':
36:02.30 dtlscon.c:399:37: warning: comparison between signed and unsigned integer expressions [-Wsign-compare]
36:02.30 dtlscon.c:428:48: warning: comparison between signed and unsigned integer expressions [-Wsign-compare]
36:02.30 dtlscon.c: In function 'dtls_TransmitMessageFlight':
36:02.30 dtlscon.c:679:60: warning: comparison between signed and unsigned integer expressions [-Wsign-compare]
36:02.30 dtlscon.c:679:120: warning: signed and unsigned type in conditional expression [-Wsign-compare]
36:02.30 dtlscon.c:717:26: warning: comparison between signed and unsigned integer expressions [-Wsign-compare]
36:02.30 dtlscon.c: In function 'dtls_SetMTU':
36:02.30 dtlscon.c:952:19: warning: comparison between signed and unsigned integer expressions [-Wsign-compare]
36:02.41 pkix_pl_ldaprequest.c: In function 'pkix_pl_LdapRequest_Destroy':
36:02.41 pkix_pl_ldaprequest.c:266:30: warning: variable 'ldapRq' set but not used [-Wunused-but-set-variable]
36:02.42 pkix_pl_x500name.c:37:1: warning: 'pkix_pl_X500Name_ToString_Helper' defined but not used [-Wunused-function]
36:02.88 nsXMLContentSerializer.o
36:03.14 pkix_pl_ldapdefaultclient.c: In function 'pkix_pl_LdapDefaultClient_VerifyBindResponse':
36:03.14 pkix_pl_ldapdefaultclient.c:371:21: warning: '*((void *)&msg+16).resultCode.data' may be used uninitialized in this function [-Wmaybe-uninitialized]
36:03.14 pkix_pl_ldapdefaultclient.c:354:21: note: '*((void *)&msg+16).resultCode.data' was declared here
36:03.93 pkix_pl_pk11certstore.c: In function 'NameCacheHasFetchedCrlInfo':
36:03.93 pkix_pl_pk11certstore.c:382:22: warning: variable 'cert' set but not used [-Wunused-but-set-variable]
36:03.93 pkix_pl_pk11certstore.c: In function 'RemovePartitionedDpsFromList':
36:03.93 pkix_pl_pk11certstore.c:701:20: warning: comparison between signed and unsigned integer expressions [-Wsign-compare]
36:03.93 pkix_pl_pk11certstore.c: In function 'DownloadCrl':
36:03.93 pkix_pl_pk11certstore.c:782:16: warning: variable 'savedError' set but not used [-Wunused-but-set-variable]
36:04.10 p12e.c: In function 'sec_PKCS12CreateSafeBag':
36:04.10 p12e.c:698:12: warning: variable 'setName' set but not used [-Wunused-but-set-variable]
36:04.10 p12e.c: In function 'sec_pkcs12_encoder_start_context':
36:04.10 p12e.c:1535:12: warning: variable 'rv' set but not used [-Wunused-but-set-variable]
36:04.69 certread.c: In function 'CERT_DecodeCertPackage':
36:04.69 certread.c:419:16: warning: comparison between signed and unsigned integer expressions [-Wsign-compare]
36:04.69 certread.c:447:13: warning: comparison between signed and unsigned integer expressions [-Wsign-compare]
36:04.91 ssl3con.c: In function 'ssl3_CompressMACEncryptRecord':
36:04.91 ssl3con.c:2559:12: warning: comparison between signed and unsigned integer expressions [-Wsign-compare]
36:04.91 ssl3con.c: In function 'ssl3_FlushHandshakeMessages':
36:04.91 ssl3con.c:3122:19: warning: comparison between signed and unsigned integer expressions [-Wsign-compare]
36:04.91 ssl3con.c: In function 'ssl3_HandleClientHello':
36:04.91 ssl3con.c:7782:23: warning: comparison between signed and unsigned integer expressions [-Wsign-compare]
36:04.91 ssl3con.c:8286:28: warning: comparison between signed and unsigned integer expressions [-Wsign-compare]
36:04.91 ssl3con.c: In function 'ssl3_HandleRSAClientKeyExchange':
36:04.91 ssl3con.c:9211:13: warning: variable 'pmsItem' set but not used [-Wunused-but-set-variable]
36:04.91 ssl3con.c:9207:12: warning: variable 'isTLS' set but not used [-Wunused-but-set-variable]
36:04.91 ssl3con.c: In function 'ssl3_HandleCertificateStatus':
36:04.91 ssl3con.c:9779:13: warning: comparison between signed and unsigned integer expressions [-Wsign-compare]
36:04.91 ssl3con.c: In function 'ssl3_HandleHandshakeMessage':
36:04.91 ssl3con.c:6951:22: warning: 'preferSha1' may be used uninitialized in this function [-Wmaybe-uninitialized]
36:04.91 ssl3con.c:6917:12: note: 'preferSha1' was declared here
36:04.91 ssl3con.c: In function 'ssl3_HandleRecord':
36:04.92 ssl3con.c:11589:21: warning: 'dtls_seq_num' may be used uninitialized in this function [-Wmaybe-uninitialized]
36:04.92 ssl3con.c:11309:14: note: 'dtls_seq_num' was declared here
36:05.13 ssl3gthr.c: In function 'ssl3_GatherData':
36:05.13 ssl3gthr.c:75:9: warning: comparison between signed and unsigned integer expressions [-Wsign-compare]
36:05.35 sslauth.c: In function 'SSL_AuthCertificate':
36:05.35 sslauth.c:267:18: warning: unused variable 'error' [-Wunused-variable]
36:05.45 nsXMLHttpRequest.o
36:05.57 p7decode.c: In function 'sec_pkcs7_verify_signature':
36:05.57 p7decode.c:1293:21: warning: variable 'crls' set but not used [-Wunused-but-set-variable]
36:05.76 cmscipher.c: In function 'NSS_CMSCipherContext_Decrypt':
36:05.76 cmscipher.c:525:28: warning: comparison between signed and unsigned integer expressions [-Wsign-compare]
36:05.85 p7encode.c: In function 'sec_pkcs7_encoder_start_encrypt':
36:05.85 p7encode.c:62:18: warning: variable 'wincx' set but not used [-Wunused-but-set-variable]
36:06.10 p7local.c: In function 'sec_PKCS7Decrypt':
36:06.10 p7local.c:556:28: warning: comparison between signed and unsigned integer expressions [-Wsign-compare]
36:06.22 sslcon.c: In function 'ssl2_SendClear':
36:06.22 sslcon.c:865:17: warning: comparison between signed and unsigned integer expressions [-Wsign-compare]
36:06.22 sslcon.c:894:19: warning: comparison between signed and unsigned integer expressions [-Wsign-compare]
36:06.22 sslcon.c: In function 'ssl2_SendStream':
36:06.22 sslcon.c:944:13: warning: comparison between signed and unsigned integer expressions [-Wsign-compare]
36:06.22 sslcon.c:991:19: warning: comparison between signed and unsigned integer expressions [-Wsign-compare]
36:06.22 sslcon.c: In function 'ssl2_SendBlock':
36:06.22 sslcon.c:1058:13: warning: comparison between signed and unsigned integer expressions [-Wsign-compare]
36:06.22 sslcon.c: In function 'ssl2_ServerSetupSessionCypher':
36:06.22 sslcon.c:1624:15: warning: comparison between signed and unsigned integer expressions [-Wsign-compare]
36:06.22 sslcon.c:1648:20: warning: comparison between signed and unsigned integer expressions [-Wsign-compare]
36:06.22 sslcon.c: In function 'ssl2_HandleMessage':
36:06.23 sslcon.c:2498:9: warning: variable 'rv2' set but not used [-Wunused-but-set-variable]
36:06.23 sslcon.c: In function 'ssl2_HandleServerHelloMessage':
36:06.23 sslcon.c:2802:51: warning: comparison between signed and unsigned integer expressions [-Wsign-compare]
36:06.23 sslcon.c:2813:16: warning: comparison between signed and unsigned integer expressions [-Wsign-compare]
36:06.23 sslcon.c:2815:23: warning: comparison between signed and unsigned integer expressions [-Wsign-compare]
36:06.23 sslcon.c:2815:65: warning: signed and unsigned type in conditional expression [-Wsign-compare]
36:06.23 sslcon.c: In function 'NSSSSL_VersionCheck':
36:06.23 sslcon.c:3687:19: warning: variable 'c' set but not used [-Wunused-but-set-variable]
36:06.56 cmsencode.c: In function 'nss_cms_encoder_notify':
36:06.56 cmsencode.c:125:18: warning: variable 'poolp' set but not used [-Wunused-but-set-variable]
36:06.56 cmsencode.c: In function 'nss_cms_before_data':
36:06.56 cmsencode.c:204:18: warning: variable 'poolp' set but not used [-Wunused-but-set-variable]
36:06.63 TestArrayUtils.o
36:06.63 TestAtomics.o
36:06.87 TestBinarySearch.o
36:07.07 cmsrecinfo.c: In function 'NSS_CMSRecipientInfo_UnwrapBulkKey':
36:07.07 cmsrecinfo.c:529:21: warning: variable 'encalg' set but not used [-Wunused-but-set-variable]
36:07.36 ssl3ext.c: In function 'arrayContainsExtension':
36:07.36 ssl3ext.c:310:19: warning: comparison between signed and unsigned integer expressions [-Wsign-compare]
36:07.36 ssl3ext.c: In function 'ssl3_HandleServerNameXtn':
36:07.36 ssl3ext.c:417:43: warning: comparison between signed and unsigned integer expressions [-Wsign-compare]
36:07.36 ssl3ext.c:425:17: warning: variable 'type' set but not used [-Wunused-but-set-variable]
36:07.36 ssl3ext.c:457:22: warning: comparison between signed and unsigned integer expressions [-Wsign-compare]
36:07.36 ssl3ext.c:458:31: warning: comparison between signed and unsigned integer expressions [-Wsign-compare]
36:07.36 ssl3ext.c: In function 'ssl3_SendSessionTicketXtn':
36:07.36 ssl3ext.c:538:28: warning: comparison between signed and unsigned integer expressions [-Wsign-compare]
36:07.36 ssl3ext.c:561:25: warning: comparison between signed and unsigned integer expressions [-Wsign-compare]
36:07.36 ssl3ext.c: In function 'ssl3_ServerHandleAppProtoXtn':
36:07.36 ssl3ext.c:681:15: warning: comparison between signed and unsigned integer expressions [-Wsign-compare]
36:07.36 ssl3ext.c: In function 'ssl3_ClientSendNextProtoNegoXtn':
36:07.36 ssl3ext.c:782:28: warning: comparison between signed and unsigned integer expressions [-Wsign-compare]
36:07.36 ssl3ext.c:792:25: warning: comparison between signed and unsigned integer expressions [-Wsign-compare]
36:07.36 ssl3ext.c: In function 'ssl3_ClientSendAppProtoXtn':
36:07.36 ssl3ext.c:817:28: warning: comparison between signed and unsigned integer expressions [-Wsign-compare]
36:07.36 ssl3ext.c:857:25: warning: comparison between signed and unsigned integer expressions [-Wsign-compare]
36:07.36 ssl3ext.c: In function 'ssl3_ServerSendAppProtoXtn':
36:07.36 ssl3ext.c:886:28: warning: comparison between signed and unsigned integer expressions [-Wsign-compare]
36:07.36 ssl3ext.c:905:25: warning: comparison between signed and unsigned integer expressions [-Wsign-compare]
36:07.36 ssl3ext.c: In function 'ssl3_ServerSendStatusRequestXtn':
36:07.36 ssl3ext.c:952:28: warning: comparison between signed and unsigned integer expressions [-Wsign-compare]
36:07.36 ssl3ext.c: In function 'ssl3_ClientSendStatusRequestXtn':
36:07.37 ssl3ext.c:985:28: warning: comparison between signed and unsigned integer expressions [-Wsign-compare]
36:07.37 ssl3ext.c:1013:25: warning: comparison between signed and unsigned integer expressions [-Wsign-compare]
36:07.37 ssl3ext.c: In function 'ssl3_SendNewSessionTicket':
36:07.37 ssl3ext.c:1249:19: warning: comparison between signed and unsigned integer expressions [-Wsign-compare]
36:07.37 ssl3ext.c: In function 'ssl3_ServerHandleSessionTicketXtn':
36:07.37 ssl3ext.c:1587:23: warning: comparison between signed and unsigned integer expressions [-Wsign-compare]
36:07.37 ssl3ext.c: In function 'ssl3_SendRenegotiationInfoXtn':
36:07.37 ssl3ext.c:1981:28: warning: comparison between signed and unsigned integer expressions [-Wsign-compare]
36:07.37 ssl3ext.c: In function 'ssl3_ClientSendSigAlgsXtn':
36:07.37 ssl3ext.c:2355:28: warning: comparison between signed and unsigned integer expressions [-Wsign-compare]
36:07.37 ssl3ext.c:2369:25: warning: comparison between signed and unsigned integer expressions [-Wsign-compare]
36:07.37 ssl3ext.c: In function 'ssl3_ClientSendDraftVersionXtn':
36:07.37 ssl3ext.c:2445:28: warning: comparison between signed and unsigned integer expressions [-Wsign-compare]
36:07.37 ssl3ext.c:2458:25: warning: comparison between signed and unsigned integer expressions [-Wsign-compare]
36:08.51 smimeutil.c: In function 'NSSSMIME_VersionCheck':
36:08.51 smimeutil.c:770:19: warning: variable 'c' set but not used [-Wunused-but-set-variable]
36:08.51 smimeutil.c: In function 'NSS_SMIMEUtil_FindBulkAlgForRecipients':
36:08.51 smimeutil.c:446:9: warning: 'key_type' may be used uninitialized in this function [-Wmaybe-uninitialized]
36:08.51 smimeutil.c:425:14: note: 'key_type' was declared here
36:08.53 sslsecur.c: In function 'SSL_ConfigSecureServerWithCertChain':
36:08.53 sslsecur.c:847:5: warning: comparison of unsigned expression < 0 is always false [-Wtype-limits]
36:08.53 sslsecur.c: In function 'ssl_SecureRecv':
36:08.53 sslsecur.c:1180:22: warning: variable 'sec' set but not used [-Wunused-but-set-variable]
36:08.75 /opt/FirefoxSource/mozilla-release/config/external/nss/nss.def: WARNING: no preprocessor directives found
36:08.79 /opt/FirefoxSource/mozilla-release/config/external/nss/nspr-dummy.def: WARNING: no preprocessor directives found
36:08.82 nsXMLNameSpaceMap.o
36:08.92 TestBloomFilter.o
36:09.34 TestCasting.o
36:09.48 crmfpop.c: In function 'CRMF_CertReqMsgSetRAVerifiedPOP':
36:09.48 crmfpop.c:36:14: warning: variable 'dummy' set but not used [-Wunused-but-set-variable]
36:09.48 crmfpop.c: In function 'crmf_generic_encoder_callback':
36:09.48 crmfpop.c:119:38: warning: comparison between signed and unsigned integer expressions [-Wsign-compare]
36:09.48 crmfpop.c: In function 'crmf_encode_popoprivkey':
36:09.48 crmfpop.c:349:33: warning: comparison between signed and unsigned integer expressions [-Wsign-compare]
36:09.48 TestCeilingFloor.o
36:09.62 TestCheckedInt.o
36:09.80 TestCountPopulation.o
36:09.96 sslsock.c: In function 'ssl_WriteV':
36:09.96 sslsock.c:2524:30: warning: comparison between signed and unsigned integer expressions [-Wsign-compare]
36:09.96 sslsock.c:2537:68: warning: comparison between signed and unsigned integer expressions [-Wsign-compare]
36:09.96 sslsock.c:2556:28: warning: comparison between signed and unsigned integer expressions [-Wsign-compare]
36:09.97 sslsock.c:2556:59: warning: signed and unsigned type in conditional expression [-Wsign-compare]
36:09.97 sslsock.c:2559:23: warning: comparison between signed and unsigned integer expressions [-Wsign-compare]
36:09.97 sslsock.c:2565:56: warning: comparison between signed and unsigned integer expressions [-Wsign-compare]
36:10.13 crmfcont.c: In function 'CRMF_CreateEncryptedKeyWithEncryptedValue':
36:10.13 crmfcont.c:860:25: warning: variable 'dummy' set but not used [-Wunused-but-set-variable]
36:10.63 sslinfo.c: In function 'SSL_DisableDefaultExportCipherSuites':
36:10.63 sslinfo.c:247:15: warning: variable 'rv' set but not used [-Wunused-but-set-variable]
36:10.63 sslinfo.c: In function 'SSL_DisableExportCipherSuites':
36:10.63 sslinfo.c:268:15: warning: variable 'rv' set but not used [-Wunused-but-set-variable]
36:10.88 cmmfchal.c: In function 'cmmf_create_witness_and_challenge':
36:10.88 cmmfchal.c:33:22: warning: variable 'id' set but not used [-Wunused-but-set-variable]
36:10.99 ssl3ecc.c: In function 'ssl3_DisableECCSuites':
36:10.99 ssl3ecc.c:969:19: warning: unused variable 'rv' [-Wunused-variable]
36:10.99 ssl3ecc.c: In function 'ssl3_SendSupportedCurvesXtn':
36:10.99 ssl3ecc.c:1130:28: warning: comparison between signed and unsigned integer expressions [-Wsign-compare]
36:10.99 ssl3ecc.c: In function 'ssl3_HandleSupportedCurvesXtn':
36:10.99 ssl3ecc.c:1238:35: warning: comparison between signed and unsigned integer expressions [-Wsign-compare]
36:11.15 TestCountZeroes.o
36:11.24 TestEndian.o
36:11.70 basicutil.c: In function 'SECU_PrintPRandOSError':
36:11.70 basicutil.c:628:30: warning: comparison between signed and unsigned integer expressions [-Wsign-compare]
36:11.70 basicutil.c:632:30: warning: comparison between signed and unsigned integer expressions [-Wsign-compare]
36:11.70 basicutil.c: In function 'SECU_SECItemHexStringToBinary':
36:11.70 basicutil.c:705:16: warning: comparison between signed and unsigned integer expressions [-Wsign-compare]
36:11.70 basicutil.c:716:16: warning: comparison between signed and unsigned integer expressions [-Wsign-compare]
36:11.70 basicutil.c: In function 'SECU_PrintAsHex':
36:11.70 basicutil.c:286:13: warning: 'column' may be used uninitialized in this function [-Wmaybe-uninitialized]
36:12.20 derprint.c: In function 'prettyPrintLength':
36:12.20 derprint.c:454:20: warning: comparison between signed and unsigned integer expressions [-Wsign-compare]
36:12.95 secutil.c: In function 'SECU_ChangePW2':
36:12.95 secutil.c:333:15: warning: variable 'rv' set but not used [-Wunused-but-set-variable]
36:12.95 secutil.c: In function 'SECU_PrintDumpDerIssuerAndSerial':
36:12.95 secutil.c:1551:19: warning: comparison between signed and unsigned integer expressions [-Wsign-compare]
36:12.95 secutil.c: In function 'secu_PrintPKCS7Signed':
36:12.95 secutil.c:2703:11: warning: passing argument 5 of 'SECU_PrintSignedData' from incompatible pointer type [enabled by default]
36:12.95 In file included from secutil.c:19:0:
36:12.95 secutil.h:260:12: note: expected 'SECU_PPFunc' but argument is of type 'int (*)(struct FILE *, const struct SECItem *, const char *, int)'
36:12.95 secutil.c: In function 'secu_PrintPKCS7SignedAndEnveloped':
36:12.95 secutil.c:2822:11: warning: passing argument 5 of 'SECU_PrintSignedData' from incompatible pointer type [enabled by default]
36:12.95 In file included from secutil.c:19:0:
36:12.95 secutil.h:260:12: note: expected 'SECU_PPFunc' but argument is of type 'int (*)(struct FILE *, const struct SECItem *, const char *, int)'
36:12.95 secutil.c: In function 'SEC_PrintCertificateAndTrust':
36:12.95 secutil.c:3152:10: warning: passing argument 5 of 'SECU_PrintSignedData' from incompatible pointer type [enabled by default]
36:12.95 secutil.c:3125:5: note: expected 'SECU_PPFunc' but argument is of type 'int (*)(struct FILE *, const struct SECItem *, const char *, int)'
36:12.95 secutil.c: In function 'SECU_StoreCRL':
36:12.95 secutil.c:3324:62: warning: comparison between signed and unsigned integer expressions [-Wsign-compare]
36:12.96 libnss3.so
36:13.13 jarsign.c: In function 'jar_create_pk7':
36:13.13 jarsign.c:174:11: warning: variable 'errstring' set but not used [-Wunused-but-set-variable]
36:13.33 jar.c: In function 'JAR_find_next':
36:13.33 jar.c:423:30: warning: comparison between signed and unsigned integer expressions [-Wsign-compare]
36:13.33 jar.c: In function 'jar_find_first_cert':
36:13.33 jar.c:462:24: warning: comparison between signed and unsigned integer expressions [-Wsign-compare]
36:13.73 jarfile.c: In function 'jar_physical_inflate':
36:13.73 jarfile.c:341:32: warning: comparison between signed and unsigned integer expressions [-Wsign-compare]
36:13.73 jarfile.c:356:38: warning: comparison between signed and unsigned integer expressions [-Wsign-compare]
36:13.73 jarfile.c: In function 'jar_extract_mf':
36:13.73 jarfile.c:578:14: warning: comparison between signed and unsigned integer expressions [-Wsign-compare]
36:13.73 jarfile.c: In function 'jar_listzip':
36:13.73 jarfile.c:702:47: warning: comparison between signed and unsigned integer expressions [-Wsign-compare]
36:13.73 jarfile.c:768:43: warning: comparison between signed and unsigned integer expressions [-Wsign-compare]
36:13.73 jarfile.c: In function 'jar_listtar':
36:13.73 jarfile.c:830:45: warning: comparison between signed and unsigned integer expressions [-Wsign-compare]
36:13.73 jarfile.c:824:12: warning: variable 'when' set but not used [-Wunused-but-set-variable]
36:13.73 jarfile.c:823:14: warning: variable 'mode' set but not used [-Wunused-but-set-variable]
36:13.83 TestEnumSet.o
36:14.99 TestFloatingPoint.o
36:15.55 TestIntegerPrintfMacros.o
36:16.03 TestMacroArgs.o
36:16.31 libcontent_base_src.a.desc
36:16.40 TestWebappRT.o
36:16.43 TestWebappRT
36:16.48 TestMacroForEach.o
36:16.51 TestMaybe.o
36:16.55 jsctypes-test-errno.o
36:16.56 jsctypes-test-finalizer.o
36:16.58 jsctypes-test.o
36:17.28 token.c: In function 'nssCKFWToken_GetUTCTime':
36:17.28 token.c:1261:27: warning: variable 'z' set but not used [-Wunused-but-set-variable]
36:17.54 libjsctypes-test.so
36:17.85 cd builtins; /usr/bin/make libs
36:18.00 shlibsign.c: In function 'writeItem':
36:18.00 shlibsign.c:150:22: warning: comparison between signed and unsigned integer expressions [-Wsign-compare]
36:18.00 shlibsign.c: In function 'main':
36:18.00 shlibsign.c:908:40: warning: comparison between signed and unsigned integer expressions [-Wsign-compare]
36:18.02 cd mangle; /usr/bin/make libs
36:18.32 bfind.c: In function 'builtins_attrmatch':
36:18.32 bfind.c:122:11: warning: comparison between signed and unsigned integer expressions [-Wsign-compare]
36:18.40 binst.c: In function 'builtins_mdInstance_GetLibraryVersion':
36:18.40 binst.c:70:17: warning: variable 'c' set but not used [-Wunused-but-set-variable]
36:18.62 loader.c: In function 'freebl_LoadDSO':
36:18.62 loader.c:135:14: warning: variable 'status' set but not used [-Wunused-but-set-variable]
36:18.62 loader.c: In function 'BL_Unload':
36:18.62 loader.c:904:20: warning: unused variable 'status' [-Wunused-variable]
36:18.68 mkdir: das Verzeichnis „/opt/FirefoxSource/mozilla-release/objdir-droid/security/nss/lib/freebl“ kann nicht angelegt werden: Die Datei existiert bereits
36:18.87 ldvector.c: In function 'FREEBL_GetVector':
36:18.87 ldvector.c:301:19: warning: variable 'c' set but not used [-Wunused-but-set-variable]
36:19.85 pk12util.c: In function 'p12u_InitContext':
36:19.85 pk12util.c:104:12: warning: variable 'fileExist' set but not used [-Wunused-but-set-variable]
36:19.85 pk12util.c: In function 'P12U_ListPKCS12File':
36:19.85 pk12util.c:762:30: warning: passing argument 5 of 'SECU_PrintSignedData' from incompatible pointer type [enabled by default]
36:19.85 In file included from pk12util.c:11:0:
36:19.85 /opt/FirefoxSource/mozilla-release/objdir-droid/dist/private/nss/secutil.h:260:12: note: expected 'SECU_PPFunc' but argument is of type 'int (*)(struct FILE *, const struct SECItem *, const char *, int)'
36:20.24 keystuff.c: In function 'UpdateRNG':
36:20.24 keystuff.c:96:18: warning: comparison between signed and unsigned integer expressions [-Wsign-compare]
36:20.24 keystuff.c: In function 'CERTUTIL_GeneratePrivateKey':
36:20.24 keystuff.c:497:15: warning: variable 'algtag' set but not used [-Wunused-but-set-variable]
36:20.57 pk11.c: In function 'ListModule':
36:20.57 pk11.c:612:16: warning: comparison between signed and unsigned integer expressions [-Wsign-compare]
36:20.58 rawhash.c: In function 'HASH_GetRawHashObject':
36:20.59 rawhash.c:156:5: warning: comparison of unsigned expression < 0 is always false [-Wtype-limits]
36:20.94 ytab.c: In function 'Pk11Install_yyparse':
36:20.94 ytab.c:219:5: warning: suggest parentheses around assignment used as truth value [-Wparentheses]
36:21.32 sha512.c: In function 'SHA512_Compress':
36:21.32 sha512.c:933:14: warning: unused variable 't1' [-Wunused-variable]
36:21.32 sha512.c:955:18: warning: unused variable 't2' [-Wunused-variable]
36:21.32 sha512.c:955:14: warning: unused variable 't1' [-Wunused-variable]
36:21.32 sha512.c: In function 'SHA512_End':
36:21.32 sha512.c:1229:14: warning: unused variable 't1' [-Wunused-variable]
36:21.32 sha512.c: In function 'SHA512_EndRaw':
36:21.32 sha512.c:1274:14: warning: unused variable 't1' [-Wunused-variable]
36:21.55 lex.Pk11Install_yy.cpp:1060:13: warning: 'Pkcs11Install_yyunput' defined but not used [-Wunused-function]
36:21.55 lex.Pk11Install_yy.cpp:1106:12: warning: 'input' defined but not used [-Wunused-function]
36:21.56 OmxPlugin235.o
36:21.69 cts.c: In function 'CTS_DecryptUpdate':
36:21.69 cts.c:226:23: warning: comparison between signed and unsigned integer expressions [-Wsign-compare]
36:21.78 OmxPluginFroyo.o
36:21.88 gcm.c: In function 'gcm_getX':
36:21.88 gcm.c:223:13: warning: comparison between signed and unsigned integer expressions [-Wsign-compare]
36:22.25 libomxplugingb235.so
36:22.33 OmxPlugin236.o
36:22.47 libomxpluginfroyo.so
36:22.55 libstagefright.o
36:22.92 In file included from /opt/FirefoxSource/mozilla-release/media/omx-plugin/lib/ics/libstagefright/libstagefright.cpp:13:0:
36:22.93 Warning: -Wmultichar in /opt/FirefoxSource/mozilla-release/media/omx-plugin/include/ics/stagefright/MetaData.h: multi-character character constant
36:22.93 /opt/FirefoxSource/mozilla-release/media/omx-plugin/include/ics/stagefright/MetaData.h:32:20: warning: multi-character character constant [-Wmultichar]
36:22.93 Warning: -Wmultichar in /opt/FirefoxSource/mozilla-release/media/omx-plugin/include/ics/stagefright/MetaData.h: multi-character character constant
36:22.93 /opt/FirefoxSource/mozilla-release/media/omx-plugin/include/ics/stagefright/MetaData.h:33:17: warning: multi-character character constant [-Wmultichar]
36:22.93 Warning: -Wmultichar in /opt/FirefoxSource/mozilla-release/media/omx-plugin/include/ics/stagefright/MetaData.h: multi-character character constant
36:22.93 /opt/FirefoxSource/mozilla-release/media/omx-plugin/include/ics/stagefright/MetaData.h:34:18: warning: multi-character character constant [-Wmultichar]
36:22.93 Warning: -Wmultichar in /opt/FirefoxSource/mozilla-release/media/omx-plugin/include/ics/stagefright/MetaData.h: multi-character character constant
36:22.93 /opt/FirefoxSource/mozilla-release/media/omx-plugin/include/ics/stagefright/MetaData.h:35:24: warning: multi-character character constant [-Wmultichar]
36:22.93 Warning: -Wmultichar in /opt/FirefoxSource/mozilla-release/media/omx-plugin/include/ics/stagefright/MetaData.h: multi-character character constant
36:22.93 /opt/FirefoxSource/mozilla-release/media/omx-plugin/include/ics/stagefright/MetaData.h:36:25: warning: multi-character character constant [-Wmultichar]
36:22.93 Warning: -Wmultichar in /opt/FirefoxSource/mozilla-release/media/omx-plugin/include/ics/stagefright/MetaData.h: multi-character character constant
36:22.93 /opt/FirefoxSource/mozilla-release/media/omx-plugin/include/ics/stagefright/MetaData.h:39:20: warning: multi-character character constant [-Wmultichar]
36:22.93 Warning: -Wmultichar in /opt/FirefoxSource/mozilla-release/media/omx-plugin/include/ics/stagefright/MetaData.h: multi-character character constant
36:22.93 /opt/FirefoxSource/mozilla-release/media/omx-plugin/include/ics/stagefright/MetaData.h:41:20: warning: multi-character character constant [-Wmultichar]
36:22.93 Warning: -Wmultichar in /opt/FirefoxSource/mozilla-release/media/omx-plugin/include/ics/stagefright/MetaData.h: multi-character character constant
36:22.93 /opt/FirefoxSource/mozilla-release/media/omx-plugin/include/ics/stagefright/MetaData.h:42:27: warning: multi-character character constant [-Wmultichar]
36:22.93 Warning: -Wmultichar in /opt/FirefoxSource/mozilla-release/media/omx-plugin/include/ics/stagefright/MetaData.h: multi-character character constant
36:22.93 /opt/FirefoxSource/mozilla-release/media/omx-plugin/include/ics/stagefright/MetaData.h:43:18: warning: multi-character character constant [-Wmultichar]
36:22.93 Warning: -Wmultichar in /opt/FirefoxSource/mozilla-release/media/omx-plugin/include/ics/stagefright/MetaData.h: multi-character character constant
36:22.93 /opt/FirefoxSource/mozilla-release/media/omx-plugin/include/ics/stagefright/MetaData.h:44:23: warning: multi-character character constant [-Wmultichar]
36:22.93 Warning: -Wmultichar in /opt/FirefoxSource/mozilla-release/media/omx-plugin/include/ics/stagefright/MetaData.h: multi-character character constant
36:22.93 /opt/FirefoxSource/mozilla-release/media/omx-plugin/include/ics/stagefright/MetaData.h:45:24: warning: multi-character character constant [-Wmultichar]
36:22.93 Warning: -Wmultichar in /opt/FirefoxSource/mozilla-release/media/omx-plugin/include/ics/stagefright/MetaData.h: multi-character character constant
36:22.93 /opt/FirefoxSource/mozilla-release/media/omx-plugin/include/ics/stagefright/MetaData.h:46:22: warning: multi-character character constant [-Wmultichar]
36:22.93 Warning: -Wmultichar in /opt/FirefoxSource/mozilla-release/media/omx-plugin/include/ics/stagefright/MetaData.h: multi-character character constant
36:22.93 /opt/FirefoxSource/mozilla-release/media/omx-plugin/include/ics/stagefright/MetaData.h:47:21: warning: multi-character character constant [-Wmultichar]
36:22.93 Warning: -Wmultichar in /opt/FirefoxSource/mozilla-release/media/omx-plugin/include/ics/stagefright/MetaData.h: multi-character character constant
36:22.93 /opt/FirefoxSource/mozilla-release/media/omx-plugin/include/ics/stagefright/MetaData.h:48:19: warning: multi-character character constant [-Wmultichar]
36:22.93 Warning: -Wmultichar in /opt/FirefoxSource/mozilla-release/media/omx-plugin/include/ics/stagefright/MetaData.h: multi-character character constant
36:22.93 /opt/FirefoxSource/mozilla-release/media/omx-plugin/include/ics/stagefright/MetaData.h:49:16: warning: multi-character character constant [-Wmultichar]
36:22.93 Warning: -Wmultichar in /opt/FirefoxSource/mozilla-release/media/omx-plugin/include/ics/stagefright/MetaData.h: multi-character character constant
36:22.93 /opt/FirefoxSource/mozilla-release/media/omx-plugin/include/ics/stagefright/MetaData.h:50:16: warning: multi-character character constant [-Wmultichar]
36:22.93 Warning: -Wmultichar in /opt/FirefoxSource/mozilla-release/media/omx-plugin/include/ics/stagefright/MetaData.h: multi-character character constant
36:22.93 /opt/FirefoxSource/mozilla-release/media/omx-plugin/include/ics/stagefright/MetaData.h:51:16: warning: multi-character character constant [-Wmultichar]
36:22.93 Warning: -Wmultichar in /opt/FirefoxSource/mozilla-release/media/omx-plugin/include/ics/stagefright/MetaData.h: multi-character character constant
36:22.93 /opt/FirefoxSource/mozilla-release/media/omx-plugin/include/ics/stagefright/MetaData.h:52:22: warning: multi-character character constant [-Wmultichar]
36:22.93 Warning: -Wmultichar in /opt/FirefoxSource/mozilla-release/media/omx-plugin/include/ics/stagefright/MetaData.h: multi-character character constant
36:22.93 /opt/FirefoxSource/mozilla-release/media/omx-plugin/include/ics/stagefright/MetaData.h:53:23: warning: multi-character character constant [-Wmultichar]
36:22.93 Warning: -Wmultichar in /opt/FirefoxSource/mozilla-release/media/omx-plugin/include/ics/stagefright/MetaData.h: multi-character character constant
36:22.93 /opt/FirefoxSource/mozilla-release/media/omx-plugin/include/ics/stagefright/MetaData.h:54:29: warning: multi-character character constant [-Wmultichar]
36:22.93 Warning: -Wmultichar in /opt/FirefoxSource/mozilla-release/media/omx-plugin/include/ics/stagefright/MetaData.h: multi-character character constant
36:22.93 /opt/FirefoxSource/mozilla-release/media/omx-plugin/include/ics/stagefright/MetaData.h:55:23: warning: multi-character character constant [-Wmultichar]
36:22.93 Warning: -Wmultichar in /opt/FirefoxSource/mozilla-release/media/omx-plugin/include/ics/stagefright/MetaData.h: multi-character character constant
36:22.93 /opt/FirefoxSource/mozilla-release/media/omx-plugin/include/ics/stagefright/MetaData.h:56:25: warning: multi-character character constant [-Wmultichar]
36:22.93 Warning: -Wmultichar in /opt/FirefoxSource/mozilla-release/media/omx-plugin/include/ics/stagefright/MetaData.h: multi-character character constant
36:22.93 /opt/FirefoxSource/mozilla-release/media/omx-plugin/include/ics/stagefright/MetaData.h:57:16: warning: multi-character character constant [-Wmultichar]
36:22.93 Warning: -Wmultichar in /opt/FirefoxSource/mozilla-release/media/omx-plugin/include/ics/stagefright/MetaData.h: multi-character character constant
36:22.93 /opt/FirefoxSource/mozilla-release/media/omx-plugin/include/ics/stagefright/MetaData.h:58:24: warning: multi-character character constant [-Wmultichar]
36:22.93 Warning: -Wmultichar in /opt/FirefoxSource/mozilla-release/media/omx-plugin/include/ics/stagefright/MetaData.h: multi-character character constant
36:22.93 /opt/FirefoxSource/mozilla-release/media/omx-plugin/include/ics/stagefright/MetaData.h:59:19: warning: multi-character character constant [-Wmultichar]
36:22.93 Warning: -Wmultichar in /opt/FirefoxSource/mozilla-release/media/omx-plugin/include/ics/stagefright/MetaData.h: multi-character character constant
36:22.93 /opt/FirefoxSource/mozilla-release/media/omx-plugin/include/ics/stagefright/MetaData.h:60:22: warning: multi-character character constant [-Wmultichar]
36:22.93 Warning: -Wmultichar in /opt/FirefoxSource/mozilla-release/media/omx-plugin/include/ics/stagefright/MetaData.h: multi-character character constant
36:22.93 /opt/FirefoxSource/mozilla-release/media/omx-plugin/include/ics/stagefright/MetaData.h:61:21: warning: multi-character character constant [-Wmultichar]
36:22.93 Warning: -Wmultichar in /opt/FirefoxSource/mozilla-release/media/omx-plugin/include/ics/stagefright/MetaData.h: multi-character character constant
36:22.93 /opt/FirefoxSource/mozilla-release/media/omx-plugin/include/ics/stagefright/MetaData.h:62:22: warning: multi-character character constant [-Wmultichar]
36:22.93 Warning: -Wmultichar in /opt/FirefoxSource/mozilla-release/media/omx-plugin/include/ics/stagefright/MetaData.h: multi-character character constant
36:22.93 /opt/FirefoxSource/mozilla-release/media/omx-plugin/include/ics/stagefright/MetaData.h:63:20: warning: multi-character character constant [-Wmultichar]
36:22.93 Warning: -Wmultichar in /opt/FirefoxSource/mozilla-release/media/omx-plugin/include/ics/stagefright/MetaData.h: multi-character character constant
36:22.93 /opt/FirefoxSource/mozilla-release/media/omx-plugin/include/ics/stagefright/MetaData.h:64:23: warning: multi-character character constant [-Wmultichar]
36:22.93 Warning: -Wmultichar in /opt/FirefoxSource/mozilla-release/media/omx-plugin/include/ics/stagefright/MetaData.h: multi-character character constant
36:22.93 /opt/FirefoxSource/mozilla-release/media/omx-plugin/include/ics/stagefright/MetaData.h:65:27: warning: multi-character character constant [-Wmultichar]
36:22.93 Warning: -Wmultichar in /opt/FirefoxSource/mozilla-release/media/omx-plugin/include/ics/stagefright/MetaData.h: multi-character character constant
36:22.94 /opt/FirefoxSource/mozilla-release/media/omx-plugin/include/ics/stagefright/MetaData.h:66:28: warning: multi-character character constant [-Wmultichar]
36:22.94 Warning: -Wmultichar in /opt/FirefoxSource/mozilla-release/media/omx-plugin/include/ics/stagefright/MetaData.h: multi-character character constant
36:22.94 /opt/FirefoxSource/mozilla-release/media/omx-plugin/include/ics/stagefright/MetaData.h:67:20: warning: multi-character character constant [-Wmultichar]
36:22.94 Warning: -Wmultichar in /opt/FirefoxSource/mozilla-release/media/omx-plugin/include/ics/stagefright/MetaData.h: multi-character character constant
36:22.94 /opt/FirefoxSource/mozilla-release/media/omx-plugin/include/ics/stagefright/MetaData.h:68:24: warning: multi-character character constant [-Wmultichar]
36:22.94 Warning: -Wmultichar in /opt/FirefoxSource/mozilla-release/media/omx-plugin/include/ics/stagefright/MetaData.h: multi-character character constant
36:22.94 /opt/FirefoxSource/mozilla-release/media/omx-plugin/include/ics/stagefright/MetaData.h:69:25: warning: multi-character character constant [-Wmultichar]
36:22.94 Warning: -Wmultichar in /opt/FirefoxSource/mozilla-release/media/omx-plugin/include/ics/stagefright/MetaData.h: multi-character character constant
36:22.94 /opt/FirefoxSource/mozilla-release/media/omx-plugin/include/ics/stagefright/MetaData.h:70:19: warning: multi-character character constant [-Wmultichar]
36:22.94 Warning: -Wmultichar in /opt/FirefoxSource/mozilla-release/media/omx-plugin/include/ics/stagefright/MetaData.h: multi-character character constant
36:22.94 /opt/FirefoxSource/mozilla-release/media/omx-plugin/include/ics/stagefright/MetaData.h:71:17: warning: multi-character character constant [-Wmultichar]
36:22.94 Warning: -Wmultichar in /opt/FirefoxSource/mozilla-release/media/omx-plugin/include/ics/stagefright/MetaData.h: multi-character character constant
36:22.94 /opt/FirefoxSource/mozilla-release/media/omx-plugin/include/ics/stagefright/MetaData.h:73:17: warning: multi-character character constant [-Wmultichar]
36:22.94 Warning: -Wmultichar in /opt/FirefoxSource/mozilla-release/media/omx-plugin/include/ics/stagefright/MetaData.h: multi-character character constant
36:22.94 /opt/FirefoxSource/mozilla-release/media/omx-plugin/include/ics/stagefright/MetaData.h:74:18: warning: multi-character character constant [-Wmultichar]
36:22.94 Warning: -Wmultichar in /opt/FirefoxSource/mozilla-release/media/omx-plugin/include/ics/stagefright/MetaData.h: multi-character character constant
36:22.94 /opt/FirefoxSource/mozilla-release/media/omx-plugin/include/ics/stagefright/MetaData.h:75:23: warning: multi-character character constant [-Wmultichar]
36:22.94 Warning: -Wmultichar in /opt/FirefoxSource/mozilla-release/media/omx-plugin/include/ics/stagefright/MetaData.h: multi-character character constant
36:22.94 /opt/FirefoxSource/mozilla-release/media/omx-plugin/include/ics/stagefright/MetaData.h:76:20: warning: multi-character character constant [-Wmultichar]
36:22.94 Warning: -Wmultichar in /opt/FirefoxSource/mozilla-release/media/omx-plugin/include/ics/stagefright/MetaData.h: multi-character character constant
36:22.94 /opt/FirefoxSource/mozilla-release/media/omx-plugin/include/ics/stagefright/MetaData.h:77:17: warning: multi-character character constant [-Wmultichar]
36:22.94 Warning: -Wmultichar in /opt/FirefoxSource/mozilla-release/media/omx-plugin/include/ics/stagefright/MetaData.h: multi-character character constant
36:22.94 /opt/FirefoxSource/mozilla-release/media/omx-plugin/include/ics/stagefright/MetaData.h:78:17: warning: multi-character character constant [-Wmultichar]
36:22.94 Warning: -Wmultichar in /opt/FirefoxSource/mozilla-release/media/omx-plugin/include/ics/stagefright/MetaData.h: multi-character character constant
36:22.94 /opt/FirefoxSource/mozilla-release/media/omx-plugin/include/ics/stagefright/MetaData.h:79:16: warning: multi-character character constant [-Wmultichar]
36:22.94 Warning: -Wmultichar in /opt/FirefoxSource/mozilla-release/media/omx-plugin/include/ics/stagefright/MetaData.h: multi-character character constant
36:22.94 /opt/FirefoxSource/mozilla-release/media/omx-plugin/include/ics/stagefright/MetaData.h:80:20: warning: multi-character character constant [-Wmultichar]
36:22.94 Warning: -Wmultichar in /opt/FirefoxSource/mozilla-release/media/omx-plugin/include/ics/stagefright/MetaData.h: multi-character character constant
36:22.94 /opt/FirefoxSource/mozilla-release/media/omx-plugin/include/ics/stagefright/MetaData.h:81:24: warning: multi-character character constant [-Wmultichar]
36:22.94 Warning: -Wmultichar in /opt/FirefoxSource/mozilla-release/media/omx-plugin/include/ics/stagefright/MetaData.h: multi-character character constant
36:22.94 /opt/FirefoxSource/mozilla-release/media/omx-plugin/include/ics/stagefright/MetaData.h:82:18: warning: multi-character character constant [-Wmultichar]
36:22.94 Warning: -Wmultichar in /opt/FirefoxSource/mozilla-release/media/omx-plugin/include/ics/stagefright/MetaData.h: multi-character character constant
36:22.94 /opt/FirefoxSource/mozilla-release/media/omx-plugin/include/ics/stagefright/MetaData.h:83:25: warning: multi-character character constant [-Wmultichar]
36:22.94 Warning: -Wmultichar in /opt/FirefoxSource/mozilla-release/media/omx-plugin/include/ics/stagefright/MetaData.h: multi-character character constant
36:22.94 /opt/FirefoxSource/mozilla-release/media/omx-plugin/include/ics/stagefright/MetaData.h:84:22: warning: multi-character character constant [-Wmultichar]
36:22.94 Warning: -Wmultichar in /opt/FirefoxSource/mozilla-release/media/omx-plugin/include/ics/stagefright/MetaData.h: multi-character character constant
36:22.94 /opt/FirefoxSource/mozilla-release/media/omx-plugin/include/ics/stagefright/MetaData.h:85:16: warning: multi-character character constant [-Wmultichar]
36:22.94 Warning: -Wmultichar in /opt/FirefoxSource/mozilla-release/media/omx-plugin/include/ics/stagefright/MetaData.h: multi-character character constant
36:22.94 /opt/FirefoxSource/mozilla-release/media/omx-plugin/include/ics/stagefright/MetaData.h:86:18: warning: multi-character character constant [-Wmultichar]
36:22.94 Warning: -Wmultichar in /opt/FirefoxSource/mozilla-release/media/omx-plugin/include/ics/stagefright/MetaData.h: multi-character character constant
36:22.94 /opt/FirefoxSource/mozilla-release/media/omx-plugin/include/ics/stagefright/MetaData.h:87:23: warning: multi-character character constant [-Wmultichar]
36:22.94 Warning: -Wmultichar in /opt/FirefoxSource/mozilla-release/media/omx-plugin/include/ics/stagefright/MetaData.h: multi-character character constant
36:22.94 /opt/FirefoxSource/mozilla-release/media/omx-plugin/include/ics/stagefright/MetaData.h:88:20: warning: multi-character character constant [-Wmultichar]
36:22.94 Warning: -Wmultichar in /opt/FirefoxSource/mozilla-release/media/omx-plugin/include/ics/stagefright/MetaData.h: multi-character character constant
36:22.94 /opt/FirefoxSource/mozilla-release/media/omx-plugin/include/ics/stagefright/MetaData.h:89:21: warning: multi-character character constant [-Wmultichar]
36:22.94 Warning: -Wmultichar in /opt/FirefoxSource/mozilla-release/media/omx-plugin/include/ics/stagefright/MetaData.h: multi-character character constant
36:22.94 /opt/FirefoxSource/mozilla-release/media/omx-plugin/include/ics/stagefright/MetaData.h:92:24: warning: multi-character character constant [-Wmultichar]
36:22.94 Warning: -Wmultichar in /opt/FirefoxSource/mozilla-release/media/omx-plugin/include/ics/stagefright/MetaData.h: multi-character character constant
36:22.94 /opt/FirefoxSource/mozilla-release/media/omx-plugin/include/ics/stagefright/MetaData.h:93:22: warning: multi-character character constant [-Wmultichar]
36:22.94 Warning: -Wmultichar in /opt/FirefoxSource/mozilla-release/media/omx-plugin/include/ics/stagefright/MetaData.h: multi-character character constant
36:22.94 /opt/FirefoxSource/mozilla-release/media/omx-plugin/include/ics/stagefright/MetaData.h:96:27: warning: multi-character character constant [-Wmultichar]
36:22.94 Warning: -Wmultichar in /opt/FirefoxSource/mozilla-release/media/omx-plugin/include/ics/stagefright/MetaData.h: multi-character character constant
36:22.95 /opt/FirefoxSource/mozilla-release/media/omx-plugin/include/ics/stagefright/MetaData.h:97:26: warning: multi-character character constant [-Wmultichar]
36:22.95 Warning: -Wmultichar in /opt/FirefoxSource/mozilla-release/media/omx-plugin/include/ics/stagefright/MetaData.h: multi-character character constant
36:22.95 /opt/FirefoxSource/mozilla-release/media/omx-plugin/include/ics/stagefright/MetaData.h:102:20: warning: multi-character character constant [-Wmultichar]
36:22.95 Warning: -Wmultichar in /opt/FirefoxSource/mozilla-release/media/omx-plugin/include/ics/stagefright/MetaData.h: multi-character character constant
36:22.95 /opt/FirefoxSource/mozilla-release/media/omx-plugin/include/ics/stagefright/MetaData.h:106:27: warning: multi-character character constant [-Wmultichar]
36:22.95 Warning: -Wmultichar in /opt/FirefoxSource/mozilla-release/media/omx-plugin/include/ics/stagefright/MetaData.h: multi-character character constant
36:22.95 /opt/FirefoxSource/mozilla-release/media/omx-plugin/include/ics/stagefright/MetaData.h:108:23: warning: multi-character character constant [-Wmultichar]
36:22.95 Warning: -Wmultichar in /opt/FirefoxSource/mozilla-release/media/omx-plugin/include/ics/stagefright/MetaData.h: multi-character character constant
36:22.95 /opt/FirefoxSource/mozilla-release/media/omx-plugin/include/ics/stagefright/MetaData.h:111:20: warning: multi-character character constant [-Wmultichar]
36:22.95 Warning: -Wmultichar in /opt/FirefoxSource/mozilla-release/media/omx-plugin/include/ics/stagefright/MetaData.h: multi-character character constant
36:22.95 /opt/FirefoxSource/mozilla-release/media/omx-plugin/include/ics/stagefright/MetaData.h:113:24: warning: multi-character character constant [-Wmultichar]
36:22.95 Warning: -Wmultichar in /opt/FirefoxSource/mozilla-release/media/omx-plugin/include/ics/stagefright/MetaData.h: multi-character character constant
36:22.95 /opt/FirefoxSource/mozilla-release/media/omx-plugin/include/ics/stagefright/MetaData.h:115:24: warning: multi-character character constant [-Wmultichar]
36:22.95 Warning: -Wmultichar in /opt/FirefoxSource/mozilla-release/media/omx-plugin/include/ics/stagefright/MetaData.h: multi-character character constant
36:22.95 /opt/FirefoxSource/mozilla-release/media/omx-plugin/include/ics/stagefright/MetaData.h:118:20: warning: multi-character character constant [-Wmultichar]
36:22.95 Warning: -Wmultichar in /opt/FirefoxSource/mozilla-release/media/omx-plugin/include/ics/stagefright/MetaData.h: multi-character character constant
36:22.95 /opt/FirefoxSource/mozilla-release/media/omx-plugin/include/ics/stagefright/MetaData.h:121:25: warning: multi-character character constant [-Wmultichar]
36:22.95 Warning: -Wmultichar in /opt/FirefoxSource/mozilla-release/media/omx-plugin/include/ics/stagefright/MetaData.h: multi-character character constant
36:22.95 /opt/FirefoxSource/mozilla-release/media/omx-plugin/include/ics/stagefright/MetaData.h:124:26: warning: multi-character character constant [-Wmultichar]
36:22.95 Warning: -Wmultichar in /opt/FirefoxSource/mozilla-release/media/omx-plugin/include/ics/stagefright/MetaData.h: multi-character character constant
36:22.95 /opt/FirefoxSource/mozilla-release/media/omx-plugin/include/ics/stagefright/MetaData.h:126:33: warning: multi-character character constant [-Wmultichar]
36:22.95 Warning: -Wmultichar in /opt/FirefoxSource/mozilla-release/media/omx-plugin/include/ics/stagefright/MetaData.h: multi-character character constant
36:22.95 /opt/FirefoxSource/mozilla-release/media/omx-plugin/include/ics/stagefright/MetaData.h:130:17: warning: multi-character character constant [-Wmultichar]
36:22.95 Warning: -Wmultichar in /opt/FirefoxSource/mozilla-release/media/omx-plugin/include/ics/stagefright/MetaData.h: multi-character character constant
36:22.95 /opt/FirefoxSource/mozilla-release/media/omx-plugin/include/ics/stagefright/MetaData.h:131:17: warning: multi-character character constant [-Wmultichar]
36:22.95 Warning: -Wmultichar in /opt/FirefoxSource/mozilla-release/media/omx-plugin/include/ics/stagefright/MetaData.h: multi-character character constant
36:22.95 /opt/FirefoxSource/mozilla-release/media/omx-plugin/include/ics/stagefright/MetaData.h:132:17: warning: multi-character character constant [-Wmultichar]
36:22.95 Warning: -Wmultichar in /opt/FirefoxSource/mozilla-release/media/omx-plugin/include/ics/stagefright/MetaData.h: multi-character character constant
36:22.95 /opt/FirefoxSource/mozilla-release/media/omx-plugin/include/ics/stagefright/MetaData.h:141:21: warning: multi-character character constant [-Wmultichar]
36:22.95 Warning: -Wmultichar in /opt/FirefoxSource/mozilla-release/media/omx-plugin/include/ics/stagefright/MetaData.h: multi-character character constant
36:22.95 /opt/FirefoxSource/mozilla-release/media/omx-plugin/include/ics/stagefright/MetaData.h:142:25: warning: multi-character character constant [-Wmultichar]
36:22.95 Warning: -Wmultichar in /opt/FirefoxSource/mozilla-release/media/omx-plugin/include/ics/stagefright/MetaData.h: multi-character character constant
36:22.95 /opt/FirefoxSource/mozilla-release/media/omx-plugin/include/ics/stagefright/MetaData.h:143:22: warning: multi-character character constant [-Wmultichar]
36:22.95 Warning: -Wmultichar in /opt/FirefoxSource/mozilla-release/media/omx-plugin/include/ics/stagefright/MetaData.h: multi-character character constant
36:22.95 /opt/FirefoxSource/mozilla-release/media/omx-plugin/include/ics/stagefright/MetaData.h:144:22: warning: multi-character character constant [-Wmultichar]
36:22.95 Warning: -Wmultichar in /opt/FirefoxSource/mozilla-release/media/omx-plugin/include/ics/stagefright/MetaData.h: multi-character character constant
36:22.95 /opt/FirefoxSource/mozilla-release/media/omx-plugin/include/ics/stagefright/MetaData.h:145:22: warning: multi-character character constant [-Wmultichar]
36:22.95 Warning: -Wmultichar in /opt/FirefoxSource/mozilla-release/media/omx-plugin/include/ics/stagefright/MetaData.h: multi-character character constant
36:22.95 /opt/FirefoxSource/mozilla-release/media/omx-plugin/include/ics/stagefright/MetaData.h:146:24: warning: multi-character character constant [-Wmultichar]
36:22.95 Warning: -Wmultichar in /opt/FirefoxSource/mozilla-release/media/omx-plugin/include/ics/stagefright/MetaData.h: multi-character character constant
36:22.95 /opt/FirefoxSource/mozilla-release/media/omx-plugin/include/ics/stagefright/MetaData.h:147:21: warning: multi-character character constant [-Wmultichar]
36:22.95 libstagefright.so
36:23.01 libomxplugingb.so
36:23.05 OmxPluginHoneycomb.o
36:23.08 OmxPluginKitKat.o
36:23.56 dh.c: In function 'DH_Derive':
36:23.56 dh.c:271:13: warning: comparison between signed and unsigned integer expressions [-Wsign-compare]
36:23.79 libomxpluginhc.so
36:23.85 ec.c: In function 'ec_points_mul':
36:23.85 ec.c:89:17: warning: comparison between signed and unsigned integer expressions [-Wsign-compare]
36:23.85 ec.c: In function 'EC_ValidatePublicKey':
36:23.85 ec.c:450:33: warning: comparison between signed and unsigned integer expressions [-Wsign-compare]
36:23.87 OmxPlugin.o
36:23.98 libomxpluginkk.so
36:23.99 ecdecode.c: In function 'gf_populate_params':
36:23.99 ecdecode.c:120:5: warning: comparison of unsigned expression < 0 is always false [-Wtype-limits]
36:24.23 TestPair.o
36:24.27 dsa.c: In function 'DSA_VerifyDigest':
36:24.27 dsa.c:518:25: warning: comparison between signed and unsigned integer expressions [-Wsign-compare]
36:24.27 dsa.c:530:27: warning: comparison between signed and unsigned integer expressions [-Wsign-compare]
36:24.53 pqg.c: In function 'makePrimefromPrimesShaweTaylor':
36:24.53 pqg.c:617:34: warning: comparison between signed and unsigned integer expressions [-Wsign-compare]
36:24.53 pqg.c:687:28: warning: comparison between signed and unsigned integer expressions [-Wsign-compare]
36:24.53 pqg.c: In function 'makePrimefromSeedShaweTaylor':
36:24.53 pqg.c:849:28: warning: comparison between signed and unsigned integer expressions [-Wsign-compare]
36:24.53 pqg.c: In function 'pqg_ParamGen':
36:24.54 pqg.c:1232:18: warning: variable 'b' set but not used [-Wunused-but-set-variable]
36:24.54 pqg.c: In function 'PQG_VerifyParams':
36:24.54 pqg.c:1614:50: warning: comparison between signed and unsigned integer expressions [-Wsign-compare]
36:24.54 pqg.c:1672:25: warning: comparison between signed and unsigned integer expressions [-Wsign-compare]
36:24.54 pqg.c:1708:18: warning: comparison between signed and unsigned integer expressions [-Wsign-compare]
36:24.54 pqg.c:1709:25: warning: comparison between signed and unsigned integer expressions [-Wsign-compare]
36:24.54 pqg.c:1710:33: warning: comparison between signed and unsigned integer expressions [-Wsign-compare]
36:24.54 pqg.c:1733:29: warning: comparison between signed and unsigned integer expressions [-Wsign-compare]
36:24.54 pqg.c:1775:27: warning: 'type' may be used uninitialized in this function [-Wmaybe-uninitialized]
36:24.54 pqg.c:1595:16: note: 'type' was declared here
36:24.54 pqg.c:1777:5: warning: 'hashtype' may be used uninitialized in this function [-Wmaybe-uninitialized]
36:24.54 pqg.c:1594:19: note: 'hashtype' was declared here
36:24.63 libomxplugin.so
36:24.76 rsa.c: In function 'RSA_NewKey':
36:24.76 rsa.c:251:29: warning: comparison between signed and unsigned integer expressions [-Wsign-compare]
36:24.76 rsa.c: In function 'rsa_get_primes_from_exponents':
36:24.76 rsa.c:482:52: warning: comparison between signed and unsigned integer expressions [-Wsign-compare]
36:24.80 shvfy.c: In function 'readItem':
36:24.80 shvfy.c:267:19: warning: comparison between signed and unsigned integer expressions [-Wsign-compare]
36:25.05 mpi/mpprime.c: In function 'mpp_make_prime':
36:25.05 mpi/mpprime.c:445:47: warning: comparison between signed and unsigned integer expressions [-Wsign-compare]
36:25.10 TestRefPtr.o
36:25.21 mpi/mplogic.c: In function 'mpl_num_set':
36:25.21 mpi/mplogic.c:230:20: warning: comparison between signed and unsigned integer expressions [-Wsign-compare]
36:25.21 mpi/mplogic.c: In function 'mpl_num_clear':
36:25.21 mpi/mplogic.c:260:20: warning: comparison between signed and unsigned integer expressions [-Wsign-compare]
36:25.22 TestRollingMean.o
36:25.48 TestSHA1.o
36:25.51 TestSplayTree.o
36:25.59 TestTypedEnum.o
36:25.77 TestTypeTraits.o
36:26.27 mpi/mpi.c: In function 'mp_expt':
36:26.27 mpi/mpi.c:1114:20: warning: comparison between signed and unsigned integer expressions [-Wsign-compare]
36:26.28 mpi/mpi.c:1118:22: warning: comparison between signed and unsigned integer expressions [-Wsign-compare]
36:26.28 mpi/mpi.c: In function 's_mp_exptmod':
36:26.28 mpi/mpi.c:1497:20: warning: comparison between signed and unsigned integer expressions [-Wsign-compare]
36:26.28 mpi/mpi.c:1501:22: warning: comparison between signed and unsigned integer expressions [-Wsign-compare]
36:26.28 mpi/mpi.c: In function 'mp_trailing_zeros':
36:26.28 mpi/mpi.c:2012:45: warning: comparison between signed and unsigned integer expressions [-Wsign-compare]
36:26.28 mpi/mpi.c: In function 's_mp_fixup_reciprocal':
36:26.28 mpi/mpi.c:2164:19: warning: comparison between signed and unsigned integer expressions [-Wsign-compare]
36:26.28 mpi/mpi.c:2164:51: warning: signed and unsigned type in conditional expression [-Wsign-compare]
36:26.28 mpi/mpi.c:2166:11: warning: comparison between signed and unsigned integer expressions [-Wsign-compare]
36:26.28 mpi/mpi.c: In function 's_mp_lshd':
36:26.28 mpi/mpi.c:2938:18: warning: comparison between signed and unsigned integer expressions [-Wsign-compare]
36:26.28 mpi/mpi.c: In function 's_mp_mul_2':
36:26.28 mpi/mpi.c:3063:12: warning: comparison between signed and unsigned integer expressions [-Wsign-compare]
36:26.28 mpi/mpi.c: In function 's_mp_todigit':
36:26.28 mpi/mpi.c:4600:10: warning: comparison between signed and unsigned integer expressions [-Wsign-compare]
36:26.28 mpi/mpi.c: In function 'mp_to_unsigned_octets':
36:26.28 mpi/mpi.c:4720:29: warning: comparison between signed and unsigned integer expressions [-Wsign-compare]
36:26.28 mpi/mpi.c: In function 'mp_to_signed_octets':
36:26.28 mpi/mpi.c:4752:29: warning: comparison between signed and unsigned integer expressions [-Wsign-compare]
36:26.28 mpi/mpi.c:4766:20: warning: comparison between signed and unsigned integer expressions [-Wsign-compare]
36:26.28 mpi/mpi.c:4767:18: warning: comparison between signed and unsigned integer expressions [-Wsign-compare]
36:26.28 mpi/mpi.c: In function 'mp_to_fixlen_octets':
36:26.28 mpi/mpi.c:4792:29: warning: comparison between signed and unsigned integer expressions [-Wsign-compare]
36:26.28 mpi/mpi.c:4795:16: warning: comparison between signed and unsigned integer expressions [-Wsign-compare]
36:26.46 ecl/ecp_521.c: In function 'ec_GFp_nistp521_mod':
36:26.46 ecl/ecp_521.c:42:73: warning: comparison between signed and unsigned integer expressions [-Wsign-compare]
36:26.46 ecl/ecp_521.c:50:18: warning: comparison between signed and unsigned integer expressions [-Wsign-compare]
36:26.46 TestUniquePtr.o
36:26.51 TestWeakPtr.o
36:26.56 TestPoisonArea.o
36:26.90 TestArrayUtils
36:26.90 TestAtomics
36:27.00 TestBinarySearch
36:27.11 TestBloomFilter
36:27.31 TestCasting
36:27.41 TestCeilingFloor
36:27.52 TestCheckedInt
36:27.55 lgglue.c: In function 'sftkdb_resolvePath':
36:27.55 lgglue.c:44:24: warning: comparison between signed and unsigned integer expressions [-Wsign-compare]
36:27.63 TestCountPopulation
36:27.75 TestCountZeroes
36:27.86 TestEndian
36:27.97 TestEnumSet
36:28.03 lowpbe.c: In function 'nsspkcs5_PKCS12PBE':
36:28.03 lowpbe.c:519:22: warning: comparison between signed and unsigned integer expressions [-Wsign-compare]
36:28.07 TestFloatingPoint
36:28.17 TestIntegerPrintfMacros
36:28.27 TestMacroArgs
36:28.38 TestMacroForEach
36:28.96 pkcs11u.c: In function 'sftk_DeleteObject':
36:28.96 pkcs11u.c:1177:22: warning: unused variable 'to' [-Wunused-variable]
36:28.96 pkcs11u.c: In function 'sftk_NewTokenObject':
36:28.96 pkcs11u.c:1902:22: warning: variable 'tokObject' set but not used [-Wunused-but-set-variable]
36:29.03 pkcs11.c: In function 'sftk_GetPubKey':
36:29.03 pkcs11.c:1756:35: warning: comparison between signed and unsigned integer expressions [-Wsign-compare]
36:29.03 pkcs11.c:1764:35: warning: comparison between signed and unsigned integer expressions [-Wsign-compare]
36:29.03 pkcs11.c:1774:27: warning: comparison between signed and unsigned integer expressions [-Wsign-compare]
36:29.03 pkcs11.c: In function 'NSC_GetInfo':
36:29.03 pkcs11.c:3144:19: warning: variable 'c' set but not used [-Wunused-but-set-variable]
36:29.03 pkcs11.c: In function 'NSC_GetAttributeValue':
36:29.03 pkcs11.c:4314:58: warning: comparison between signed and unsigned integer expressions [-Wsign-compare]
36:29.03 pkcs11.c: In function 'sftk_emailhack':
36:29.03 pkcs11.c:4527:17: warning: comparison between signed and unsigned integer expressions [-Wsign-compare]
36:29.03 pkcs11.c: In function 'NSC_FindObjects':
36:29.03 pkcs11.c:4743:54: warning: signed and unsigned type in conditional expression [-Wsign-compare]
36:29.03 pkcs11.c: In function 'NSC_CreateObject':
36:29.03 pkcs11.c:4085:21: warning: 'moduleIndex' may be used uninitialized in this function [-Wmaybe-uninitialized]
36:29.03 pkcs11.c:4005:19: note: 'moduleIndex' was declared here
36:29.44 sdb.c: In function 'sdb_FindObjectsInit':
36:29.44 sdb.c:702:28: warning: comparison between signed and unsigned integer expressions [-Wsign-compare]
36:29.44 sdb.c:727:32: warning: comparison between signed and unsigned integer expressions [-Wsign-compare]
36:29.44 sdb.c: In function 'sdb_GetAttributeValueNoLock':
36:29.44 sdb.c:848:17: warning: comparison between signed and unsigned integer expressions [-Wsign-compare]
36:29.44 sdb.c:900:34: warning: comparison between signed and unsigned integer expressions [-Wsign-compare]
36:29.44 sdb.c: In function 'sdb_SetAttributeValue':
36:29.44 sdb.c:978:27: warning: comparison between signed and unsigned integer expressions [-Wsign-compare]
36:29.44 sdb.c:1007:17: warning: comparison between signed and unsigned integer expressions [-Wsign-compare]
36:29.44 sdb.c: In function 'sdb_CreateObject':
36:29.44 sdb.c:1138:42: warning: comparison between signed and unsigned integer expressions [-Wsign-compare]
36:29.44 sdb.c:1168:17: warning: comparison between signed and unsigned integer expressions [-Wsign-compare]
36:29.55 sftkhmac.c: In function 'sftk_HMACConstantTime_Update':
36:29.55 sftkhmac.c:149:15: warning: unused variable 'rv' [-Wunused-variable]
36:29.55 sftkhmac.c: In function 'sftk_SSLv3MACConstantTime_Update':
36:29.55 sftkhmac.c:163:15: warning: unused variable 'rv' [-Wunused-variable]
36:29.69 sftkdb.c: In function 'sftkdb_fixupTemplateOut':
36:29.69 sftkdb.c:328:22: warning: variable 'data' set but not used [-Wunused-but-set-variable]
36:29.69 sftkdb.c:345:69: warning: comparison between signed and unsigned integer expressions [-Wsign-compare]
36:29.69 sftkdb.c: In function 'sftk_signTemplate':
36:29.69 sftkdb.c:520:17: warning: comparison between signed and unsigned integer expressions [-Wsign-compare]
36:29.69 sftkdb.c: In function 'sftkdb_CreateObject':
36:29.69 sftkdb.c:576:12: warning: variable 'inTransaction' set but not used [-Wunused-but-set-variable]
36:29.69 sftkdb.c: In function 'sftk_ExtractTemplate':
36:29.70 sftkdb.c:619:17: warning: comparison between signed and unsigned integer expressions [-Wsign-compare]
36:29.70 sftkdb.c:632:17: warning: comparison between signed and unsigned integer expressions [-Wsign-compare]
36:29.70 sftkdb.c: In function 'sftkdb_resolveConflicts':
36:29.70 sftkdb.c:1045:13: warning: comparison between signed and unsigned integer expressions [-Wsign-compare]
36:29.70 sftkdb.c: In function 'sftkdb_FindObjects':
36:29.70 sftkdb.c:1261:14: warning: comparison between signed and unsigned integer expressions [-Wsign-compare]
36:29.70 sftkdb.c: In function 'sftkdb_GetObjectTemplate':
36:29.70 sftkdb.c:1613:14: warning: comparison between signed and unsigned integer expressions [-Wsign-compare]
36:29.70 sftkdb.c:1631:63: warning: comparison between signed and unsigned integer expressions [-Wsign-compare]
36:29.70 sftkdb.c: In function 'sftkdb_handleIDAndName':
36:29.70 sftkdb.c:2014:11: warning: variable 'crv' set but not used [-Wunused-but-set-variable]
36:29.70 sftkdb.c: In function 'sftkdb_mergeObject':
36:29.70 sftkdb.c:2196:17: warning: comparison between signed and unsigned integer expressions [-Wsign-compare]
36:29.70 sftkdb.c: In function 'sftkdb_Update':
36:29.70 sftkdb.c:2301:38: warning: comparison between signed and unsigned integer expressions [-Wsign-compare]
36:30.02 sftkpwd.c: In function 'sftk_updateMacs':
36:30.02 sftkpwd.c:908:17: warning: comparison between signed and unsigned integer expressions [-Wsign-compare]
36:30.02 sftkpwd.c:909:31: warning: comparison between signed and unsigned integer expressions [-Wsign-compare]
36:30.02 sftkpwd.c:930:17: warning: comparison between signed and unsigned integer expressions [-Wsign-compare]
36:30.02 sftkpwd.c:935:31: warning: comparison between signed and unsigned integer expressions [-Wsign-compare]
36:30.02 sftkpwd.c:868:11: warning: variable 'crv2' set but not used [-Wunused-but-set-variable]
36:30.02 sftkpwd.c:867:11: warning: variable 'crv' set but not used [-Wunused-but-set-variable]
36:30.02 sftkpwd.c: In function 'sftk_updateEncrypted':
36:30.02 sftkpwd.c:986:17: warning: comparison between signed and unsigned integer expressions [-Wsign-compare]
36:30.02 sftkpwd.c:993:31: warning: comparison between signed and unsigned integer expressions [-Wsign-compare]
36:30.02 sftkpwd.c: In function 'sftkdb_convertObjects':
36:30.02 sftkpwd.c:1125:38: warning: comparison between signed and unsigned integer expressions [-Wsign-compare]
36:30.04 TestMaybe
36:30.14 TestPair
36:30.15 pkcs11c.c: In function 'NSC_GenerateKeyPair':
36:30.15 pkcs11c.c:4340:9: warning: variable 'private_value_bits' set but not used [-Wunused-but-set-variable]
36:30.15 pkcs11c.c: In function 'sftk_PackagePrivateKey':
36:30.15 pkcs11c.c:4862:14: warning: variable 'fordebug' set but not used [-Wunused-but-set-variable]
36:30.15 pkcs11c.c: In function 'NSC_DeriveKey':
36:30.15 pkcs11c.c:6764:18: warning: comparison between signed and unsigned integer expressions [-Wsign-compare]
36:30.15 pkcs11c.c:6769:18: warning: comparison between signed and unsigned integer expressions [-Wsign-compare]
36:30.15 pkcs11c.c:6850:20: warning: comparison between signed and unsigned integer expressions [-Wsign-compare]
36:30.15 pkcs11c.c: In function 'NSC_GenerateKeyPair':
36:30.15 pkcs11c.c:4260:6: warning: 'subPrimeLen' may be used uninitialized in this function [-Wmaybe-uninitialized]
36:30.15 pkcs11c.c:4042:14: note: 'subPrimeLen' was declared here
36:30.15 pkcs11c.c:4212:23: warning: 'modulusLen' may be used uninitialized in this function [-Wmaybe-uninitialized]
36:30.15 pkcs11c.c:4041:14: note: 'modulusLen' was declared here
36:30.16 pkcs11c.c: In function 'NSC_GenerateKey':
36:30.16 pkcs11c.c:3968:13: warning: 'hashType' may be used uninitialized in this function [-Wmaybe-uninitialized]
36:30.16 TestRefPtr
36:30.24 TestRollingMean
36:30.26 TestSHA1
36:30.31 libsqlite.a.desc
36:30.36 libnspr.a.desc
36:30.36 TestSplayTree
36:30.38 libcrmf.a.desc
36:30.42 md4.o
36:30.42 CryptoTask.o
36:30.68 nsCertificatePrincipal.o
36:30.91 nsCertOverrideService.o
36:31.35 nsCertPicker.o
36:31.64 nsCertVerificationThread.o
36:31.96 RegExp.o
36:31.96 Parser.o
36:32.32 nsClientAuthRemember.o
36:32.83 nsCrypto.o
36:33.33 nsDataSignatureVerifier.o
36:33.83 nsKeygenHandler.o
36:34.07 jsarray.o
36:34.62 nsKeygenThread.o
36:35.57 TestTypedEnum
36:35.70 TestTypeTraits
36:35.86 TestUniquePtr
36:35.96 TestWeakPtr
36:36.11 TestPoisonArea
36:36.12 nsKeyModule.o
36:36.45 WriteArgument.o
36:36.51 WriteArgument
36:36.64 ssltunnel.o
36:36.65 nsNSSASN1Object.o
36:37.09 nsNSSCallbacks.o
36:37.56 /opt/FirefoxSource/mozilla-release/security/manager/ssl/src/nsNSSASN1Object.cpp: In function 'nsresult buildASN1ObjectFromDER(unsigned char*, unsigned char*, nsIASN1Sequence*)':
36:37.56 Warning: -Wmaybe-uninitialized in /opt/FirefoxSource/mozilla-release/security/manager/ssl/src/nsNSSASN1Object.cpp: 'bytesUsed' may be used uninitialized in this function
36:37.56 /opt/FirefoxSource/mozilla-release/security/manager/ssl/src/nsNSSASN1Object.cpp:131:22: warning: 'bytesUsed' may be used uninitialized in this function [-Wmaybe-uninitialized]
36:37.57 nsNSSCertCache.o
36:37.96 ssltunnel
36:38.03 jsatom.o
36:38.86 jsmath.o
36:39.82 nsNSSCertHelper.o
36:40.24 nsNSSCertificate.o
36:42.01 nsNSSCertificateFakeTransport.o
36:43.80 nsNSSCertTrust.o
36:44.11 jsutil.o
36:44.62 nsNSSCertValidity.o
36:44.86 nsNSSCleaner.o
36:45.37 nsNSSErrors.o
36:45.50 nsNSSIOLayer.o
36:46.11 nsNSSModule.o
36:48.13 ExecutableAllocatorPosix.o
36:48.23 CTypes.o
36:48.39 Library.o
36:48.55 BadCertServer.o
36:48.55 ClientAuthServer.o
36:48.84 GenerateOCSPResponse.o
36:49.05 nsNSSShutDown.o
36:49.15 OCSPStaplingServer.o
36:49.57 pm_stub.o
36:49.82 BadCertServer
36:49.82 ClientAuthServer
36:49.94 GenerateOCSPResponse
36:50.00 OCSPStaplingServer
36:50.14 nsNTLMAuthModule.o
36:50.19 nsPK11TokenDB.o
36:50.50 nsPKCS11Slot.o
36:50.55 AsmJSFrameIterator.o
36:50.65 AsmJSLink.o
36:50.78 nsPKCS12Blob.o
36:51.43 nsProtectedAuthThread.o
36:51.50 AsmJSModule.o
36:52.62 nsPSMBackgroundThread.o
36:53.19 nsRandomGenerator.o
36:53.50 AsmJSSignalHandlers.o
36:53.75 nsSDR.o
36:54.30 NSSErrorsService.o
36:55.04 nsSSLSocketProvider.o
36:55.64 nsSSLStatus.o
36:56.15 nsStreamCipher.o
36:56.64 nsTLSSocketProvider.o
36:57.03 nsUsageArrayHelper.o
36:57.41 AsmJSValidate.o
36:57.54 PSMRunnable.o
36:58.14 SharedSSLState.o
36:58.49 SSLServerCertVerification.o
36:59.17 TransportSecurityInfo.o
36:59.99 Eval.o
37:00.04 In file included from /opt/FirefoxSource/mozilla-release/js/src/ctypes/CTypes.cpp:2714:0:
37:00.04 /opt/FirefoxSource/mozilla-release/js/src/ctypes/typedefs.h: In function 'bool js::ctypes::ExplicitConvert(JSContext*, JS::HandleValue, JS::HandleObject, void*)':
37:00.04 Warning: -Wmaybe-uninitialized in /opt/FirefoxSource/mozilla-release/js/src/ctypes/typedefs.h: 'result' may be used uninitialized in this function
37:00.04 /opt/FirefoxSource/mozilla-release/js/src/ctypes/typedefs.h:104:224: warning: 'result' may be used uninitialized in this function [-Wmaybe-uninitialized]
37:00.04 /opt/FirefoxSource/mozilla-release/js/src/ctypes/typedefs.h:104:28: note: 'result' was declared here
37:00.04 Warning: -Wmaybe-uninitialized in /opt/FirefoxSource/mozilla-release/js/src/ctypes/typedefs.h: 'result' may be used uninitialized in this function
37:00.04 /opt/FirefoxSource/mozilla-release/js/src/ctypes/typedefs.h:101:216: warning: 'result' may be used uninitialized in this function [-Wmaybe-uninitialized]
37:00.04 /opt/FirefoxSource/mozilla-release/js/src/ctypes/typedefs.h:101:24: note: 'result' was declared here
37:00.04 Warning: -Wmaybe-uninitialized in /opt/FirefoxSource/mozilla-release/js/src/ctypes/typedefs.h: 'result' may be used uninitialized in this function
37:00.04 /opt/FirefoxSource/mozilla-release/js/src/ctypes/typedefs.h:89:252: warning: 'result' may be used uninitialized in this function [-Wmaybe-uninitialized]
37:00.04 /opt/FirefoxSource/mozilla-release/js/src/ctypes/typedefs.h:89:42: note: 'result' was declared here
37:00.04 Intl.o
37:00.93 /opt/FirefoxSource/mozilla-release/js/src/asmjs/AsmJSModule.cpp: In member function 'void js::AsmJSModule::CodeRange::updateOffsets(js::jit::MacroAssembler&)':
37:00.93 Warning: -Wmaybe-uninitialized in /opt/FirefoxSource/mozilla-release/js/src/asmjs/AsmJSModule.cpp: 'profilingEpilogueBefore' may be used uninitialized in this function
37:00.93 /opt/FirefoxSource/mozilla-release/js/src/asmjs/AsmJSModule.cpp:1283:61: warning: 'profilingEpilogueBefore' may be used uninitialized in this function [-Wmaybe-uninitialized]
37:00.93 Warning: -Wmaybe-uninitialized in /opt/FirefoxSource/mozilla-release/js/src/asmjs/AsmJSModule.cpp: 'profilingJumpBefore' may be used uninitialized in this function
37:00.93 /opt/FirefoxSource/mozilla-release/js/src/asmjs/AsmJSModule.cpp:1283:61: warning: 'profilingJumpBefore' may be used uninitialized in this function [-Wmaybe-uninitialized]
37:00.93 Warning: -Wmaybe-uninitialized in /opt/FirefoxSource/mozilla-release/js/src/asmjs/AsmJSModule.cpp: 'entryBefore' may be used uninitialized in this function
37:00.93 /opt/FirefoxSource/mozilla-release/js/src/asmjs/AsmJSModule.cpp:1283:61: warning: 'entryBefore' may be used uninitialized in this function [-Wmaybe-uninitialized]
37:00.93 MapObject.o
37:01.31 nsCryptoHash.o
37:02.58 nsNSSCertificateDB.o
37:03.17 nsNSSComponent.o
37:04.61 nsNSSVersion.o
37:05.04 Object.o
37:06.17 PSMContentListener.o
37:06.48 nsCertTree.o
37:06.64 Profilers.o
37:09.03 libsecurity_manager_ssl_src.a.desc
37:09.06 SIMD.o
37:11.11 SymbolObject.o
37:11.24 TestingFunctions.o
37:12.57 TypedObject.o
37:15.99 WeakSetObject.o
37:16.18 /opt/FirefoxSource/mozilla-release/js/src/asmjs/AsmJSValidate.cpp: In function 'js::AsmJSNumLit ExtractSimdValue({anonymous}::ModuleCompiler&, js::frontend::ParseNode*)':
37:16.18 Warning: -Wunused-variable in /opt/FirefoxSource/mozilla-release/js/src/asmjs/AsmJSValidate.cpp: unused variable 'length'
37:16.18 /opt/FirefoxSource/mozilla-release/js/src/asmjs/AsmJSValidate.cpp:2000:14: warning: unused variable 'length' [-Wunused-variable]
37:16.18 In file included from /opt/FirefoxSource/mozilla-release/js/src/jit/JitCompartment.h:17:0,
37:16.18                  from /opt/FirefoxSource/mozilla-release/js/src/jit/arm/Assembler-arm.h:17,
37:16.18                  from /opt/FirefoxSource/mozilla-release/js/src/jit/arm/MacroAssembler-arm.h:14,
37:16.18                  from /opt/FirefoxSource/mozilla-release/js/src/jit/IonMacroAssembler.h:17,
37:16.18                  from /opt/FirefoxSource/mozilla-release/js/src/asmjs/AsmJSModule.h:32,
37:16.18                  from /opt/FirefoxSource/mozilla-release/js/src/asmjs/AsmJSValidate.cpp:33:
37:16.18 /opt/FirefoxSource/mozilla-release/js/src/jit/shared/Assembler-shared.h: In member function 'bool {anonymous}::FunctionCompiler::callPrivate(js::jit::MAsmJSCall::Callee, const {anonymous}::FunctionCompiler::Call&, js::jit::MIRType, js::jit::MDefinition**)':
37:16.18 Warning: -Wmaybe-uninitialized in /opt/FirefoxSource/mozilla-release/js/src/jit/shared/Assembler-shared.h: 'kind' may be used uninitialized in this function
37:16.18 /opt/FirefoxSource/mozilla-release/js/src/jit/shared/Assembler-shared.h:624:49: warning: 'kind' may be used uninitialized in this function [-Wmaybe-uninitialized]
37:16.18 /opt/FirefoxSource/mozilla-release/js/src/asmjs/AsmJSValidate.cpp:2694:28: note: 'kind' was declared here
37:16.18 /opt/FirefoxSource/mozilla-release/js/src/asmjs/AsmJSValidate.cpp: In function 'js::AsmJSNumLit ExtractNumericLiteral({anonymous}::ModuleCompiler&, js::frontend::ParseNode*)':
37:16.18 Warning: -Wmaybe-uninitialized in /opt/FirefoxSource/mozilla-release/js/src/asmjs/AsmJSValidate.cpp: 'u32' may be used uninitialized in this function
37:16.18 /opt/FirefoxSource/mozilla-release/js/src/asmjs/AsmJSValidate.cpp:2008:34: warning: 'u32' may be used uninitialized in this function [-Wmaybe-uninitialized]
37:16.18 /opt/FirefoxSource/mozilla-release/js/src/asmjs/AsmJSValidate.cpp:2006:22: note: 'u32' was declared here
37:16.18 Warning: -Wmaybe-uninitialized in /opt/FirefoxSource/mozilla-release/js/src/asmjs/AsmJSValidate.cpp: 'type' may be used uninitialized in this function
37:16.18 /opt/FirefoxSource/mozilla-release/js/src/asmjs/AsmJSValidate.cpp:1902:5: warning: 'type' may be used uninitialized in this function [-Wmaybe-uninitialized]
37:16.18 /opt/FirefoxSource/mozilla-release/js/src/asmjs/AsmJSValidate.cpp:1996:19: note: 'type' was declared here
37:16.18 /opt/FirefoxSource/mozilla-release/js/src/asmjs/AsmJSValidate.cpp: In function 'bool CheckCoercionArg({anonymous}::FunctionCompiler&, js::frontend::ParseNode*, js::AsmJSCoercion, js::jit::MDefinition**, {anonymous}::Type*)':
37:16.18 Warning: -Wmaybe-uninitialized in /opt/FirefoxSource/mozilla-release/js/src/asmjs/AsmJSValidate.cpp: 'retType' may be used uninitialized in this function
37:16.18 /opt/FirefoxSource/mozilla-release/js/src/asmjs/AsmJSValidate.cpp:4526:29: warning: 'retType' may be used uninitialized in this function [-Wmaybe-uninitialized]
37:16.18 /opt/FirefoxSource/mozilla-release/js/src/asmjs/AsmJSValidate.cpp: In function 'bool CheckFunction({anonymous}::ModuleCompiler&, js::LifoAlloc&, js::jit::MIRGenerator**, {anonymous}::ModuleCompiler::Func**)':
37:16.19 Warning: -Wmaybe-uninitialized in /opt/FirefoxSource/mozilla-release/js/src/asmjs/AsmJSValidate.cpp: 'fn' may be used uninitialized in this function
37:16.19 /opt/FirefoxSource/mozilla-release/js/src/asmjs/AsmJSValidate.cpp:6152:74: warning: 'fn' may be used uninitialized in this function [-Wmaybe-uninitialized]
37:16.19 sharkctl.o
37:17.75 LifoAlloc.o
37:17.79 BytecodeCompiler.o
37:17.99 BytecodeEmitter.o
37:19.17 FoldConstants.o
37:20.63 NameFunctions.o
37:23.41 ParseMaps.o
37:24.66 ParseNode.o
37:25.45 TokenStream.o
37:26.62 Barrier.o
37:27.73 ForkJoinNursery.o
37:27.74 GCTrace.o
37:27.81 Iteration.o
37:27.86 Marking.o
37:29.49 Memory.o
37:29.73 Nursery.o
37:30.04 In file included from /opt/FirefoxSource/mozilla-release/js/src/gc/Iteration.cpp:15:0:
37:30.04 /opt/FirefoxSource/mozilla-release/js/src/jsgcinlines.h: In function 'void js::IterateScripts(JSRuntime*, JSCompartment*, void*, js::IterateScriptCallback)':
37:30.04 Warning: -Wmaybe-uninitialized in /opt/FirefoxSource/mozilla-release/js/src/jsgcinlines.h: '*((void*)(& i)+12).js::gc::ArenaCellIterImpl::thing' may be used uninitialized in this function
37:30.04 /opt/FirefoxSource/mozilla-release/js/src/jsgcinlines.h:247:27: warning: '*((void*)(& i)+12).js::gc::ArenaCellIterImpl::thing' may be used uninitialized in this function [-Wmaybe-uninitialized]
37:30.05 /opt/FirefoxSource/mozilla-release/js/src/gc/Iteration.cpp:107:38: note: '*((void*)(& i)+12).js::gc::ArenaCellIterImpl::thing' was declared here
37:30.05 In file included from /opt/FirefoxSource/mozilla-release/js/src/gc/Barrier.h:12:0,
37:30.05                  from /opt/FirefoxSource/mozilla-release/js/src/jsatom.h:14,
37:30.05                  from /opt/FirefoxSource/mozilla-release/js/src/vm/Runtime.h:21,
37:30.05                  from /opt/FirefoxSource/mozilla-release/js/src/jscntxt.h:15,
37:30.05                  from /opt/FirefoxSource/mozilla-release/js/src/vm/RegExpObject.h:13,
37:30.05                  from /opt/FirefoxSource/mozilla-release/js/src/builtin/RegExp.h:10,
37:30.05                  from /opt/FirefoxSource/mozilla-release/js/src/jscompartment.h:12,
37:30.05                  from /opt/FirefoxSource/mozilla-release/js/src/gc/Iteration.cpp:7:
37:30.05 Warning: -Wmaybe-uninitialized in /opt/FirefoxSource/mozilla-release/js/src/gc/Heap.h: '*((void*)(& i)+12).js::gc::ArenaCellIterImpl::span.js::gc::FreeSpan::last' may be used uninitialized in this function
37:30.05 /opt/FirefoxSource/mozilla-release/js/src/gc/Heap.h:208:49: warning: '*((void*)(& i)+12).js::gc::ArenaCellIterImpl::span.js::gc::FreeSpan::last' may be used uninitialized in this function [-Wmaybe-uninitialized]
37:30.05 /opt/FirefoxSource/mozilla-release/js/src/gc/Iteration.cpp:107:38: note: '*((void*)(& i)+12).js::gc::ArenaCellIterImpl::span.js::gc::FreeSpan::last' was declared here
37:30.05 In file included from /opt/FirefoxSource/mozilla-release/js/src/gc/Iteration.cpp:15:0:
37:30.05 Warning: -Wmaybe-uninitialized in /opt/FirefoxSource/mozilla-release/js/src/jsgcinlines.h: '*((void*)(& i)+12).js::gc::ArenaCellIterImpl::span.js::gc::FreeSpan::first' may be used uninitialized in this function
37:30.05 /opt/FirefoxSource/mozilla-release/js/src/jsgcinlines.h:188:9: warning: '*((void*)(& i)+12).js::gc::ArenaCellIterImpl::span.js::gc::FreeSpan::first' may be used uninitialized in this function [-Wmaybe-uninitialized]
37:30.05 /opt/FirefoxSource/mozilla-release/js/src/gc/Iteration.cpp:107:38: note: '*((void*)(& i)+12).js::gc::ArenaCellIterImpl::span.js::gc::FreeSpan::first' was declared here
37:30.05 In file included from /opt/FirefoxSource/mozilla-release/js/src/gc/Iteration.cpp:15:0:
37:30.05 Warning: -Wmaybe-uninitialized in /opt/FirefoxSource/mozilla-release/js/src/jsgcinlines.h: '*((void*)(& i)+12).js::gc::ArenaCellIterImpl::thing' may be used uninitialized in this function
37:30.05 /opt/FirefoxSource/mozilla-release/js/src/jsgcinlines.h:237:46: warning: '*((void*)(& i)+12).js::gc::ArenaCellIterImpl::thing' may be used uninitialized in this function [-Wmaybe-uninitialized]
37:30.05 /opt/FirefoxSource/mozilla-release/js/src/gc/Iteration.cpp:100:34: note: '*((void*)(& i)+12).js::gc::ArenaCellIterImpl::thing' was declared here
37:30.05 In file included from /opt/FirefoxSource/mozilla-release/js/src/gc/Barrier.h:12:0,
37:30.05                  from /opt/FirefoxSource/mozilla-release/js/src/jsatom.h:14,
37:30.05                  from /opt/FirefoxSource/mozilla-release/js/src/vm/Runtime.h:21,
37:30.05                  from /opt/FirefoxSource/mozilla-release/js/src/jscntxt.h:15,
37:30.05                  from /opt/FirefoxSource/mozilla-release/js/src/vm/RegExpObject.h:13,
37:30.05                  from /opt/FirefoxSource/mozilla-release/js/src/builtin/RegExp.h:10,
37:30.05                  from /opt/FirefoxSource/mozilla-release/js/src/jscompartment.h:12,
37:30.05                  from /opt/FirefoxSource/mozilla-release/js/src/gc/Iteration.cpp:7:
37:30.05 Warning: -Wmaybe-uninitialized in /opt/FirefoxSource/mozilla-release/js/src/gc/Heap.h: '*((void*)(& i)+12).js::gc::ArenaCellIterImpl::span.js::gc::FreeSpan::last' may be used uninitialized in this function
37:30.05 /opt/FirefoxSource/mozilla-release/js/src/gc/Heap.h:208:49: warning: '*((void*)(& i)+12).js::gc::ArenaCellIterImpl::span.js::gc::FreeSpan::last' may be used uninitialized in this function [-Wmaybe-uninitialized]
37:30.05 /opt/FirefoxSource/mozilla-release/js/src/gc/Iteration.cpp:100:34: note: '*((void*)(& i)+12).js::gc::ArenaCellIterImpl::span.js::gc::FreeSpan::last' was declared here
37:30.05 In file included from /opt/FirefoxSource/mozilla-release/js/src/gc/Iteration.cpp:15:0:
37:30.05 Warning: -Wmaybe-uninitialized in /opt/FirefoxSource/mozilla-release/js/src/jsgcinlines.h: '*((void*)(& i)+12).js::gc::ArenaCellIterImpl::span.js::gc::FreeSpan::first' may be used uninitialized in this function
37:30.05 /opt/FirefoxSource/mozilla-release/js/src/jsgcinlines.h:188:9: warning: '*((void*)(& i)+12).js::gc::ArenaCellIterImpl::span.js::gc::FreeSpan::first' may be used uninitialized in this function [-Wmaybe-uninitialized]
37:30.05 /opt/FirefoxSource/mozilla-release/js/src/gc/Iteration.cpp:100:34: note: '*((void*)(& i)+12).js::gc::ArenaCellIterImpl::span.js::gc::FreeSpan::first' was declared here
37:30.05 In file included from ../../dist/include/js/GCAPI.h:12:0,
37:30.05                  from ../../dist/include/js/RootingAPI.h:19,
37:30.05                  from ../../dist/include/js/CallArgs.h:38,
37:30.05                  from ../../dist/include/js/CallNonGenericMethod.h:12,
37:30.05                  from /opt/FirefoxSource/mozilla-release/js/src/NamespaceImports.h:15,
37:30.05                  from /opt/FirefoxSource/mozilla-release/js/src/gc/Barrier.h:10,
37:30.05                  from /opt/FirefoxSource/mozilla-release/js/src/jsatom.h:14,
37:30.05                  from /opt/FirefoxSource/mozilla-release/js/src/vm/Runtime.h:21,
37:30.05                  from /opt/FirefoxSource/mozilla-release/js/src/jscntxt.h:15,
37:30.05                  from /opt/FirefoxSource/mozilla-release/js/src/vm/RegExpObject.h:13,
37:30.05                  from /opt/FirefoxSource/mozilla-release/js/src/builtin/RegExp.h:10,
37:30.05                  from /opt/FirefoxSource/mozilla-release/js/src/jscompartment.h:12,
37:30.05                  from /opt/FirefoxSource/mozilla-release/js/src/gc/Iteration.cpp:7:
37:30.05 ../../dist/include/js/HeapAPI.h: In function 'void js::IterateGrayObjects(JS::Zone*, js::GCThingCallback, void*)':
37:30.05 Warning: -Wmaybe-uninitialized in /opt/FirefoxSource/mozilla-release/objdir-droid/dist/include/js/HeapAPI.h: '*((void*)(& i)+12).js::gc::ArenaCellIterImpl::thing' may be used uninitialized in this function
37:30.05 ../../dist/include/js/HeapAPI.h:217:31: warning: '*((void*)(& i)+12).js::gc::ArenaCellIterImpl::thing' may be used uninitialized in this function [-Wmaybe-uninitialized]
37:30.05 /opt/FirefoxSource/mozilla-release/js/src/gc/Iteration.cpp:120:34: note: '*((void*)(& i)+12).js::gc::ArenaCellIterImpl::thing' was declared here
37:30.05 In file included from /opt/FirefoxSource/mozilla-release/js/src/gc/Barrier.h:12:0,
37:30.05                  from /opt/FirefoxSource/mozilla-release/js/src/jsatom.h:14,
37:30.05                  from /opt/FirefoxSource/mozilla-release/js/src/vm/Runtime.h:21,
37:30.05                  from /opt/FirefoxSource/mozilla-release/js/src/jscntxt.h:15,
37:30.06                  from /opt/FirefoxSource/mozilla-release/js/src/vm/RegExpObject.h:13,
37:30.06                  from /opt/FirefoxSource/mozilla-release/js/src/builtin/RegExp.h:10,
37:30.06                  from /opt/FirefoxSource/mozilla-release/js/src/jscompartment.h:12,
37:30.06                  from /opt/FirefoxSource/mozilla-release/js/src/gc/Iteration.cpp:7:
37:30.06 Warning: -Wmaybe-uninitialized in /opt/FirefoxSource/mozilla-release/js/src/gc/Heap.h: '*((void*)(& i)+12).js::gc::ArenaCellIterImpl::span.js::gc::FreeSpan::last' may be used uninitialized in this function
37:30.06 /opt/FirefoxSource/mozilla-release/js/src/gc/Heap.h:208:49: warning: '*((void*)(& i)+12).js::gc::ArenaCellIterImpl::span.js::gc::FreeSpan::last' may be used uninitialized in this function [-Wmaybe-uninitialized]
37:30.06 /opt/FirefoxSource/mozilla-release/js/src/gc/Iteration.cpp:120:34: note: '*((void*)(& i)+12).js::gc::ArenaCellIterImpl::span.js::gc::FreeSpan::last' was declared here
37:30.06 In file included from /opt/FirefoxSource/mozilla-release/js/src/gc/Iteration.cpp:15:0:
37:30.06 Warning: -Wmaybe-uninitialized in /opt/FirefoxSource/mozilla-release/js/src/jsgcinlines.h: '*((void*)(& i)+12).js::gc::ArenaCellIterImpl::span.js::gc::FreeSpan::first' may be used uninitialized in this function
37:30.06 /opt/FirefoxSource/mozilla-release/js/src/jsgcinlines.h:188:9: warning: '*((void*)(& i)+12).js::gc::ArenaCellIterImpl::span.js::gc::FreeSpan::first' may be used uninitialized in this function [-Wmaybe-uninitialized]
37:30.06 /opt/FirefoxSource/mozilla-release/js/src/gc/Iteration.cpp:120:34: note: '*((void*)(& i)+12).js::gc::ArenaCellIterImpl::span.js::gc::FreeSpan::first' was declared here
37:30.06 RootMarking.o
37:30.09 Statistics.o
37:30.58 /opt/FirefoxSource/mozilla-release/js/src/frontend/TokenStream.cpp: In member function 'bool js::frontend::TokenStream::getStringOrTemplateToken(int, js::frontend::Token**)':
37:30.58 Warning: -Wmaybe-uninitialized in /opt/FirefoxSource/mozilla-release/js/src/frontend/TokenStream.cpp: '*((void*)& cp +6)' may be used uninitialized in this function
37:30.58 /opt/FirefoxSource/mozilla-release/js/src/frontend/TokenStream.cpp:1707:125: warning: '*((void*)& cp +6)' may be used uninitialized in this function [-Wmaybe-uninitialized]
37:30.58 Warning: -Wmaybe-uninitialized in /opt/FirefoxSource/mozilla-release/js/src/frontend/TokenStream.cpp: '*((void*)& cp +4)' may be used uninitialized in this function
37:30.58 /opt/FirefoxSource/mozilla-release/js/src/frontend/TokenStream.cpp:1707:125: warning: '*((void*)& cp +4)' may be used uninitialized in this function [-Wmaybe-uninitialized]
37:30.58 Warning: -Wmaybe-uninitialized in /opt/FirefoxSource/mozilla-release/js/src/frontend/TokenStream.cpp: '*((void*)& cp +2)' may be used uninitialized in this function
37:30.58 /opt/FirefoxSource/mozilla-release/js/src/frontend/TokenStream.cpp:1707:125: warning: '*((void*)& cp +2)' may be used uninitialized in this function [-Wmaybe-uninitialized]
37:30.60 StoreBuffer.o
37:31.46 Tracer.o
37:31.50 Verifier.o
37:33.87 Zone.o
37:34.59 NativeRegExpMacroAssembler.o
37:35.76 RegExpAST.o
37:35.96 In file included from /opt/FirefoxSource/mozilla-release/js/src/gc/RootMarking.cpp:30:0:
37:35.96 /opt/FirefoxSource/mozilla-release/js/src/jsgcinlines.h: In member function 'void js::gc::GCRuntime::markRuntime(JSTracer*, js::gc::GCRuntime::TraceOrMarkRuntime, js::gc::GCRuntime::TraceRootsOrUsedSaved)':
37:35.96 Warning: -Wmaybe-uninitialized in /opt/FirefoxSource/mozilla-release/js/src/jsgcinlines.h: '*((void*)(& i)+12).js::gc::ArenaCellIterImpl::thing' may be used uninitialized in this function
37:35.96 /opt/FirefoxSource/mozilla-release/js/src/jsgcinlines.h:237:46: warning: '*((void*)(& i)+12).js::gc::ArenaCellIterImpl::thing' may be used uninitialized in this function [-Wmaybe-uninitialized]
37:35.96 /opt/FirefoxSource/mozilla-release/js/src/gc/RootMarking.cpp:779:38: note: '*((void*)(& i)+12).js::gc::ArenaCellIterImpl::thing' was declared here
37:35.96 In file included from /opt/FirefoxSource/mozilla-release/js/src/gc/Barrier.h:12:0,
37:35.96                  from /opt/FirefoxSource/mozilla-release/js/src/jsatom.h:14,
37:35.96                  from /opt/FirefoxSource/mozilla-release/js/src/vm/Runtime.h:21,
37:35.96                  from /opt/FirefoxSource/mozilla-release/js/src/jscntxt.h:15,
37:35.96                  from /opt/FirefoxSource/mozilla-release/js/src/gc/RootMarking.cpp:13:
37:35.96 Warning: -Wmaybe-uninitialized in /opt/FirefoxSource/mozilla-release/js/src/gc/Heap.h: '*((void*)(& i)+12).js::gc::ArenaCellIterImpl::span.js::gc::FreeSpan::last' may be used uninitialized in this function
37:35.96 /opt/FirefoxSource/mozilla-release/js/src/gc/Heap.h:208:49: warning: '*((void*)(& i)+12).js::gc::ArenaCellIterImpl::span.js::gc::FreeSpan::last' may be used uninitialized in this function [-Wmaybe-uninitialized]
37:35.96 /opt/FirefoxSource/mozilla-release/js/src/gc/RootMarking.cpp:779:38: note: '*((void*)(& i)+12).js::gc::ArenaCellIterImpl::span.js::gc::FreeSpan::last' was declared here
37:35.96 In file included from /opt/FirefoxSource/mozilla-release/js/src/gc/RootMarking.cpp:30:0:
37:35.96 Warning: -Wmaybe-uninitialized in /opt/FirefoxSource/mozilla-release/js/src/jsgcinlines.h: '*((void*)(& i)+12).js::gc::ArenaCellIterImpl::span.js::gc::FreeSpan::first' may be used uninitialized in this function
37:35.96 /opt/FirefoxSource/mozilla-release/js/src/jsgcinlines.h:188:9: warning: '*((void*)(& i)+12).js::gc::ArenaCellIterImpl::span.js::gc::FreeSpan::first' may be used uninitialized in this function [-Wmaybe-uninitialized]
37:35.96 /opt/FirefoxSource/mozilla-release/js/src/gc/RootMarking.cpp:779:38: note: '*((void*)(& i)+12).js::gc::ArenaCellIterImpl::span.js::gc::FreeSpan::first' was declared here
37:35.96 /opt/FirefoxSource/mozilla-release/js/src/gc/RootMarking.cpp: At global scope:
37:35.96 Warning: -Wunused-function in /opt/FirefoxSource/mozilla-release/js/src/gc/RootMarking.cpp: 'void MarkExactStackRoots(js::ThreadSafeContext*, JSTracer*)' defined but not used
37:35.96 /opt/FirefoxSource/mozilla-release/js/src/gc/RootMarking.cpp:126:1: warning: 'void MarkExactStackRoots(js::ThreadSafeContext*, JSTracer*)' defined but not used [-Wunused-function]
37:35.96 RegExpEngine.o
37:37.44 In file included from /opt/FirefoxSource/mozilla-release/js/src/gc/Zone.cpp:17:0:
37:37.44 /opt/FirefoxSource/mozilla-release/js/src/jsgcinlines.h: In member function 'void JS::Zone::sweepBreakpoints(js::FreeOp*)':
37:37.44 Warning: -Wmaybe-uninitialized in /opt/FirefoxSource/mozilla-release/js/src/jsgcinlines.h: '*((void*)(& i)+12).js::gc::ArenaCellIterImpl::thing' may be used uninitialized in this function
37:37.44 /opt/FirefoxSource/mozilla-release/js/src/jsgcinlines.h:237:46: warning: '*((void*)(& i)+12).js::gc::ArenaCellIterImpl::thing' may be used uninitialized in this function [-Wmaybe-uninitialized]
37:37.44 /opt/FirefoxSource/mozilla-release/js/src/gc/Zone.cpp:142:30: note: '*((void*)(& i)+12).js::gc::ArenaCellIterImpl::thing' was declared here
37:37.44 In file included from /opt/FirefoxSource/mozilla-release/js/src/gc/Barrier.h:12:0,
37:37.44                  from /opt/FirefoxSource/mozilla-release/js/src/jsatom.h:14,
37:37.44                  from /opt/FirefoxSource/mozilla-release/js/src/vm/Runtime.h:21,
37:37.44                  from /opt/FirefoxSource/mozilla-release/js/src/jscntxt.h:15,
37:37.44                  from /opt/FirefoxSource/mozilla-release/js/src/gc/Zone.h:14,
37:37.44                  from /opt/FirefoxSource/mozilla-release/js/src/gc/Zone.cpp:7:
37:37.44 Warning: -Wmaybe-uninitialized in /opt/FirefoxSource/mozilla-release/js/src/gc/Heap.h: '*((void*)(& i)+12).js::gc::ArenaCellIterImpl::span.js::gc::FreeSpan::last' may be used uninitialized in this function
37:37.44 /opt/FirefoxSource/mozilla-release/js/src/gc/Heap.h:208:49: warning: '*((void*)(& i)+12).js::gc::ArenaCellIterImpl::span.js::gc::FreeSpan::last' may be used uninitialized in this function [-Wmaybe-uninitialized]
37:37.44 /opt/FirefoxSource/mozilla-release/js/src/gc/Zone.cpp:142:30: note: '*((void*)(& i)+12).js::gc::ArenaCellIterImpl::span.js::gc::FreeSpan::last' was declared here
37:37.44 In file included from /opt/FirefoxSource/mozilla-release/js/src/gc/Zone.cpp:17:0:
37:37.44 Warning: -Wmaybe-uninitialized in /opt/FirefoxSource/mozilla-release/js/src/jsgcinlines.h: '*((void*)(& i)+12).js::gc::ArenaCellIterImpl::span.js::gc::FreeSpan::first' may be used uninitialized in this function
37:37.44 /opt/FirefoxSource/mozilla-release/js/src/jsgcinlines.h:188:9: warning: '*((void*)(& i)+12).js::gc::ArenaCellIterImpl::span.js::gc::FreeSpan::first' may be used uninitialized in this function [-Wmaybe-uninitialized]
37:37.44 /opt/FirefoxSource/mozilla-release/js/src/gc/Zone.cpp:142:30: note: '*((void*)(& i)+12).js::gc::ArenaCellIterImpl::span.js::gc::FreeSpan::first' was declared here
37:37.44 In file included from /opt/FirefoxSource/mozilla-release/js/src/gc/Zone.cpp:17:0:
37:37.44 /opt/FirefoxSource/mozilla-release/js/src/jsgcinlines.h: In member function 'void JS::Zone::discardJitCode(js::FreeOp*)':
37:37.44 Warning: -Wmaybe-uninitialized in /opt/FirefoxSource/mozilla-release/js/src/jsgcinlines.h: '*((void*)(& i)+12).js::gc::ArenaCellIterImpl::thing' may be used uninitialized in this function
37:37.44 /opt/FirefoxSource/mozilla-release/js/src/jsgcinlines.h:247:27: warning: '*((void*)(& i)+12).js::gc::ArenaCellIterImpl::thing' may be used uninitialized in this function [-Wmaybe-uninitialized]
37:37.44 /opt/FirefoxSource/mozilla-release/js/src/gc/Zone.cpp:194:34: note: '*((void*)(& i)+12).js::gc::ArenaCellIterImpl::thing' was declared here
37:37.44 In file included from /opt/FirefoxSource/mozilla-release/js/src/gc/Barrier.h:12:0,
37:37.44                  from /opt/FirefoxSource/mozilla-release/js/src/jsatom.h:14,
37:37.44                  from /opt/FirefoxSource/mozilla-release/js/src/vm/Runtime.h:21,
37:37.44                  from /opt/FirefoxSource/mozilla-release/js/src/jscntxt.h:15,
37:37.44                  from /opt/FirefoxSource/mozilla-release/js/src/gc/Zone.h:14,
37:37.44                  from /opt/FirefoxSource/mozilla-release/js/src/gc/Zone.cpp:7:
37:37.44 Warning: -Wmaybe-uninitialized in /opt/FirefoxSource/mozilla-release/js/src/gc/Heap.h: '*((void*)(& i)+12).js::gc::ArenaCellIterImpl::span.js::gc::FreeSpan::last' may be used uninitialized in this function
37:37.44 /opt/FirefoxSource/mozilla-release/js/src/gc/Heap.h:208:49: warning: '*((void*)(& i)+12).js::gc::ArenaCellIterImpl::span.js::gc::FreeSpan::last' may be used uninitialized in this function [-Wmaybe-uninitialized]
37:37.44 /opt/FirefoxSource/mozilla-release/js/src/gc/Zone.cpp:194:34: note: '*((void*)(& i)+12).js::gc::ArenaCellIterImpl::span.js::gc::FreeSpan::last' was declared here
37:37.44 In file included from /opt/FirefoxSource/mozilla-release/js/src/gc/Zone.cpp:17:0:
37:37.44 Warning: -Wmaybe-uninitialized in /opt/FirefoxSource/mozilla-release/js/src/jsgcinlines.h: '*((void*)(& i)+12).js::gc::ArenaCellIterImpl::span.js::gc::FreeSpan::first' may be used uninitialized in this function
37:37.44 /opt/FirefoxSource/mozilla-release/js/src/jsgcinlines.h:188:9: warning: '*((void*)(& i)+12).js::gc::ArenaCellIterImpl::span.js::gc::FreeSpan::first' may be used uninitialized in this function [-Wmaybe-uninitialized]
37:37.44 /opt/FirefoxSource/mozilla-release/js/src/gc/Zone.cpp:194:34: note: '*((void*)(& i)+12).js::gc::ArenaCellIterImpl::span.js::gc::FreeSpan::first' was declared here
37:37.50 RegExpInterpreter.o
37:38.25 Warning: -Wunused-function in /opt/FirefoxSource/mozilla-release/js/src/gc/Marking.cpp: 'void AssertNonGrayGCThing(JSTracer*, void**, JSGCTraceKind)' defined but not used
37:38.25 /opt/FirefoxSource/mozilla-release/js/src/gc/Marking.cpp:1877:1: warning: 'void AssertNonGrayGCThing(JSTracer*, void**, JSGCTraceKind)' defined but not used [-Wunused-function]
37:38.26 RegExpMacroAssembler.o
37:38.33 RegExpParser.o
37:39.91 RegExpStack.o
37:41.08 AliasAnalysis.o
37:41.50 BacktrackingAllocator.o
37:42.49 Bailouts.o
37:44.39 /opt/FirefoxSource/mozilla-release/js/src/irregexp/RegExpParser.cpp: In instantiation of 'void js::irregexp::RegExpParser<CharT>::ScanForCaptures() [with CharT = unsigned char]':
37:44.39 /opt/FirefoxSource/mozilla-release/js/src/irregexp/RegExpParser.cpp:999:26:   required from here
37:44.39 Warning: -Wsign-compare in /opt/FirefoxSource/mozilla-release/js/src/irregexp/RegExpParser.cpp: comparison between signed and unsigned integer expressions
37:44.39 /opt/FirefoxSource/mozilla-release/js/src/irregexp/RegExpParser.cpp:522:13: warning: comparison between signed and unsigned integer expressions [-Wsign-compare]
37:44.39 /opt/FirefoxSource/mozilla-release/js/src/irregexp/RegExpParser.cpp: In instantiation of 'void js::irregexp::RegExpParser<CharT>::ScanForCaptures() [with CharT = char16_t]':
37:44.39 /opt/FirefoxSource/mozilla-release/js/src/irregexp/RegExpParser.cpp:1000:26:   required from here
37:44.39 Warning: -Wsign-compare in /opt/FirefoxSource/mozilla-release/js/src/irregexp/RegExpParser.cpp: comparison between signed and unsigned integer expressions
37:44.39 /opt/FirefoxSource/mozilla-release/js/src/irregexp/RegExpParser.cpp:522:13: warning: comparison between signed and unsigned integer expressions [-Wsign-compare]
37:44.40 BaselineBailouts.o
37:45.08 /opt/FirefoxSource/mozilla-release/js/src/irregexp/RegExpEngine.cpp: In member function 'virtual bool js::irregexp::TextNode::FillInBMInfo(int, int, js::irregexp::BoyerMooreLookahead*, bool)':
37:45.09 Warning: -Wsign-compare in /opt/FirefoxSource/mozilla-release/js/src/irregexp/RegExpEngine.cpp: comparison between signed and unsigned integer expressions
37:45.09 /opt/FirefoxSource/mozilla-release/js/src/irregexp/RegExpEngine.cpp:4598:78: warning: comparison between signed and unsigned integer expressions [-Wsign-compare]
37:45.09 BaselineCompiler.o
37:46.07 BaselineDebugModeOSR.o
37:48.87 BaselineFrame.o
37:51.20 BaselineFrameInfo.o
37:52.61 BaselineIC.o
37:55.12 BaselineInspector.o
37:56.50 /opt/FirefoxSource/mozilla-release/js/src/jit/BaselineDebugModeOSR.cpp: In function 'void PatchBaselineFramesForDebugMode(JSContext*, const js::jit::JitActivationIterator&, DebugModeOSREntryVector&, size_t*)':
37:56.50 Warning: -Wunused-variable in /opt/FirefoxSource/mozilla-release/js/src/jit/BaselineDebugModeOSR.cpp: unused variable 'info'
37:56.50 /opt/FirefoxSource/mozilla-release/js/src/jit/BaselineDebugModeOSR.cpp:359:43: warning: unused variable 'info' [-Wunused-variable]
37:56.50 Warning: -Wunused-variable in /opt/FirefoxSource/mozilla-release/js/src/jit/BaselineDebugModeOSR.cpp: unused variable 'expectedDebugMode'
37:56.50 /opt/FirefoxSource/mozilla-release/js/src/jit/BaselineDebugModeOSR.cpp:313:10: warning: unused variable 'expectedDebugMode' [-Wunused-variable]
37:56.50 BaselineJIT.o
37:57.06 BitSet.o
37:57.49 BytecodeAnalysis.o
37:59.46 C1Spewer.o
38:01.30 CodeGenerator.o
38:01.33 CompileWrappers.o
38:01.52 EdgeCaseAnalysis.o
38:03.32 EffectiveAddressAnalysis.o
38:04.45 ExecutableAllocator.o
38:07.40 Ion.o
38:07.77 IonAnalysis.o
38:08.51 IonBuilder.o
38:15.89 IonCaches.o
38:18.43 In file included from /opt/FirefoxSource/mozilla-release/js/src/jit/Ion.cpp:50:0:
38:18.43 /opt/FirefoxSource/mozilla-release/js/src/jsgcinlines.h: In static member function 'static void js::jit::JitRuntime::Mark(JSTracer*)':
38:18.43 Warning: -Wmaybe-uninitialized in /opt/FirefoxSource/mozilla-release/js/src/jsgcinlines.h: '*((void*)(& i)+12).js::gc::ArenaCellIterImpl::thing' may be used uninitialized in this function
38:18.43 /opt/FirefoxSource/mozilla-release/js/src/jsgcinlines.h:247:27: warning: '*((void*)(& i)+12).js::gc::ArenaCellIterImpl::thing' may be used uninitialized in this function [-Wmaybe-uninitialized]
38:18.43 /opt/FirefoxSource/mozilla-release/js/src/jit/Ion.cpp:609:34: note: '*((void*)(& i)+12).js::gc::ArenaCellIterImpl::thing' was declared here
38:18.43 In file included from /opt/FirefoxSource/mozilla-release/js/src/gc/Barrier.h:12:0,
38:18.43                  from /opt/FirefoxSource/mozilla-release/js/src/jsatom.h:14,
38:18.43                  from /opt/FirefoxSource/mozilla-release/js/src/vm/Runtime.h:21,
38:18.43                  from /opt/FirefoxSource/mozilla-release/js/src/jscntxt.h:15,
38:18.43                  from /opt/FirefoxSource/mozilla-release/js/src/jit/Ion.h:12,
38:18.43                  from /opt/FirefoxSource/mozilla-release/js/src/jit/Ion.cpp:7:
38:18.43 Warning: -Wmaybe-uninitialized in /opt/FirefoxSource/mozilla-release/js/src/gc/Heap.h: '*((void*)(& i)+12).js::gc::ArenaCellIterImpl::span.js::gc::FreeSpan::last' may be used uninitialized in this function
38:18.43 /opt/FirefoxSource/mozilla-release/js/src/gc/Heap.h:208:49: warning: '*((void*)(& i)+12).js::gc::ArenaCellIterImpl::span.js::gc::FreeSpan::last' may be used uninitialized in this function [-Wmaybe-uninitialized]
38:18.43 /opt/FirefoxSource/mozilla-release/js/src/jit/Ion.cpp:609:34: note: '*((void*)(& i)+12).js::gc::ArenaCellIterImpl::span.js::gc::FreeSpan::last' was declared here
38:18.43 In file included from /opt/FirefoxSource/mozilla-release/js/src/jit/Ion.cpp:50:0:
38:18.43 Warning: -Wmaybe-uninitialized in /opt/FirefoxSource/mozilla-release/js/src/jsgcinlines.h: '*((void*)(& i)+12).js::gc::ArenaCellIterImpl::span.js::gc::FreeSpan::first' may be used uninitialized in this function
38:18.43 /opt/FirefoxSource/mozilla-release/js/src/jsgcinlines.h:188:9: warning: '*((void*)(& i)+12).js::gc::ArenaCellIterImpl::span.js::gc::FreeSpan::first' may be used uninitialized in this function [-Wmaybe-uninitialized]
38:18.43 /opt/FirefoxSource/mozilla-release/js/src/jit/Ion.cpp:609:34: note: '*((void*)(& i)+12).js::gc::ArenaCellIterImpl::span.js::gc::FreeSpan::first' was declared here
38:18.43 IonFrames.o
38:18.57 IonMacroAssembler.o
38:20.78 IonOptimizationLevels.o
38:26.50 IonSpewer.o
38:28.28 JSONSpewer.o
38:28.31 JitOptions.o
38:29.84 JitcodeMap.o
38:30.31 LICM.o
38:30.84 LIR.o
38:34.07 LinearScan.o
38:34.56 LiveRangeAllocator.o
38:34.89 LoopUnroller.o
38:36.53 /opt/FirefoxSource/mozilla-release/js/src/jit/JitcodeMap.cpp: In static member function 'static void js::jit::JitcodeRegionEntry::ReadDelta(js::jit::CompactBufferReader&, uint32_t*, int32_t*)':
38:36.53 Warning: -Wsign-compare in /opt/FirefoxSource/mozilla-release/js/src/jit/JitcodeMap.cpp: comparison between signed and unsigned integer expressions
38:36.53 /opt/FirefoxSource/mozilla-release/js/src/jit/JitcodeMap.cpp:293:24: warning: comparison between signed and unsigned integer expressions [-Wsign-compare]
38:36.53 Warning: -Wsign-compare in /opt/FirefoxSource/mozilla-release/js/src/jit/JitcodeMap.cpp: comparison between signed and unsigned integer expressions
38:36.53 /opt/FirefoxSource/mozilla-release/js/src/jit/JitcodeMap.cpp:309:20: warning: comparison between signed and unsigned integer expressions [-Wsign-compare]
38:36.59 Lowering.o
38:40.36 MCallOptimize.o
38:41.47 MIR.o
38:42.49 MIRGraph.o
38:42.65 Warning: -Wunused-function in /opt/FirefoxSource/mozilla-release/js/src/jit/LiveRangeAllocator.cpp: 'bool IsHintInteresting(const js::jit::Requirement&, const js::jit::Requirement&)' defined but not used
38:42.65 /opt/FirefoxSource/mozilla-release/js/src/jit/LiveRangeAllocator.cpp:1031:1: warning: 'bool IsHintInteresting(const js::jit::Requirement&, const js::jit::Requirement&)' defined but not used [-Wunused-function]
38:42.66 MoveResolver.o
38:47.88 ParallelFunctions.o
38:49.98 ParallelSafetyAnalysis.o
38:50.36 PerfSpewer.o
38:52.03 RangeAnalysis.o
38:52.08 Recover.o
38:54.86 RegisterAllocator.o
38:55.92 RematerializedFrame.o
38:57.66 Safepoints.o
38:59.78 ScalarReplacement.o
39:00.92 Snapshots.o
39:02.80 StupidAllocator.o
39:03.29 TypePolicy.o
39:05.52 TypedObjectPrediction.o
39:06.20 /opt/FirefoxSource/mozilla-release/js/src/jit/ScalarReplacement.cpp: In member function 'virtual bool js::jit::ArrayMemoryView::visitLoadElement(js::jit::MLoadElement*)':
39:06.20 Warning: -Wmaybe-uninitialized in /opt/FirefoxSource/mozilla-release/js/src/jit/ScalarReplacement.cpp: 'index' may be used uninitialized in this function
39:06.20 /opt/FirefoxSource/mozilla-release/js/src/jit/ScalarReplacement.cpp:876:54: warning: 'index' may be used uninitialized in this function [-Wmaybe-uninitialized]
39:06.20 UnreachableCodeElimination.o
39:07.36 VMFunctions.o
39:08.23 ValueNumbering.o
39:09.38 Architecture-arm.o
39:11.62 Assembler-arm.o
39:11.87 Bailouts-arm.o
39:13.85 BaselineCompiler-arm.o
39:14.23 BaselineIC-arm.o
39:16.02 CodeGenerator-arm.o
39:16.26 Lowering-arm.o
39:17.29 MacroAssembler-arm.o
39:18.00 /opt/FirefoxSource/mozilla-release/js/src/jit/arm/Assembler-arm.cpp: In static member function 'static void js::jit::Assembler::UpdateBoundsCheck(uint32_t, js::jit::Instruction*)':
39:18.01 Warning: -Wunused-but-set-variable in /opt/FirefoxSource/mozilla-release/js/src/jit/arm/Assembler-arm.cpp: variable 'op' set but not used
39:18.01 /opt/FirefoxSource/mozilla-release/js/src/jit/arm/Assembler-arm.cpp:2766:14: warning: variable 'op' set but not used [-Wunused-but-set-variable]
39:18.01 In file included from /opt/FirefoxSource/mozilla-release/js/src/jit/arm/Assembler-arm.cpp:7:0:
39:18.01 /opt/FirefoxSource/mozilla-release/js/src/jit/arm/Assembler-arm.h: In function 'void js::jit::PatchJump(js::jit::CodeLocationJump&, js::jit::CodeLocationLabel)':
39:18.01 Warning: -Wmaybe-uninitialized in /opt/FirefoxSource/mozilla-release/js/src/jit/arm/Assembler-arm.h: 'c' may be used uninitialized in this function
39:18.01 /opt/FirefoxSource/mozilla-release/js/src/jit/arm/Assembler-arm.h:1771:85: warning: 'c' may be used uninitialized in this function [-Wmaybe-uninitialized]
39:18.01 /opt/FirefoxSource/mozilla-release/js/src/jit/arm/Assembler-arm.cpp:539:26: note: 'c' was declared here
39:18.01 In file included from /opt/FirefoxSource/mozilla-release/js/src/jit/arm/Assembler-arm.cpp:7:0:
39:18.01 /opt/FirefoxSource/mozilla-release/js/src/jit/arm/Assembler-arm.h: In member function 'void js::jit::Assembler::executableCopy(uint8_t*)':
39:18.01 Warning: -Wmaybe-uninitialized in /opt/FirefoxSource/mozilla-release/js/src/jit/arm/Assembler-arm.h: 'c' may be used uninitialized in this function
39:18.01 /opt/FirefoxSource/mozilla-release/js/src/jit/arm/Assembler-arm.h:1771:85: warning: 'c' may be used uninitialized in this function [-Wmaybe-uninitialized]
39:18.01 /opt/FirefoxSource/mozilla-release/js/src/jit/arm/Assembler-arm.cpp:2387:26: note: 'c' was declared here
39:18.01 In file included from /opt/FirefoxSource/mozilla-release/js/src/jit/arm/Assembler-arm.cpp:7:0:
39:18.01 /opt/FirefoxSource/mozilla-release/js/src/jit/arm/Assembler-arm.h: In member function 'void js::jit::Assembler::bind(js::jit::Label*, js::jit::BufferOffset)':
39:18.01 Warning: -Wmaybe-uninitialized in /opt/FirefoxSource/mozilla-release/js/src/jit/arm/Assembler-arm.h: 'c' may be used uninitialized in this function
39:18.01 /opt/FirefoxSource/mozilla-release/js/src/jit/arm/Assembler-arm.h:1771:85: warning: 'c' may be used uninitialized in this function [-Wmaybe-uninitialized]
39:18.01 /opt/FirefoxSource/mozilla-release/js/src/jit/arm/Assembler-arm.cpp:2253:23: note: 'c' was declared here
39:18.01 In file included from /opt/FirefoxSource/mozilla-release/js/src/jit/arm/Assembler-arm.cpp:7:0:
39:18.01 /opt/FirefoxSource/mozilla-release/js/src/jit/arm/Assembler-arm.h: In member function 'void js::jit::Assembler::bind(js::jit::RepatchLabel*)':
39:18.01 Warning: -Wmaybe-uninitialized in /opt/FirefoxSource/mozilla-release/js/src/jit/arm/Assembler-arm.h: 'cond' may be used uninitialized in this function
39:18.01 /opt/FirefoxSource/mozilla-release/js/src/jit/arm/Assembler-arm.h:1771:85: warning: 'cond' may be used uninitialized in this function [-Wmaybe-uninitialized]
39:18.01 /opt/FirefoxSource/mozilla-release/js/src/jit/arm/Assembler-arm.cpp:2280:19: note: 'cond' was declared here
39:18.01 In file included from /opt/FirefoxSource/mozilla-release/js/src/jit/arm/Assembler-arm.cpp:7:0:
39:18.01 /opt/FirefoxSource/mozilla-release/js/src/jit/arm/Assembler-arm.h: In static member function 'static void js::jit::Assembler::RetargetNearBranch(js::jit::Instruction*, int, bool)':
39:18.01 Warning: -Wmaybe-uninitialized in /opt/FirefoxSource/mozilla-release/js/src/jit/arm/Assembler-arm.h: 'c' may be used uninitialized in this function
39:18.01 /opt/FirefoxSource/mozilla-release/js/src/jit/arm/Assembler-arm.h:1771:85: warning: 'c' may be used uninitialized in this function [-Wmaybe-uninitialized]
39:18.01 /opt/FirefoxSource/mozilla-release/js/src/jit/arm/Assembler-arm.cpp:2387:26: note: 'c' was declared here
39:18.01 /opt/FirefoxSource/mozilla-release/js/src/jit/arm/Assembler-arm.cpp: In member function 'js::jit::Instruction* js::jit::Instruction::skipPool()':
39:18.01 Warning: -Wmaybe-uninitialized in /opt/FirefoxSource/mozilla-release/js/src/jit/arm/Assembler-arm.cpp: 'c' may be used uninitialized in this function
39:18.01 /opt/FirefoxSource/mozilla-release/js/src/jit/arm/Assembler-arm.cpp:2579:5: warning: 'c' may be used uninitialized in this function [-Wmaybe-uninitialized]
39:18.01 /opt/FirefoxSource/mozilla-release/js/src/jit/arm/Assembler-arm.cpp:2577:26: note: 'c' was declared here
39:18.02 Warning: -Wmaybe-uninitialized in /opt/FirefoxSource/mozilla-release/js/src/jit/arm/Assembler-arm.cpp: 'c' may be used uninitialized in this function
39:18.02 /opt/FirefoxSource/mozilla-release/js/src/jit/arm/Assembler-arm.cpp:2561:5: warning: 'c' may be used uninitialized in this function [-Wmaybe-uninitialized]
39:18.02 /opt/FirefoxSource/mozilla-release/js/src/jit/arm/Assembler-arm.cpp:2559:26: note: 'c' was declared here
39:18.02 /opt/FirefoxSource/mozilla-release/js/src/jit/arm/Assembler-arm.cpp: In member function 'js::jit::Instruction* js::jit::Instruction::next()':
39:18.02 Warning: -Wmaybe-uninitialized in /opt/FirefoxSource/mozilla-release/js/src/jit/arm/Assembler-arm.cpp: 'c' may be used uninitialized in this function
39:18.02 /opt/FirefoxSource/mozilla-release/js/src/jit/arm/Assembler-arm.cpp:2561:5: warning: 'c' may be used uninitialized in this function [-Wmaybe-uninitialized]
39:18.02 /opt/FirefoxSource/mozilla-release/js/src/jit/arm/Assembler-arm.cpp:2559:26: note: 'c' was declared here
39:18.02 Warning: -Wmaybe-uninitialized in /opt/FirefoxSource/mozilla-release/js/src/jit/arm/Assembler-arm.cpp: 'c' may be used uninitialized in this function
39:18.02 /opt/FirefoxSource/mozilla-release/js/src/jit/arm/Assembler-arm.cpp:2561:5: warning: 'c' may be used uninitialized in this function [-Wmaybe-uninitialized]
39:18.02 /opt/FirefoxSource/mozilla-release/js/src/jit/arm/Assembler-arm.cpp:2559:26: note: 'c' was declared here
39:18.02 In file included from /opt/FirefoxSource/mozilla-release/js/src/jit/arm/Assembler-arm.cpp:7:0:
39:18.02 /opt/FirefoxSource/mozilla-release/js/src/jit/arm/Assembler-arm.h: In member function 'void js::jit::Assembler::retarget(js::jit::Label*, js::jit::Label*)':
39:18.03 Warning: -Wmaybe-uninitialized in /opt/FirefoxSource/mozilla-release/js/src/jit/arm/Assembler-arm.h: 'c' may be used uninitialized in this function
39:18.03 /opt/FirefoxSource/mozilla-release/js/src/jit/arm/Assembler-arm.h:1771:85: warning: 'c' may be used uninitialized in this function [-Wmaybe-uninitialized]
39:18.03 /opt/FirefoxSource/mozilla-release/js/src/jit/arm/Assembler-arm.cpp:2309:23: note: 'c' was declared here
39:18.03 MoveEmitter-arm.o
39:19.23 Trampoline-arm.o
39:21.93 BaselineCompiler-shared.o
39:24.10 /opt/FirefoxSource/mozilla-release/js/src/jit/arm/CodeGenerator-arm.cpp: In member function 'virtual bool js::jit::CodeGeneratorARM::visitAsmJSStoreGlobalVar(js::jit::LAsmJSStoreGlobalVar*)':
39:24.10 Warning: -Wunused-variable in /opt/FirefoxSource/mozilla-release/js/src/jit/arm/CodeGenerator-arm.cpp: unused variable 'type'
39:24.10 /opt/FirefoxSource/mozilla-release/js/src/jit/arm/CodeGenerator-arm.cpp:2079:13: warning: unused variable 'type' [-Wunused-variable]
39:24.10 CodeGenerator-shared.o
39:24.10 Lowering-shared.o
39:24.55 /opt/FirefoxSource/mozilla-release/js/src/jit/arm/Lowering-arm.cpp: In member function 'virtual bool js::jit::LIRGeneratorARM::visitAsmJSLoadHeap(js::jit::MAsmJSLoadHeap*)':
39:24.55 Warning: -Wunused-variable in /opt/FirefoxSource/mozilla-release/js/src/jit/arm/Lowering-arm.cpp: unused variable 'ptrValue'
39:24.55 /opt/FirefoxSource/mozilla-release/js/src/jit/arm/Lowering-arm.cpp:490:17: warning: unused variable 'ptrValue' [-Wunused-variable]
39:24.55 jsalloc.o
39:27.41 jsapi.o
39:28.20 jsbool.o
39:28.88 jscntxt.o
39:30.03 jscompartment.o
39:31.59 jscrashreport.o
39:33.71 jsdate.o
39:34.12 jsdtoa.o
39:36.75 jsexn.o
39:37.50 jsfriendapi.o
39:38.50 jsfun.o
39:38.70 jsgc.o
39:42.48 jsinfer.o
39:42.67 jsiter.o
39:43.72 jsnativestack.o
39:45.60 In file included from /opt/FirefoxSource/mozilla-release/js/src/vm/Stack.h:16:0,
39:45.60                  from /opt/FirefoxSource/mozilla-release/js/src/vm/Runtime.h:42,
39:45.60                  from /opt/FirefoxSource/mozilla-release/js/src/jscntxt.h:15,
39:45.60                  from /opt/FirefoxSource/mozilla-release/js/src/vm/ScopeObject.h:10,
39:45.60                  from /opt/FirefoxSource/mozilla-release/js/src/jsfuninlines.h:12,
39:45.60                  from /opt/FirefoxSource/mozilla-release/js/src/jsfun.cpp:11:
39:45.60 /opt/FirefoxSource/mozilla-release/js/src/jit/JitFrameIterator.h: In member function 'void js::jit::JitFrameIterator::unaliasedForEachActual(Op, js::jit::ReadFrameArgsBehavior) const [with Op = js::CopyTo]':
39:45.60 Warning: -Wmaybe-uninitialized in /opt/FirefoxSource/mozilla-release/js/src/jit/JitFrameIterator.h: 'end' may be used uninitialized in this function
39:45.60 /opt/FirefoxSource/mozilla-release/js/src/jit/JitFrameIterator.h:234:10: warning: 'end' may be used uninitialized in this function [-Wmaybe-uninitialized]
39:45.60 Warning: -Wmaybe-uninitialized in /opt/FirefoxSource/mozilla-release/js/src/jit/JitFrameIterator.h: 'start' may be used uninitialized in this function
39:45.60 /opt/FirefoxSource/mozilla-release/js/src/jit/JitFrameIterator.h:234:10: warning: 'start' may be used uninitialized in this function [-Wmaybe-uninitialized]
39:45.67 jsnum.o
39:45.76 jsobj.o
39:50.52 json.o
39:51.79 jsonparser.o
39:52.23 In file included from /opt/FirefoxSource/mozilla-release/js/src/jsgc.cpp:184:0:
39:52.23 /opt/FirefoxSource/mozilla-release/js/src/jsgcinlines.h: In function 'void js::ReleaseAllJITCode(js::FreeOp*)':
39:52.23 Warning: -Wmaybe-uninitialized in /opt/FirefoxSource/mozilla-release/js/src/jsgcinlines.h: '*((void*)(& i)+12).js::gc::ArenaCellIterImpl::thing' may be used uninitialized in this function
39:52.23 /opt/FirefoxSource/mozilla-release/js/src/jsgcinlines.h:247:27: warning: '*((void*)(& i)+12).js::gc::ArenaCellIterImpl::thing' may be used uninitialized in this function [-Wmaybe-uninitialized]
39:52.23 /opt/FirefoxSource/mozilla-release/js/src/jsgc.cpp:6148:27: note: '*((void*)(& i)+12).js::gc::ArenaCellIterImpl::thing' was declared here
39:52.23 In file included from /opt/FirefoxSource/mozilla-release/js/src/gc/Barrier.h:12:0,
39:52.23                  from /opt/FirefoxSource/mozilla-release/js/src/jsobj.h:21,
39:52.23                  from /opt/FirefoxSource/mozilla-release/js/src/jsgc.h:18,
39:52.23                  from /opt/FirefoxSource/mozilla-release/js/src/jsgcinlines.h:10,
39:52.23                  from /opt/FirefoxSource/mozilla-release/js/src/jsgc.cpp:184:
39:52.23 Warning: -Wmaybe-uninitialized in /opt/FirefoxSource/mozilla-release/js/src/gc/Heap.h: '*((void*)(& i)+12).js::gc::ArenaCellIterImpl::span.js::gc::FreeSpan::last' may be used uninitialized in this function
39:52.23 /opt/FirefoxSource/mozilla-release/js/src/gc/Heap.h:208:49: warning: '*((void*)(& i)+12).js::gc::ArenaCellIterImpl::span.js::gc::FreeSpan::last' may be used uninitialized in this function [-Wmaybe-uninitialized]
39:52.23 /opt/FirefoxSource/mozilla-release/js/src/jsgc.cpp:6148:27: note: '*((void*)(& i)+12).js::gc::ArenaCellIterImpl::span.js::gc::FreeSpan::last' was declared here
39:52.23 In file included from /opt/FirefoxSource/mozilla-release/js/src/jsgc.cpp:184:0:
39:52.23 Warning: -Wmaybe-uninitialized in /opt/FirefoxSource/mozilla-release/js/src/jsgcinlines.h: '*((void*)(& i)+12).js::gc::ArenaCellIterImpl::span.js::gc::FreeSpan::first' may be used uninitialized in this function
39:52.23 /opt/FirefoxSource/mozilla-release/js/src/jsgcinlines.h:188:9: warning: '*((void*)(& i)+12).js::gc::ArenaCellIterImpl::span.js::gc::FreeSpan::first' may be used uninitialized in this function [-Wmaybe-uninitialized]
39:52.23 /opt/FirefoxSource/mozilla-release/js/src/jsgc.cpp:6148:27: note: '*((void*)(& i)+12).js::gc::ArenaCellIterImpl::span.js::gc::FreeSpan::first' was declared here
39:52.23 In file included from /opt/FirefoxSource/mozilla-release/js/src/jsgc.cpp:184:0:
39:52.23 /opt/FirefoxSource/mozilla-release/js/src/jsgcinlines.h: In function 'void js::PurgeJITCaches(JS::Zone*)':
39:52.23 Warning: -Wmaybe-uninitialized in /opt/FirefoxSource/mozilla-release/js/src/jsgcinlines.h: '*((void*)(& i)+12).js::gc::ArenaCellIterImpl::thing' may be used uninitialized in this function
39:52.23 /opt/FirefoxSource/mozilla-release/js/src/jsgcinlines.h:247:27: warning: '*((void*)(& i)+12).js::gc::ArenaCellIterImpl::thing' may be used uninitialized in this function [-Wmaybe-uninitialized]
39:52.23 /opt/FirefoxSource/mozilla-release/js/src/jsgc.cpp:6167:30: note: '*((void*)(& i)+12).js::gc::ArenaCellIterImpl::thing' was declared here
39:52.23 In file included from /opt/FirefoxSource/mozilla-release/js/src/gc/Barrier.h:12:0,
39:52.23                  from /opt/FirefoxSource/mozilla-release/js/src/jsobj.h:21,
39:52.23                  from /opt/FirefoxSource/mozilla-release/js/src/jsgc.h:18,
39:52.23                  from /opt/FirefoxSource/mozilla-release/js/src/jsgcinlines.h:10,
39:52.23                  from /opt/FirefoxSource/mozilla-release/js/src/jsgc.cpp:184:
39:52.23 Warning: -Wmaybe-uninitialized in /opt/FirefoxSource/mozilla-release/js/src/gc/Heap.h: '*((void*)(& i)+12).js::gc::ArenaCellIterImpl::span.js::gc::FreeSpan::last' may be used uninitialized in this function
39:52.23 /opt/FirefoxSource/mozilla-release/js/src/gc/Heap.h:208:49: warning: '*((void*)(& i)+12).js::gc::ArenaCellIterImpl::span.js::gc::FreeSpan::last' may be used uninitialized in this function [-Wmaybe-uninitialized]
39:52.23 /opt/FirefoxSource/mozilla-release/js/src/jsgc.cpp:6167:30: note: '*((void*)(& i)+12).js::gc::ArenaCellIterImpl::span.js::gc::FreeSpan::last' was declared here
39:52.23 In file included from /opt/FirefoxSource/mozilla-release/js/src/jsgc.cpp:184:0:
39:52.23 Warning: -Wmaybe-uninitialized in /opt/FirefoxSource/mozilla-release/js/src/jsgcinlines.h: '*((void*)(& i)+12).js::gc::ArenaCellIterImpl::span.js::gc::FreeSpan::first' may be used uninitialized in this function
39:52.23 /opt/FirefoxSource/mozilla-release/js/src/jsgcinlines.h:188:9: warning: '*((void*)(& i)+12).js::gc::ArenaCellIterImpl::span.js::gc::FreeSpan::first' may be used uninitialized in this function [-Wmaybe-uninitialized]
39:52.23 /opt/FirefoxSource/mozilla-release/js/src/jsgc.cpp:6167:30: note: '*((void*)(& i)+12).js::gc::ArenaCellIterImpl::span.js::gc::FreeSpan::first' was declared here
39:52.23 jsopcode.o
39:54.33 In file included from /opt/FirefoxSource/mozilla-release/js/src/vm/Shape-inl.h:22:0,
39:54.33                  from /opt/FirefoxSource/mozilla-release/js/src/jsscriptinlines.h:19,
39:54.33                  from /opt/FirefoxSource/mozilla-release/js/src/jit/ExecutionMode-inl.h:12,
39:54.33                  from /opt/FirefoxSource/mozilla-release/js/src/jsinferinlines.h:26,
39:54.33                  from /opt/FirefoxSource/mozilla-release/js/src/jsinfer.cpp:7:
39:54.33 /opt/FirefoxSource/mozilla-release/js/src/jsgcinlines.h: In member function 'void js::types::TypeZone::clearAllNewScriptsOnOOM()':
39:54.33 Warning: -Wmaybe-uninitialized in /opt/FirefoxSource/mozilla-release/js/src/jsgcinlines.h: '*((void*)(& iter)+12).js::gc::ArenaCellIterImpl::thing' may be used uninitialized in this function
39:54.33 /opt/FirefoxSource/mozilla-release/js/src/jsgcinlines.h:247:27: warning: '*((void*)(& iter)+12).js::gc::ArenaCellIterImpl::thing' may be used uninitialized in this function [-Wmaybe-uninitialized]
39:54.33 /opt/FirefoxSource/mozilla-release/js/src/jsinfer.cpp:4701:34: note: '*((void*)(& iter)+12).js::gc::ArenaCellIterImpl::thing' was declared here
39:54.33 In file included from /opt/FirefoxSource/mozilla-release/js/src/gc/Barrier.h:12:0,
39:54.33                  from /opt/FirefoxSource/mozilla-release/js/src/jsinfer.h:21,
39:54.33                  from /opt/FirefoxSource/mozilla-release/js/src/jsinferinlines.h:12,
39:54.33                  from /opt/FirefoxSource/mozilla-release/js/src/jsinfer.cpp:7:
39:54.33 Warning: -Wmaybe-uninitialized in /opt/FirefoxSource/mozilla-release/js/src/gc/Heap.h: '*((void*)(& iter)+12).js::gc::ArenaCellIterImpl::span.js::gc::FreeSpan::last' may be used uninitialized in this function
39:54.33 /opt/FirefoxSource/mozilla-release/js/src/gc/Heap.h:208:49: warning: '*((void*)(& iter)+12).js::gc::ArenaCellIterImpl::span.js::gc::FreeSpan::last' may be used uninitialized in this function [-Wmaybe-uninitialized]
39:54.33 /opt/FirefoxSource/mozilla-release/js/src/jsinfer.cpp:4701:34: note: '*((void*)(& iter)+12).js::gc::ArenaCellIterImpl::span.js::gc::FreeSpan::last' was declared here
39:54.33 In file included from /opt/FirefoxSource/mozilla-release/js/src/vm/Shape-inl.h:22:0,
39:54.33                  from /opt/FirefoxSource/mozilla-release/js/src/jsscriptinlines.h:19,
39:54.33                  from /opt/FirefoxSource/mozilla-release/js/src/jit/ExecutionMode-inl.h:12,
39:54.33                  from /opt/FirefoxSource/mozilla-release/js/src/jsinferinlines.h:26,
39:54.33                  from /opt/FirefoxSource/mozilla-release/js/src/jsinfer.cpp:7:
39:54.33 Warning: -Wmaybe-uninitialized in /opt/FirefoxSource/mozilla-release/js/src/jsgcinlines.h: '*((void*)(& iter)+12).js::gc::ArenaCellIterImpl::span.js::gc::FreeSpan::first' may be used uninitialized in this function
39:54.33 /opt/FirefoxSource/mozilla-release/js/src/jsgcinlines.h:188:9: warning: '*((void*)(& iter)+12).js::gc::ArenaCellIterImpl::span.js::gc::FreeSpan::first' may be used uninitialized in this function [-Wmaybe-uninitialized]
39:54.33 /opt/FirefoxSource/mozilla-release/js/src/jsinfer.cpp:4701:34: note: '*((void*)(& iter)+12).js::gc::ArenaCellIterImpl::span.js::gc::FreeSpan::first' was declared here
39:54.35 jsprf.o
39:58.06 jspropertytree.o
39:58.14 jsproxy.o
39:58.71 jsreflect.o
40:00.57 jsscript.o
40:00.66 In file included from /opt/FirefoxSource/mozilla-release/js/src/vm/Shape-inl.h:22:0,
40:00.66                  from /opt/FirefoxSource/mozilla-release/js/src/jsscriptinlines.h:19,
40:00.66                  from /opt/FirefoxSource/mozilla-release/js/src/jit/ExecutionMode-inl.h:12,
40:00.66                  from /opt/FirefoxSource/mozilla-release/js/src/jsinferinlines.h:26,
40:00.66                  from /opt/FirefoxSource/mozilla-release/js/src/jsopcode.cpp:41:
40:00.66 /opt/FirefoxSource/mozilla-release/js/src/jsgcinlines.h: In function 'void js::StopPCCountProfiling(JSContext*)':
40:00.66 Warning: -Wmaybe-uninitialized in /opt/FirefoxSource/mozilla-release/js/src/jsgcinlines.h: '*((void*)(& i)+12).js::gc::ArenaCellIterImpl::thing' may be used uninitialized in this function
40:00.66 /opt/FirefoxSource/mozilla-release/js/src/jsgcinlines.h:237:46: warning: '*((void*)(& i)+12).js::gc::ArenaCellIterImpl::thing' may be used uninitialized in this function [-Wmaybe-uninitialized]
40:00.66 /opt/FirefoxSource/mozilla-release/js/src/jsopcode.cpp:2005:27: note: '*((void*)(& i)+12).js::gc::ArenaCellIterImpl::thing' was declared here
40:00.66 In file included from /opt/FirefoxSource/mozilla-release/js/src/gc/Barrier.h:12:0,
40:00.66                  from /opt/FirefoxSource/mozilla-release/js/src/jsatom.h:14,
40:00.66                  from /opt/FirefoxSource/mozilla-release/js/src/jsscript.h:16,
40:00.66                  from /opt/FirefoxSource/mozilla-release/js/src/jsopcodeinlines.h:12,
40:00.66                  from /opt/FirefoxSource/mozilla-release/js/src/jsopcode.cpp:11:
40:00.66 Warning: -Wmaybe-uninitialized in /opt/FirefoxSource/mozilla-release/js/src/gc/Heap.h: '*((void*)(& i)+12).js::gc::ArenaCellIterImpl::span.js::gc::FreeSpan::last' may be used uninitialized in this function
40:00.66 /opt/FirefoxSource/mozilla-release/js/src/gc/Heap.h:208:49: warning: '*((void*)(& i)+12).js::gc::ArenaCellIterImpl::span.js::gc::FreeSpan::last' may be used uninitialized in this function [-Wmaybe-uninitialized]
40:00.66 /opt/FirefoxSource/mozilla-release/js/src/jsopcode.cpp:2005:27: note: '*((void*)(& i)+12).js::gc::ArenaCellIterImpl::span.js::gc::FreeSpan::last' was declared here
40:00.66 In file included from /opt/FirefoxSource/mozilla-release/js/src/vm/Shape-inl.h:22:0,
40:00.66                  from /opt/FirefoxSource/mozilla-release/js/src/jsscriptinlines.h:19,
40:00.66                  from /opt/FirefoxSource/mozilla-release/js/src/jit/ExecutionMode-inl.h:12,
40:00.66                  from /opt/FirefoxSource/mozilla-release/js/src/jsinferinlines.h:26,
40:00.66                  from /opt/FirefoxSource/mozilla-release/js/src/jsopcode.cpp:41:
40:00.66 Warning: -Wmaybe-uninitialized in /opt/FirefoxSource/mozilla-release/js/src/jsgcinlines.h: '*((void*)(& i)+12).js::gc::ArenaCellIterImpl::span.js::gc::FreeSpan::first' may be used uninitialized in this function
40:00.66 /opt/FirefoxSource/mozilla-release/js/src/jsgcinlines.h:188:9: warning: '*((void*)(& i)+12).js::gc::ArenaCellIterImpl::span.js::gc::FreeSpan::first' may be used uninitialized in this function [-Wmaybe-uninitialized]
40:00.66 /opt/FirefoxSource/mozilla-release/js/src/jsopcode.cpp:2005:27: note: '*((void*)(& i)+12).js::gc::ArenaCellIterImpl::span.js::gc::FreeSpan::first' was declared here
40:00.72 jsstr.o
40:02.88 jswatchpoint.o
40:06.98 jsweakmap.o
40:08.81 jswrapper.o
40:10.45 /opt/FirefoxSource/mozilla-release/js/src/jsscript.cpp: In member function 'void JSScript::destroyDebugScript(js::FreeOp*)':
40:10.45 Warning: -Wunused-variable in /opt/FirefoxSource/mozilla-release/js/src/jsscript.cpp: unused variable 'site'
40:10.45 /opt/FirefoxSource/mozilla-release/js/src/jsscript.cpp:3136:33: warning: unused variable 'site' [-Wunused-variable]
40:10.45 jsperf.o
40:10.75 prmjtime.o
40:12.53 ArgumentsObject.o
40:12.65 ArrayBufferObject.o
40:14.61 CallNonGenericMethod.o
40:14.86 CharacterEncoding.o
40:16.05 Compression.o
40:16.62 DateTime.o
40:16.73 Debugger.o
40:17.01 DebuggerMemory.o
40:17.92 ErrorObject.o
40:18.17 In file included from /opt/FirefoxSource/mozilla-release/js/src/vm/Stack.h:16:0,
40:18.17                  from /opt/FirefoxSource/mozilla-release/js/src/vm/Runtime.h:42,
40:18.17                  from /opt/FirefoxSource/mozilla-release/js/src/jscntxt.h:15,
40:18.17                  from /opt/FirefoxSource/mozilla-release/js/src/vm/ScopeObject.h:10,
40:18.17                  from /opt/FirefoxSource/mozilla-release/js/src/vm/ArgumentsObject-inl.h:12,
40:18.17                  from /opt/FirefoxSource/mozilla-release/js/src/vm/ArgumentsObject.cpp:7:
40:18.17 /opt/FirefoxSource/mozilla-release/js/src/jit/JitFrameIterator.h: In member function 'void js::jit::JitFrameIterator::unaliasedForEachActual(Op, js::jit::ReadFrameArgsBehavior) const [with Op = js::CopyToHeap]':
40:18.17 Warning: -Wmaybe-uninitialized in /opt/FirefoxSource/mozilla-release/js/src/jit/JitFrameIterator.h: 'end' may be used uninitialized in this function
40:18.17 /opt/FirefoxSource/mozilla-release/js/src/jit/JitFrameIterator.h:234:10: warning: 'end' may be used uninitialized in this function [-Wmaybe-uninitialized]
40:18.17 Warning: -Wmaybe-uninitialized in /opt/FirefoxSource/mozilla-release/js/src/jit/JitFrameIterator.h: 'start' may be used uninitialized in this function
40:18.17 /opt/FirefoxSource/mozilla-release/js/src/jit/JitFrameIterator.h:234:10: warning: 'start' may be used uninitialized in this function [-Wmaybe-uninitialized]
40:18.17 ForkJoin.o
40:20.45 GlobalObject.o
40:22.61 HelperThreads.o
40:23.68 Id.o
40:26.15 Interpreter.o
40:26.28 MemoryMetrics.o
40:27.52 Monitor.o
40:29.32 ObjectImpl.o
40:29.42 OldDebugAPI.o
40:32.37 PIC.o
40:34.04 Probes.o
40:34.16 PropertyKey.o
40:35.60 ProxyObject.o
40:37.26 RegExpObject.o
40:37.77 In file included from /opt/FirefoxSource/mozilla-release/js/src/vm/Shape-inl.h:22:0,
40:37.77                  from /opt/FirefoxSource/mozilla-release/js/src/jsscriptinlines.h:19,
40:37.77                  from /opt/FirefoxSource/mozilla-release/js/src/jit/ExecutionMode-inl.h:12,
40:37.77                  from /opt/FirefoxSource/mozilla-release/js/src/jsinferinlines.h:26,
40:37.77                  from /opt/FirefoxSource/mozilla-release/js/src/vm/OldDebugAPI.cpp:31:
40:37.77 /opt/FirefoxSource/mozilla-release/js/src/jsgcinlines.h: In function 'void JS_DumpCompartmentPCCounts(JSContext*)':
40:37.77 Warning: -Wmaybe-uninitialized in /opt/FirefoxSource/mozilla-release/js/src/jsgcinlines.h: '*((void*)(& i)+12).js::gc::ArenaCellIterImpl::thing' may be used uninitialized in this function
40:37.77 /opt/FirefoxSource/mozilla-release/js/src/jsgcinlines.h:237:46: warning: '*((void*)(& i)+12).js::gc::ArenaCellIterImpl::thing' may be used uninitialized in this function [-Wmaybe-uninitialized]
40:37.77 /opt/FirefoxSource/mozilla-release/js/src/vm/OldDebugAPI.cpp:238:27: note: '*((void*)(& i)+12).js::gc::ArenaCellIterImpl::thing' was declared here
40:37.77 In file included from /opt/FirefoxSource/mozilla-release/js/src/gc/Barrier.h:12:0,
40:37.77                  from /opt/FirefoxSource/mozilla-release/js/src/jsatom.h:14,
40:37.77                  from /opt/FirefoxSource/mozilla-release/js/src/vm/Runtime.h:21,
40:37.77                  from /opt/FirefoxSource/mozilla-release/js/src/jscntxt.h:15,
40:37.77                  from /opt/FirefoxSource/mozilla-release/js/src/vm/OldDebugAPI.cpp:15:
40:37.77 Warning: -Wmaybe-uninitialized in /opt/FirefoxSource/mozilla-release/js/src/gc/Heap.h: '*((void*)(& i)+12).js::gc::ArenaCellIterImpl::span.js::gc::FreeSpan::last' may be used uninitialized in this function
40:37.77 /opt/FirefoxSource/mozilla-release/js/src/gc/Heap.h:208:49: warning: '*((void*)(& i)+12).js::gc::ArenaCellIterImpl::span.js::gc::FreeSpan::last' may be used uninitialized in this function [-Wmaybe-uninitialized]
40:37.77 /opt/FirefoxSource/mozilla-release/js/src/vm/OldDebugAPI.cpp:238:27: note: '*((void*)(& i)+12).js::gc::ArenaCellIterImpl::span.js::gc::FreeSpan::last' was declared here
40:37.77 In file included from /opt/FirefoxSource/mozilla-release/js/src/vm/Shape-inl.h:22:0,
40:37.77                  from /opt/FirefoxSource/mozilla-release/js/src/jsscriptinlines.h:19,
40:37.77                  from /opt/FirefoxSource/mozilla-release/js/src/jit/ExecutionMode-inl.h:12,
40:37.77                  from /opt/FirefoxSource/mozilla-release/js/src/jsinferinlines.h:26,
40:37.77                  from /opt/FirefoxSource/mozilla-release/js/src/vm/OldDebugAPI.cpp:31:
40:37.77 Warning: -Wmaybe-uninitialized in /opt/FirefoxSource/mozilla-release/js/src/jsgcinlines.h: '*((void*)(& i)+12).js::gc::ArenaCellIterImpl::span.js::gc::FreeSpan::first' may be used uninitialized in this function
40:37.77 /opt/FirefoxSource/mozilla-release/js/src/jsgcinlines.h:188:9: warning: '*((void*)(& i)+12).js::gc::ArenaCellIterImpl::span.js::gc::FreeSpan::first' may be used uninitialized in this function [-Wmaybe-uninitialized]
40:37.77 /opt/FirefoxSource/mozilla-release/js/src/vm/OldDebugAPI.cpp:238:27: note: '*((void*)(& i)+12).js::gc::ArenaCellIterImpl::span.js::gc::FreeSpan::first' was declared here
40:37.77 RegExpStatics.o
40:38.77 Runtime.o
40:40.76 SPSProfiler.o
40:41.80 SavedStacks.o
40:43.16 ScopeObject.o
40:43.53 SelfHosting.o
40:43.57 Shape.o
40:44.53 SharedArrayObject.o
40:49.15 Stack.o
40:49.48 String.o
40:51.06 StringBuffer.o
40:52.49 StructuredClone.o
40:53.74 Symbol.o
40:54.81 /opt/FirefoxSource/mozilla-release/js/src/vm/String.cpp: In instantiation of 'static bool js::StaticStrings::isStatic(const CharT*, size_t) [with CharT = unsigned char; size_t = unsigned int]':
40:54.81 /opt/FirefoxSource/mozilla-release/js/src/vm/String.cpp:802:62:   required from here
40:54.81 Warning: -Wtype-limits in /opt/FirefoxSource/mozilla-release/js/src/vm/String.cpp: comparison is always true due to limited range of data type
40:54.81 /opt/FirefoxSource/mozilla-release/js/src/vm/String.cpp:778:27: warning: comparison is always true due to limited range of data type [-Wtype-limits]
40:54.81 ThreadPool.o
40:55.96 TypedArrayObject.o
40:56.97 UbiNode.o
40:57.19 Unicode.o
40:58.12 Value.o
40:58.24 WeakMapPtr.o
40:58.46 Xdr.o
41:09.93 /opt/FirefoxSource/mozilla-release/js/src/vm/TypedArrayObject.cpp: In instantiation of 'static bool {anonymous}::TypedArrayObjectTemplate<NativeType>::fun_copyWithin_impl(JSContext*, JS::CallArgs) [with NativeType = signed char]':
41:09.93 /opt/FirefoxSource/mozilla-release/js/src/vm/TypedArrayObject.cpp:616:88:   required from 'static bool {anonymous}::TypedArrayObjectTemplate<NativeType>::fun_copyWithin(JSContext*, unsigned int, JS::Value*) [with NativeType = signed char]'
41:09.93 /opt/FirefoxSource/mozilla-release/js/src/vm/TypedArrayObject.cpp:2261:303:   required from here
41:09.93 Warning: -Wunused-variable in /opt/FirefoxSource/mozilla-release/js/src/vm/TypedArrayObject.cpp: unused variable 'ElementSize'
41:09.93 /opt/FirefoxSource/mozilla-release/js/src/vm/TypedArrayObject.cpp:582:22: warning: unused variable 'ElementSize' [-Wunused-variable]
41:09.93 /opt/FirefoxSource/mozilla-release/js/src/vm/TypedArrayObject.cpp: In instantiation of 'static bool {anonymous}::TypedArrayObjectTemplate<NativeType>::fun_copyWithin_impl(JSContext*, JS::CallArgs) [with NativeType = unsigned char]':
41:09.93 /opt/FirefoxSource/mozilla-release/js/src/vm/TypedArrayObject.cpp:616:88:   required from 'static bool {anonymous}::TypedArrayObjectTemplate<NativeType>::fun_copyWithin(JSContext*, unsigned int, JS::Value*) [with NativeType = unsigned char]'
41:09.93 /opt/FirefoxSource/mozilla-release/js/src/vm/TypedArrayObject.cpp:2262:307:   required from here
41:09.93 Warning: -Wunused-variable in /opt/FirefoxSource/mozilla-release/js/src/vm/TypedArrayObject.cpp: unused variable 'ElementSize'
41:09.93 /opt/FirefoxSource/mozilla-release/js/src/vm/TypedArrayObject.cpp:582:22: warning: unused variable 'ElementSize' [-Wunused-variable]
41:09.93 /opt/FirefoxSource/mozilla-release/js/src/vm/TypedArrayObject.cpp: In instantiation of 'static bool {anonymous}::TypedArrayObjectTemplate<NativeType>::fun_copyWithin_impl(JSContext*, JS::CallArgs) [with NativeType = short int]':
41:09.93 /opt/FirefoxSource/mozilla-release/js/src/vm/TypedArrayObject.cpp:616:88:   required from 'static bool {anonymous}::TypedArrayObjectTemplate<NativeType>::fun_copyWithin(JSContext*, unsigned int, JS::Value*) [with NativeType = short int]'
41:09.93 /opt/FirefoxSource/mozilla-release/js/src/vm/TypedArrayObject.cpp:2263:307:   required from here
41:09.93 Warning: -Wunused-variable in /opt/FirefoxSource/mozilla-release/js/src/vm/TypedArrayObject.cpp: unused variable 'ElementSize'
41:09.93 /opt/FirefoxSource/mozilla-release/js/src/vm/TypedArrayObject.cpp:582:22: warning: unused variable 'ElementSize' [-Wunused-variable]
41:09.93 /opt/FirefoxSource/mozilla-release/js/src/vm/TypedArrayObject.cpp: In instantiation of 'static bool {anonymous}::TypedArrayObjectTemplate<NativeType>::fun_copyWithin_impl(JSContext*, JS::CallArgs) [with NativeType = short unsigned int]':
41:09.93 /opt/FirefoxSource/mozilla-release/js/src/vm/TypedArrayObject.cpp:616:88:   required from 'static bool {anonymous}::TypedArrayObjectTemplate<NativeType>::fun_copyWithin(JSContext*, unsigned int, JS::Value*) [with NativeType = short unsigned int]'
41:09.93 /opt/FirefoxSource/mozilla-release/js/src/vm/TypedArrayObject.cpp:2264:311:   required from here
41:09.93 Warning: -Wunused-variable in /opt/FirefoxSource/mozilla-release/js/src/vm/TypedArrayObject.cpp: unused variable 'ElementSize'
41:09.93 /opt/FirefoxSource/mozilla-release/js/src/vm/TypedArrayObject.cpp:582:22: warning: unused variable 'ElementSize' [-Wunused-variable]
41:09.93 /opt/FirefoxSource/mozilla-release/js/src/vm/TypedArrayObject.cpp: In instantiation of 'static bool {anonymous}::TypedArrayObjectTemplate<NativeType>::fun_copyWithin_impl(JSContext*, JS::CallArgs) [with NativeType = int]':
41:09.93 /opt/FirefoxSource/mozilla-release/js/src/vm/TypedArrayObject.cpp:616:88:   required from 'static bool {anonymous}::TypedArrayObjectTemplate<NativeType>::fun_copyWithin(JSContext*, unsigned int, JS::Value*) [with NativeType = int]'
41:09.93 /opt/FirefoxSource/mozilla-release/js/src/vm/TypedArrayObject.cpp:2265:307:   required from here
41:09.93 Warning: -Wunused-variable in /opt/FirefoxSource/mozilla-release/js/src/vm/TypedArrayObject.cpp: unused variable 'ElementSize'
41:09.93 /opt/FirefoxSource/mozilla-release/js/src/vm/TypedArrayObject.cpp:582:22: warning: unused variable 'ElementSize' [-Wunused-variable]
41:09.93 /opt/FirefoxSource/mozilla-release/js/src/vm/TypedArrayObject.cpp: In instantiation of 'static bool {anonymous}::TypedArrayObjectTemplate<NativeType>::fun_copyWithin_impl(JSContext*, JS::CallArgs) [with NativeType = unsigned int]':
41:09.93 /opt/FirefoxSource/mozilla-release/js/src/vm/TypedArrayObject.cpp:616:88:   required from 'static bool {anonymous}::TypedArrayObjectTemplate<NativeType>::fun_copyWithin(JSContext*, unsigned int, JS::Value*) [with NativeType = unsigned int]'
41:09.93 /opt/FirefoxSource/mozilla-release/js/src/vm/TypedArrayObject.cpp:2266:311:   required from here
41:09.93 Warning: -Wunused-variable in /opt/FirefoxSource/mozilla-release/js/src/vm/TypedArrayObject.cpp: unused variable 'ElementSize'
41:09.93 /opt/FirefoxSource/mozilla-release/js/src/vm/TypedArrayObject.cpp:582:22: warning: unused variable 'ElementSize' [-Wunused-variable]
41:09.93 /opt/FirefoxSource/mozilla-release/js/src/vm/TypedArrayObject.cpp: In instantiation of 'static bool {anonymous}::TypedArrayObjectTemplate<NativeType>::fun_copyWithin_impl(JSContext*, JS::CallArgs) [with NativeType = float]':
41:09.93 /opt/FirefoxSource/mozilla-release/js/src/vm/TypedArrayObject.cpp:616:88:   required from 'static bool {anonymous}::TypedArrayObjectTemplate<NativeType>::fun_copyWithin(JSContext*, unsigned int, JS::Value*) [with NativeType = float]'
41:09.93 /opt/FirefoxSource/mozilla-release/js/src/vm/TypedArrayObject.cpp:2267:315:   required from here
41:09.93 Warning: -Wunused-variable in /opt/FirefoxSource/mozilla-release/js/src/vm/TypedArrayObject.cpp: unused variable 'ElementSize'
41:09.93 /opt/FirefoxSource/mozilla-release/js/src/vm/TypedArrayObject.cpp:582:22: warning: unused variable 'ElementSize' [-Wunused-variable]
41:09.93 /opt/FirefoxSource/mozilla-release/js/src/vm/TypedArrayObject.cpp: In instantiation of 'static bool {anonymous}::TypedArrayObjectTemplate<NativeType>::fun_copyWithin_impl(JSContext*, JS::CallArgs) [with NativeType = double]':
41:09.93 /opt/FirefoxSource/mozilla-release/js/src/vm/TypedArrayObject.cpp:616:88:   required from 'static bool {anonymous}::TypedArrayObjectTemplate<NativeType>::fun_copyWithin(JSContext*, unsigned int, JS::Value*) [with NativeType = double]'
41:09.93 /opt/FirefoxSource/mozilla-release/js/src/vm/TypedArrayObject.cpp:2268:315:   required from here
41:09.93 Warning: -Wunused-variable in /opt/FirefoxSource/mozilla-release/js/src/vm/TypedArrayObject.cpp: unused variable 'ElementSize'
41:09.93 /opt/FirefoxSource/mozilla-release/js/src/vm/TypedArrayObject.cpp:582:22: warning: unused variable 'ElementSize' [-Wunused-variable]
41:09.93 /opt/FirefoxSource/mozilla-release/js/src/vm/TypedArrayObject.cpp: In instantiation of 'static bool {anonymous}::TypedArrayObjectTemplate<NativeType>::fun_copyWithin_impl(JSContext*, JS::CallArgs) [with NativeType = js::uint8_clamped]':
41:09.93 /opt/FirefoxSource/mozilla-release/js/src/vm/TypedArrayObject.cpp:616:88:   required from 'static bool {anonymous}::TypedArrayObjectTemplate<NativeType>::fun_copyWithin(JSContext*, unsigned int, JS::Value*) [with NativeType = js::uint8_clamped]'
41:09.93 /opt/FirefoxSource/mozilla-release/js/src/vm/TypedArrayObject.cpp:2269:335:   required from here
41:09.93 Warning: -Wunused-variable in /opt/FirefoxSource/mozilla-release/js/src/vm/TypedArrayObject.cpp: unused variable 'ElementSize'
41:09.93 /opt/FirefoxSource/mozilla-release/js/src/vm/TypedArrayObject.cpp:582:22: warning: unused variable 'ElementSize' [-Wunused-variable]
41:09.94 libjs_static.a
41:11.57 libjs_static.a.desc
41:11.77 js.o
41:11.77 jsheaptools.o
41:11.80 gdb-tests.o
41:11.80 test-JSObject.o
41:11.83 selfTest.o
41:11.83 testAddPropertyPropcache.o
41:12.15 StaticXULComponentsStart.o
41:12.33 libxul_s.a.desc
41:12.33 libxul.so
41:12.57 test-JSString.o
41:13.06 test-JSSymbol.o
41:14.11 testArgumentsObject.o
41:14.70 test-Root.o
41:15.19 test-jsid.o
41:16.15 testArrayBuffer.o
41:16.18 test-jsval.o
41:16.63 test-prettyprinters.o
41:17.32 typedef-printers.o
41:17.86 gdb-tests
41:20.60 Warning: -Wunused-function in /opt/FirefoxSource/mozilla-release/js/src/shell/js.cpp: 'bool StackDump(JSContext*, unsigned int, JS::Value*)' defined but not used
41:20.60 /opt/FirefoxSource/mozilla-release/js/src/shell/js.cpp:3237:1: warning: 'bool StackDump(JSContext*, unsigned int, JS::Value*)' defined but not used [-Wunused-function]
41:20.60 jsoptparse.o
41:20.94 testBindCallable.o
41:22.33 testBug604087.o
41:24.40 testCallNonGenericMethodOnProxy.o
41:25.47 testChromeBuffer.o
41:25.51 js
41:26.62 testClassGetter.o
41:28.73 testCloneScript.o
41:28.99 testConservativeGC.o
41:29.68 testContexts.o
41:29.72 testCustomIterator.o
41:31.63 testDebugger.o
41:31.83 testDeepFreeze.o
41:32.42 testDefineGetterSetterNonEnumerable.o
41:33.98 testDefineProperty.o
41:34.92 testDefinePropertyIgnoredAttributes.o
41:35.09 testEnclosingFunction.o
41:36.64 testErrorCopying.o
41:36.75 testException.o
41:38.55 testExternalStrings.o
41:38.80 testFindSCCs.o
41:38.84 testFreshGlobalEvalRedefinition.o
41:40.41 testFuncCallback.o
41:40.62 testFunctionProperties.o
41:42.15 testGCAllocator.o
41:42.18 testGCExactRooting.o
41:42.81 testGCFinalizeCallback.o
41:44.38 testGCHeapPostBarriers.o
41:44.50 testGCOutOfMemory.o
41:44.54 testGCStoreBufferRemoval.o
41:45.69 testHashTable.o
41:45.82 testHashTableInit.o
41:46.75 testIndexToString.o
41:48.49 testIntString.o
41:49.67 testIntTypesABI.o
41:50.86 testIntern.o
41:51.96 testIsInsideNursery.o
41:52.04 testJSEvaluateScript.o
41:52.44 testJitDCEinGVN.o
41:53.56 testJitFoldsTo.o
41:54.01 testJitMoveEmitterCycles.o
41:54.94 testJitRValueAlloc.o
41:54.98 testLookup.o
41:57.86 testLooselyEqual.o
41:58.18 testMappedArrayBuffer.o
41:58.76 testNewObject.o
42:02.38 testNullRoot.o
42:04.62 testOOM.o
42:05.18 testObjectEmulatingUndefined.o
42:05.78 testOps.o
42:06.47 testOriginPrincipals.o
42:06.72 testParseJSON.o
42:08.06 testPersistentRooted.o
42:08.83 testProfileStrings.o
42:10.80 testPropCache.o
42:11.74 testRegExp.o
42:12.89 testResolveRecursion.o
42:13.98 testSameValue.o
42:13.99 testSavedStacks.o
42:15.26 testScriptInfo.o
42:15.68 testScriptObject.o
42:17.15 testSetProperty.o
42:17.29 testSetPropertyIgnoringNamedGetter.o
42:18.13 testSourcePolicy.o
42:19.22 testStringBuffer.o
42:21.03 testStructuredClone.o
42:21.18 testSymbol.o
42:21.87 testToIntWidth.o
42:23.47 testTypedArrays.o
42:23.54 testUTF8.o
42:25.08 testUbiNode.o
42:25.33 testUncaughtError.o
42:27.06 testWeakMap.o
42:28.60 testXDR.o
42:28.83 tests.o
42:33.54 jsapi-tests
46:39.90 PropertiesTest.o
46:39.91 triplescat.o
46:39.91 TestComponent.o
46:39.91 TestComponent.o
46:39.91 ReadNTLM.o
46:42.16 libtestcomponent.so
46:42.23 libtest656331.so
46:42.24 TestBlockingSocket.o
46:42.26 triplescat
46:42.60 TestCallbacks.o
46:43.53 test_tone.o
46:43.85 TestAppShellSteadyState.o
46:43.87 TestTXMgr.o
46:43.93 test_tone
46:44.19 test_AsXXX_helpers.o
46:44.19 test_async_callbacks_with_spun_event_loops.o
46:44.49 TestDNS.o
46:45.18 test_asyncStatementExecution_transaction.o
46:45.59 TestIncrementalDownload.o
46:46.19 TestOpen.o
46:46.35 TestTXMgr
46:46.36 test_binding_params.o
46:46.50 TestComponent.o
46:46.78 libtestcompnoaslr.so
46:46.93 rdfpoll.o
46:47.42 TestPageLoad.o
46:47.46 test_file_perms.o
46:47.54 rdfpoll
46:47.66 TestAudioChannelService.o
46:48.04 TestAppShellSteadyState
46:48.14 TestProtocols.o
46:48.18 nsIFileEnumerator.o
46:48.18 TestArguments.o
46:48.35 test_mutex.o
46:48.51 TestBlockingProcess.o
46:48.56 TestCallTemplates.o
46:48.60 TestINIParser.o
46:48.81 TestPRIntN.o
46:49.00 test_service_init_background_thread.o
46:49.05 TestAudioChannelService
46:49.11 TestServ.o
46:49.16 TestQuickReturn.o
46:49.22 TestAudioEventTimeline.o
46:49.25 TestRacingServiceManager.o
46:49.33 TestRegistrationOrder.o
46:49.67 test_statement_scoper.o
46:49.99 TestThreadPoolListener.o
46:50.63 TestTimers.o
46:50.67 test_StatementCache.o
46:51.01 TestStandardURL.o
46:51.23 TestAudioEventTimeline
46:51.36 xpcshell.o
46:51.39 test_transaction_helper.o
46:51.42 TestUnicodeArguments.o
46:51.64 xpcshell
46:51.65 TestStreamLoader.o
46:51.80 TestCSPParser.o
46:51.80 TestGetURL.o
46:52.01 TestUpload.o
46:52.01 ShowAlignments.o
46:52.06 TestAutoPtr.o
46:52.13 TestAutoRef.o
46:52.40 test_true_async.o
46:52.64 TestCOMArray.o
46:52.69 TestURLParser.o
46:52.72 TestNativeXMLHttpRequest.o
46:53.09 TestCOMPtr.o
46:53.15 test_unlock_notify.o
46:53.38 TestPlainTextSerializer.o
46:53.53 urltest.o
46:53.78 TestCOMPtrEq.o
46:53.83 TestCookie.o
46:54.15 TestDeque.o
46:54.28 TestFile.o
46:54.37 TestSTSParser.o
46:54.49 TestCSPParser
46:54.49 TestGetURL
46:54.56 TestNativeXMLHttpRequest
46:54.62 TestPlainTextSerializer
46:54.82 xpctest_attributes.o
46:54.82 xpctest_module.o
46:54.84 test_AsXXX_helpers
46:54.84 test_async_callbacks_with_spun_event_loops
46:54.85 TestHashtables.o
46:54.90 test_asyncStatementExecution_transaction
46:54.97 test_binding_params
46:55.04 test_file_perms
46:55.10 test_mutex
46:55.17 test_service_init_background_thread
46:55.23 test_statement_scoper
46:55.30 test_StatementCache
46:55.31 xpctest_params.o
46:55.37 test_transaction_helper
46:55.46 test_true_async
46:55.53 test_unlock_notify
46:55.60 TestID.o
46:55.75 TestLineBreak.o
46:55.79 TestUDPSocket.o
46:56.15 libxpctest.so
46:56.25 nsSample.o
46:56.25 nsSampleModule.o
46:56.37 TestNsRefPtr.o
46:56.45 TestObserverArray.o
46:56.50 TestLineBreak
46:56.61 TestAudioBuffers.o
46:56.61 TestAudioMixer.o
46:56.68 libxpcomsample.so
46:56.89 TestObserverService.o
46:57.15 Converters.o
46:57.15 TestStreamConv.o
46:57.72 TestAudioBuffers
46:57.72 TestAudioMixer
46:57.79 PropertiesTest
46:57.79 ReadNTLM
46:57.86 TestBlockingSocket
46:57.94 TestCertDB.o
46:57.94 TestCallbacks
46:57.98 TestPipe.o
46:58.01 TestDNS
46:58.02 TestStreamConv
46:58.08 TestIncrementalDownload
46:58.12 TestCertDB
46:58.14 TestOpen
46:58.15 TestVolatileBuffer.o
46:58.21 TestPageLoad
46:58.23 TestStartupCache.o
46:58.30 TestProtocols
46:58.33 TestPLDHash.o
46:58.53 TestServ
46:58.61 TestStandardURL
46:58.68 TestStreamLoader
46:58.74 TestUpload
46:58.80 TestURLParser
46:58.88 urltest
46:58.89 TestVolatileBuffer
46:58.94 TestCookie
46:58.98 TestStringAPI.o
46:59.00 TestSTSParser
46:59.02 TestWebGLElementArrayCache.o
46:59.07 TestUDPSocket
46:59.09 TestTArray.o
46:59.26 TestMinStringAPI.o
46:59.27 TestStartupCache
46:59.39 rdfcat.o
46:59.50 TestTextFormatter.o
46:59.75 rdfcat
46:59.85 TestMinStringAPI
46:59.87 PrimitiveTest.o
46:59.87 SimpleTypeLib.o
46:59.93 NormalizationTest.o
46:59.93 UnicharSelfTest.o
47:00.10 PrimitiveTest
47:00.12 SimpleTypeLib
47:00.32 NormalizationTest
47:00.38 TestWebGLElementArrayCache
47:00.40 TestThreadUtils.o
47:00.46 TestJemalloc.o
47:00.68 UnicharSelfTest
47:01.16 nsIFileEnumerator
47:01.16 TestArguments
47:01.16 TestBlockingProcess
47:01.18 TestCallTemplates
47:01.22 TestINIParser
47:01.23 TestPRIntN
47:01.25 TestQuickReturn
47:01.29 TestRacingServiceManager
47:01.30 TestRegistrationOrder
47:01.31 TestThreadPoolListener
47:01.36 TestTimers
47:01.36 TestUnicodeArguments
47:01.37 ShowAlignments
47:01.42 TestAutoPtr
47:01.43 TestAutoRef
47:01.44 TestCOMArray
47:01.48 TestCOMPtr
47:01.49 TestCOMPtrEq
47:01.51 TestDeque
47:01.54 TestFile
47:01.55 TestHashtables
47:01.57 TestID
47:01.62 TestNsRefPtr
47:01.63 TestObserverArray
47:01.64 TestObserverService
47:01.68 TestPipe
47:01.69 TestPLDHash
47:01.71 TestStringAPI
47:01.75 TestTextFormatter
47:01.76 TestThreadUtils
47:01.77 TestJemalloc
47:02.82 TestTArray
47:26.23 /opt/FirefoxSource/mozilla-release/netwerk/base/public/security-prefs.js: WARNING: no preprocessor directives found
47:55.25 /opt/FirefoxSource/mozilla-release/dom/indexedDB/test/extensions/bootstrap.js: WARNING: no preprocessor directives found
47:56.04 /opt/FirefoxSource/mozilla-release/dom/workers/test/extensions/bootstrap/worker.js: WARNING: no preprocessor directives found
47:56.04 /opt/FirefoxSource/mozilla-release/dom/workers/test/extensions/bootstrap/bootstrap.js: WARNING: no preprocessor directives found
47:56.09 /opt/FirefoxSource/mozilla-release/dom/workers/test/extensions/traditional/worker.js: WARNING: no preprocessor directives found
47:58.13   adding: install.rdf (deflated 52%)
47:58.20   adding: plugins/libnptest.so (deflated 60%)
47:58.25   adding: plugins/libnpsecondtest.so (deflated 60%)
48:22.42 /opt/FirefoxSource/mozilla-release/services/common/services-common.js: WARNING: no preprocessor directives found
48:23.70 /opt/FirefoxSource/mozilla-release/tools/quitter/chrome.manifest: WARNING: no preprocessor directives found
48:25.05 /opt/FirefoxSource/mozilla-release/mobile/android/thirdparty/jap/branding/locales/en-US/brand.properties: WARNING: no useful preprocessor directives found
48:25.22 /opt/FirefoxSource/mozilla-release/mobile/locales/en-US/overrides/netError.dtd: WARNING: no preprocessor directives found
48:25.25 /opt/FirefoxSource/mozilla-release/mobile/locales/en-US/overrides/appstrings.properties: WARNING: no useful preprocessor directives found
48:25.25 /opt/FirefoxSource/mozilla-release/mobile/locales/en-US/overrides/passwordmgr.properties: WARNING: no useful preprocessor directives found
48:25.89 /opt/FirefoxSource/mozilla-release/mobile/android/base/WebappManifestFragment.xml.frag.in: WARNING: no preprocessor directives found
48:25.97 Traceback (most recent call last):
48:25.97   File "/usr/lib64/python2.7/runpy.py", line 162, in _run_module_as_main
48:25.98     "__main__", fname, loader, pkg_name)
48:25.98   File "/usr/lib64/python2.7/runpy.py", line 72, in _run_code
48:25.98     exec code in run_globals
48:25.98   File "/opt/FirefoxSource/mozilla-release/python/mozbuild/mozbuild/action/preprocessor.py", line 16, in <module>
48:25.98     main(sys.argv[1:])
48:25.98   File "/opt/FirefoxSource/mozilla-release/python/mozbuild/mozbuild/action/preprocessor.py", line 12, in main
48:25.98     pp.handleCommandLine(args, True)
48:25.98   File "/opt/FirefoxSource/mozilla-release/python/mozbuild/mozbuild/preprocessor.py", line 472, in handleCommandLine
48:25.99     self.processFile(input=input, output=out)
48:25.99   File "/opt/FirefoxSource/mozilla-release/python/mozbuild/mozbuild/preprocessor.py", line 380, in processFile
48:25.99     self.do_include(input, False)
48:25.99   File "/opt/FirefoxSource/mozilla-release/python/mozbuild/mozbuild/preprocessor.py", line 774, in do_include
48:25.99     self.handleLine(l)
48:25.99   File "/opt/FirefoxSource/mozilla-release/python/mozbuild/mozbuild/preprocessor.py", line 552, in handleLine
48:25.99     self.write(aLine)
48:25.99   File "/opt/FirefoxSource/mozilla-release/python/mozbuild/mozbuild/preprocessor.py", line 421, in write
48:25.99     filteredLine = self.applyFilters(aLine)
48:25.99   File "/opt/FirefoxSource/mozilla-release/python/mozbuild/mozbuild/preprocessor.py", line 403, in applyFilters
48:26.00     aLine = f[1](aLine)
48:26.00   File "/opt/FirefoxSource/mozilla-release/python/mozbuild/mozbuild/preprocessor.py", line 731, in filter_substitution
48:26.00     return self.varsubst.sub(repl, aLine)
48:26.00   File "/opt/FirefoxSource/mozilla-release/python/mozbuild/mozbuild/preprocessor.py", line 729, in repl
48:26.00     raise Preprocessor.Error(self, 'UNDEFINED_VAR', varname)
48:26.00 mozbuild.preprocessor.Error: ('/opt/FirefoxSource/mozilla-release/mobile/android/base/AppConstants.java.in', 34, 'UNDEFINED_VAR', 'MOZ_ANDROID_MIN_SDK_VERSION')
48:26.01 /opt/FirefoxSource/mozilla-release/config/rules.mk:1548: recipe for target 'generated/org/mozilla/gecko/AppConstants.java' failed
48:26.01 make[5]: *** [generated/org/mozilla/gecko/AppConstants.java] Error 1
48:26.01 make[5]: *** Deleting file 'generated/org/mozilla/gecko/AppConstants.java'
48:26.07 make[5]: *** Warte auf noch nicht beendete Prozesse...
48:26.13 make[5]: *** wait: Keine Kind-Prozesse.  Schluss.
48:26.13 /opt/FirefoxSource/mozilla-release/config/recurse.mk:92: recipe for target 'mobile/android/base/libs' failed
48:26.13 make[4]: *** [mobile/android/base/libs] Error 2
48:26.13 /opt/FirefoxSource/mozilla-release/config/recurse.mk:42: recipe for target 'libs' failed
48:26.13 make[3]: *** [libs] Error 2
48:26.13 /opt/FirefoxSource/mozilla-release/config/rules.mk:547: recipe for target 'default' failed
48:26.13 make[2]: *** [default] Error 2
48:26.13 /opt/FirefoxSource/mozilla-release/client.mk:398: recipe for target 'realbuild' failed
48:26.13 make[1]: *** [realbuild] Error 2
48:26.13 client.mk:171: recipe for target 'build' failed
48:26.13 make: *** [build] Error 2
48:26.16 466 compiler warnings present.
48:29.13 Notification center failed: Install the python dbus module to get a notification when the build finishes.
Build step 'Shell ausführen' marked build as failure
[PostBuildScript] - Execution post build scripts.
[PostBuildScript] Build is not success : do not execute script
Finished: FAILURE