Console Output

Skipping 401 KB.. Full Log
21:11.49 /opt/FirefoxSource/mozilla-release/media/omx-plugin/include/gb/stagefright/MetaData.h:57:28: warning: multi-character character constant [-Wmultichar]
21:11.49 Warning: -Wmultichar in /opt/FirefoxSource/mozilla-release/media/omx-plugin/include/gb/stagefright/MetaData.h: multi-character character constant
21:11.49 /opt/FirefoxSource/mozilla-release/media/omx-plugin/include/gb/stagefright/MetaData.h:58:20: warning: multi-character character constant [-Wmultichar]
21:11.49 Warning: -Wmultichar in /opt/FirefoxSource/mozilla-release/media/omx-plugin/include/gb/stagefright/MetaData.h: multi-character character constant
21:11.49 /opt/FirefoxSource/mozilla-release/media/omx-plugin/include/gb/stagefright/MetaData.h:59:24: warning: multi-character character constant [-Wmultichar]
21:11.49 Warning: -Wmultichar in /opt/FirefoxSource/mozilla-release/media/omx-plugin/include/gb/stagefright/MetaData.h: multi-character character constant
21:11.49 /opt/FirefoxSource/mozilla-release/media/omx-plugin/include/gb/stagefright/MetaData.h:60:25: warning: multi-character character constant [-Wmultichar]
21:11.49 Warning: -Wmultichar in /opt/FirefoxSource/mozilla-release/media/omx-plugin/include/gb/stagefright/MetaData.h: multi-character character constant
21:11.49 /opt/FirefoxSource/mozilla-release/media/omx-plugin/include/gb/stagefright/MetaData.h:62:17: warning: multi-character character constant [-Wmultichar]
21:11.49 Warning: -Wmultichar in /opt/FirefoxSource/mozilla-release/media/omx-plugin/include/gb/stagefright/MetaData.h: multi-character character constant
21:11.49 /opt/FirefoxSource/mozilla-release/media/omx-plugin/include/gb/stagefright/MetaData.h:63:18: warning: multi-character character constant [-Wmultichar]
21:11.49 Warning: -Wmultichar in /opt/FirefoxSource/mozilla-release/media/omx-plugin/include/gb/stagefright/MetaData.h: multi-character character constant
21:11.49 /opt/FirefoxSource/mozilla-release/media/omx-plugin/include/gb/stagefright/MetaData.h:64:23: warning: multi-character character constant [-Wmultichar]
21:11.49 Warning: -Wmultichar in /opt/FirefoxSource/mozilla-release/media/omx-plugin/include/gb/stagefright/MetaData.h: multi-character character constant
21:11.49 /opt/FirefoxSource/mozilla-release/media/omx-plugin/include/gb/stagefright/MetaData.h:65:20: warning: multi-character character constant [-Wmultichar]
21:11.49 Warning: -Wmultichar in /opt/FirefoxSource/mozilla-release/media/omx-plugin/include/gb/stagefright/MetaData.h: multi-character character constant
21:11.50 /opt/FirefoxSource/mozilla-release/media/omx-plugin/include/gb/stagefright/MetaData.h:66:17: warning: multi-character character constant [-Wmultichar]
21:11.50 Warning: -Wmultichar in /opt/FirefoxSource/mozilla-release/media/omx-plugin/include/gb/stagefright/MetaData.h: multi-character character constant
21:11.50 /opt/FirefoxSource/mozilla-release/media/omx-plugin/include/gb/stagefright/MetaData.h:67:17: warning: multi-character character constant [-Wmultichar]
21:11.50 Warning: -Wmultichar in /opt/FirefoxSource/mozilla-release/media/omx-plugin/include/gb/stagefright/MetaData.h: multi-character character constant
21:11.50 /opt/FirefoxSource/mozilla-release/media/omx-plugin/include/gb/stagefright/MetaData.h:68:16: warning: multi-character character constant [-Wmultichar]
21:11.50 Warning: -Wmultichar in /opt/FirefoxSource/mozilla-release/media/omx-plugin/include/gb/stagefright/MetaData.h: multi-character character constant
21:11.50 /opt/FirefoxSource/mozilla-release/media/omx-plugin/include/gb/stagefright/MetaData.h:69:20: warning: multi-character character constant [-Wmultichar]
21:11.50 Warning: -Wmultichar in /opt/FirefoxSource/mozilla-release/media/omx-plugin/include/gb/stagefright/MetaData.h: multi-character character constant
21:11.50 /opt/FirefoxSource/mozilla-release/media/omx-plugin/include/gb/stagefright/MetaData.h:70:24: warning: multi-character character constant [-Wmultichar]
21:11.50 Warning: -Wmultichar in /opt/FirefoxSource/mozilla-release/media/omx-plugin/include/gb/stagefright/MetaData.h: multi-character character constant
21:11.50 /opt/FirefoxSource/mozilla-release/media/omx-plugin/include/gb/stagefright/MetaData.h:71:18: warning: multi-character character constant [-Wmultichar]
21:11.50 Warning: -Wmultichar in /opt/FirefoxSource/mozilla-release/media/omx-plugin/include/gb/stagefright/MetaData.h: multi-character character constant
21:11.50 /opt/FirefoxSource/mozilla-release/media/omx-plugin/include/gb/stagefright/MetaData.h:72:25: warning: multi-character character constant [-Wmultichar]
21:11.50 Warning: -Wmultichar in /opt/FirefoxSource/mozilla-release/media/omx-plugin/include/gb/stagefright/MetaData.h: multi-character character constant
21:11.50 /opt/FirefoxSource/mozilla-release/media/omx-plugin/include/gb/stagefright/MetaData.h:73:22: warning: multi-character character constant [-Wmultichar]
21:11.50 Warning: -Wmultichar in /opt/FirefoxSource/mozilla-release/media/omx-plugin/include/gb/stagefright/MetaData.h: multi-character character constant
21:11.50 /opt/FirefoxSource/mozilla-release/media/omx-plugin/include/gb/stagefright/MetaData.h:74:16: warning: multi-character character constant [-Wmultichar]
21:11.50 Warning: -Wmultichar in /opt/FirefoxSource/mozilla-release/media/omx-plugin/include/gb/stagefright/MetaData.h: multi-character character constant
21:11.50 /opt/FirefoxSource/mozilla-release/media/omx-plugin/include/gb/stagefright/MetaData.h:75:18: warning: multi-character character constant [-Wmultichar]
21:11.50 Warning: -Wmultichar in /opt/FirefoxSource/mozilla-release/media/omx-plugin/include/gb/stagefright/MetaData.h: multi-character character constant
21:11.50 /opt/FirefoxSource/mozilla-release/media/omx-plugin/include/gb/stagefright/MetaData.h:76:23: warning: multi-character character constant [-Wmultichar]
21:11.50 Warning: -Wmultichar in /opt/FirefoxSource/mozilla-release/media/omx-plugin/include/gb/stagefright/MetaData.h: multi-character character constant
21:11.50 /opt/FirefoxSource/mozilla-release/media/omx-plugin/include/gb/stagefright/MetaData.h:77:21: warning: multi-character character constant [-Wmultichar]
21:11.50 Warning: -Wmultichar in /opt/FirefoxSource/mozilla-release/media/omx-plugin/include/gb/stagefright/MetaData.h: multi-character character constant
21:11.50 /opt/FirefoxSource/mozilla-release/media/omx-plugin/include/gb/stagefright/MetaData.h:80:24: warning: multi-character character constant [-Wmultichar]
21:11.50 Warning: -Wmultichar in /opt/FirefoxSource/mozilla-release/media/omx-plugin/include/gb/stagefright/MetaData.h: multi-character character constant
21:11.50 /opt/FirefoxSource/mozilla-release/media/omx-plugin/include/gb/stagefright/MetaData.h:81:22: warning: multi-character character constant [-Wmultichar]
21:11.50 Warning: -Wmultichar in /opt/FirefoxSource/mozilla-release/media/omx-plugin/include/gb/stagefright/MetaData.h: multi-character character constant
21:11.50 /opt/FirefoxSource/mozilla-release/media/omx-plugin/include/gb/stagefright/MetaData.h:84:27: warning: multi-character character constant [-Wmultichar]
21:11.50 Warning: -Wmultichar in /opt/FirefoxSource/mozilla-release/media/omx-plugin/include/gb/stagefright/MetaData.h: multi-character character constant
21:11.50 /opt/FirefoxSource/mozilla-release/media/omx-plugin/include/gb/stagefright/MetaData.h:85:26: warning: multi-character character constant [-Wmultichar]
21:11.50 Warning: -Wmultichar in /opt/FirefoxSource/mozilla-release/media/omx-plugin/include/gb/stagefright/MetaData.h: multi-character character constant
21:11.50 /opt/FirefoxSource/mozilla-release/media/omx-plugin/include/gb/stagefright/MetaData.h:90:20: warning: multi-character character constant [-Wmultichar]
21:11.50 Warning: -Wmultichar in /opt/FirefoxSource/mozilla-release/media/omx-plugin/include/gb/stagefright/MetaData.h: multi-character character constant
21:11.50 /opt/FirefoxSource/mozilla-release/media/omx-plugin/include/gb/stagefright/MetaData.h:94:27: warning: multi-character character constant [-Wmultichar]
21:11.50 Warning: -Wmultichar in /opt/FirefoxSource/mozilla-release/media/omx-plugin/include/gb/stagefright/MetaData.h: multi-character character constant
21:11.50 /opt/FirefoxSource/mozilla-release/media/omx-plugin/include/gb/stagefright/MetaData.h:95:26: warning: multi-character character constant [-Wmultichar]
21:11.50 Warning: -Wmultichar in /opt/FirefoxSource/mozilla-release/media/omx-plugin/include/gb/stagefright/MetaData.h: multi-character character constant
21:11.50 /opt/FirefoxSource/mozilla-release/media/omx-plugin/include/gb/stagefright/MetaData.h:97:23: warning: multi-character character constant [-Wmultichar]
21:11.50 Warning: -Wmultichar in /opt/FirefoxSource/mozilla-release/media/omx-plugin/include/gb/stagefright/MetaData.h: multi-character character constant
21:11.50 /opt/FirefoxSource/mozilla-release/media/omx-plugin/include/gb/stagefright/MetaData.h:100:20: warning: multi-character character constant [-Wmultichar]
21:11.50 Warning: -Wmultichar in /opt/FirefoxSource/mozilla-release/media/omx-plugin/include/gb/stagefright/MetaData.h: multi-character character constant
21:11.50 /opt/FirefoxSource/mozilla-release/media/omx-plugin/include/gb/stagefright/MetaData.h:102:24: warning: multi-character character constant [-Wmultichar]
21:11.50 Warning: -Wmultichar in /opt/FirefoxSource/mozilla-release/media/omx-plugin/include/gb/stagefright/MetaData.h: multi-character character constant
21:11.50 /opt/FirefoxSource/mozilla-release/media/omx-plugin/include/gb/stagefright/MetaData.h:104:24: warning: multi-character character constant [-Wmultichar]
21:11.50 Warning: -Wmultichar in /opt/FirefoxSource/mozilla-release/media/omx-plugin/include/gb/stagefright/MetaData.h: multi-character character constant
21:11.50 /opt/FirefoxSource/mozilla-release/media/omx-plugin/include/gb/stagefright/MetaData.h:108:17: warning: multi-character character constant [-Wmultichar]
21:11.50 Warning: -Wmultichar in /opt/FirefoxSource/mozilla-release/media/omx-plugin/include/gb/stagefright/MetaData.h: multi-character character constant
21:11.50 /opt/FirefoxSource/mozilla-release/media/omx-plugin/include/gb/stagefright/MetaData.h:109:17: warning: multi-character character constant [-Wmultichar]
21:11.50 Warning: -Wmultichar in /opt/FirefoxSource/mozilla-release/media/omx-plugin/include/gb/stagefright/MetaData.h: multi-character character constant
21:11.50 /opt/FirefoxSource/mozilla-release/media/omx-plugin/include/gb/stagefright/MetaData.h:118:21: warning: multi-character character constant [-Wmultichar]
21:11.50 Warning: -Wmultichar in /opt/FirefoxSource/mozilla-release/media/omx-plugin/include/gb/stagefright/MetaData.h: multi-character character constant
21:11.51 /opt/FirefoxSource/mozilla-release/media/omx-plugin/include/gb/stagefright/MetaData.h:119:25: warning: multi-character character constant [-Wmultichar]
21:11.51 Warning: -Wmultichar in /opt/FirefoxSource/mozilla-release/media/omx-plugin/include/gb/stagefright/MetaData.h: multi-character character constant
21:11.51 /opt/FirefoxSource/mozilla-release/media/omx-plugin/include/gb/stagefright/MetaData.h:120:22: warning: multi-character character constant [-Wmultichar]
21:11.51 Warning: -Wmultichar in /opt/FirefoxSource/mozilla-release/media/omx-plugin/include/gb/stagefright/MetaData.h: multi-character character constant
21:11.51 /opt/FirefoxSource/mozilla-release/media/omx-plugin/include/gb/stagefright/MetaData.h:121:22: warning: multi-character character constant [-Wmultichar]
21:11.51 Warning: -Wmultichar in /opt/FirefoxSource/mozilla-release/media/omx-plugin/include/gb/stagefright/MetaData.h: multi-character character constant
21:11.51 /opt/FirefoxSource/mozilla-release/media/omx-plugin/include/gb/stagefright/MetaData.h:122:22: warning: multi-character character constant [-Wmultichar]
21:11.51 Warning: -Wmultichar in /opt/FirefoxSource/mozilla-release/media/omx-plugin/include/gb/stagefright/MetaData.h: multi-character character constant
21:11.51 /opt/FirefoxSource/mozilla-release/media/omx-plugin/include/gb/stagefright/MetaData.h:123:24: warning: multi-character character constant [-Wmultichar]
21:11.51 libstagefright.so
21:11.51 hdmx.o
21:11.61 OmxPlugin.o
21:12.18 kern.o
21:12.40 libomxplugin.so
21:12.54 libstagefright.o
21:12.69 ltsh.o
21:12.82 In file included from /opt/FirefoxSource/mozilla-release/media/omx-plugin/lib/gb235/libstagefright/../../gb/libstagefright/libstagefright.cpp:12:0,
21:12.82                  from /opt/FirefoxSource/mozilla-release/media/omx-plugin/lib/gb235/libstagefright/libstagefright.cpp:8:
21:12.82 Warning: -Wmultichar in /opt/FirefoxSource/mozilla-release/media/omx-plugin/include/gb/stagefright/MetaData.h: multi-character character constant
21:12.82 /opt/FirefoxSource/mozilla-release/media/omx-plugin/include/gb/stagefright/MetaData.h:32:20: warning: multi-character character constant [-Wmultichar]
21:12.82 Warning: -Wmultichar in /opt/FirefoxSource/mozilla-release/media/omx-plugin/include/gb/stagefright/MetaData.h: multi-character character constant
21:12.82 /opt/FirefoxSource/mozilla-release/media/omx-plugin/include/gb/stagefright/MetaData.h:33:17: warning: multi-character character constant [-Wmultichar]
21:12.82 Warning: -Wmultichar in /opt/FirefoxSource/mozilla-release/media/omx-plugin/include/gb/stagefright/MetaData.h: multi-character character constant
21:12.82 /opt/FirefoxSource/mozilla-release/media/omx-plugin/include/gb/stagefright/MetaData.h:34:18: warning: multi-character character constant [-Wmultichar]
21:12.82 Warning: -Wmultichar in /opt/FirefoxSource/mozilla-release/media/omx-plugin/include/gb/stagefright/MetaData.h: multi-character character constant
21:12.82 /opt/FirefoxSource/mozilla-release/media/omx-plugin/include/gb/stagefright/MetaData.h:35:20: warning: multi-character character constant [-Wmultichar]
21:12.82 Warning: -Wmultichar in /opt/FirefoxSource/mozilla-release/media/omx-plugin/include/gb/stagefright/MetaData.h: multi-character character constant
21:12.82 /opt/FirefoxSource/mozilla-release/media/omx-plugin/include/gb/stagefright/MetaData.h:36:27: warning: multi-character character constant [-Wmultichar]
21:12.82 Warning: -Wmultichar in /opt/FirefoxSource/mozilla-release/media/omx-plugin/include/gb/stagefright/MetaData.h: multi-character character constant
21:12.82 /opt/FirefoxSource/mozilla-release/media/omx-plugin/include/gb/stagefright/MetaData.h:37:18: warning: multi-character character constant [-Wmultichar]
21:12.82 Warning: -Wmultichar in /opt/FirefoxSource/mozilla-release/media/omx-plugin/include/gb/stagefright/MetaData.h: multi-character character constant
21:12.82 /opt/FirefoxSource/mozilla-release/media/omx-plugin/include/gb/stagefright/MetaData.h:38:23: warning: multi-character character constant [-Wmultichar]
21:12.82 Warning: -Wmultichar in /opt/FirefoxSource/mozilla-release/media/omx-plugin/include/gb/stagefright/MetaData.h: multi-character character constant
21:12.82 /opt/FirefoxSource/mozilla-release/media/omx-plugin/include/gb/stagefright/MetaData.h:39:24: warning: multi-character character constant [-Wmultichar]
21:12.82 Warning: -Wmultichar in /opt/FirefoxSource/mozilla-release/media/omx-plugin/include/gb/stagefright/MetaData.h: multi-character character constant
21:12.82 /opt/FirefoxSource/mozilla-release/media/omx-plugin/include/gb/stagefright/MetaData.h:40:22: warning: multi-character character constant [-Wmultichar]
21:12.82 Warning: -Wmultichar in /opt/FirefoxSource/mozilla-release/media/omx-plugin/include/gb/stagefright/MetaData.h: multi-character character constant
21:12.82 /opt/FirefoxSource/mozilla-release/media/omx-plugin/include/gb/stagefright/MetaData.h:41:19: warning: multi-character character constant [-Wmultichar]
21:12.82 Warning: -Wmultichar in /opt/FirefoxSource/mozilla-release/media/omx-plugin/include/gb/stagefright/MetaData.h: multi-character character constant
21:12.82 /opt/FirefoxSource/mozilla-release/media/omx-plugin/include/gb/stagefright/MetaData.h:42:16: warning: multi-character character constant [-Wmultichar]
21:12.82 Warning: -Wmultichar in /opt/FirefoxSource/mozilla-release/media/omx-plugin/include/gb/stagefright/MetaData.h: multi-character character constant
21:12.82 /opt/FirefoxSource/mozilla-release/media/omx-plugin/include/gb/stagefright/MetaData.h:43:16: warning: multi-character character constant [-Wmultichar]
21:12.82 Warning: -Wmultichar in /opt/FirefoxSource/mozilla-release/media/omx-plugin/include/gb/stagefright/MetaData.h: multi-character character constant
21:12.82 /opt/FirefoxSource/mozilla-release/media/omx-plugin/include/gb/stagefright/MetaData.h:44:22: warning: multi-character character constant [-Wmultichar]
21:12.82 Warning: -Wmultichar in /opt/FirefoxSource/mozilla-release/media/omx-plugin/include/gb/stagefright/MetaData.h: multi-character character constant
21:12.82 /opt/FirefoxSource/mozilla-release/media/omx-plugin/include/gb/stagefright/MetaData.h:45:23: warning: multi-character character constant [-Wmultichar]
21:12.82 Warning: -Wmultichar in /opt/FirefoxSource/mozilla-release/media/omx-plugin/include/gb/stagefright/MetaData.h: multi-character character constant
21:12.82 /opt/FirefoxSource/mozilla-release/media/omx-plugin/include/gb/stagefright/MetaData.h:46:29: warning: multi-character character constant [-Wmultichar]
21:12.82 Warning: -Wmultichar in /opt/FirefoxSource/mozilla-release/media/omx-plugin/include/gb/stagefright/MetaData.h: multi-character character constant
21:12.82 /opt/FirefoxSource/mozilla-release/media/omx-plugin/include/gb/stagefright/MetaData.h:47:23: warning: multi-character character constant [-Wmultichar]
21:12.82 Warning: -Wmultichar in /opt/FirefoxSource/mozilla-release/media/omx-plugin/include/gb/stagefright/MetaData.h: multi-character character constant
21:12.82 /opt/FirefoxSource/mozilla-release/media/omx-plugin/include/gb/stagefright/MetaData.h:48:25: warning: multi-character character constant [-Wmultichar]
21:12.82 Warning: -Wmultichar in /opt/FirefoxSource/mozilla-release/media/omx-plugin/include/gb/stagefright/MetaData.h: multi-character character constant
21:12.82 /opt/FirefoxSource/mozilla-release/media/omx-plugin/include/gb/stagefright/MetaData.h:49:16: warning: multi-character character constant [-Wmultichar]
21:12.83 Warning: -Wmultichar in /opt/FirefoxSource/mozilla-release/media/omx-plugin/include/gb/stagefright/MetaData.h: multi-character character constant
21:12.83 /opt/FirefoxSource/mozilla-release/media/omx-plugin/include/gb/stagefright/MetaData.h:50:19: warning: multi-character character constant [-Wmultichar]
21:12.83 Warning: -Wmultichar in /opt/FirefoxSource/mozilla-release/media/omx-plugin/include/gb/stagefright/MetaData.h: multi-character character constant
21:12.83 /opt/FirefoxSource/mozilla-release/media/omx-plugin/include/gb/stagefright/MetaData.h:51:22: warning: multi-character character constant [-Wmultichar]
21:12.83 Warning: -Wmultichar in /opt/FirefoxSource/mozilla-release/media/omx-plugin/include/gb/stagefright/MetaData.h: multi-character character constant
21:12.83 /opt/FirefoxSource/mozilla-release/media/omx-plugin/include/gb/stagefright/MetaData.h:52:21: warning: multi-character character constant [-Wmultichar]
21:12.83 Warning: -Wmultichar in /opt/FirefoxSource/mozilla-release/media/omx-plugin/include/gb/stagefright/MetaData.h: multi-character character constant
21:12.83 /opt/FirefoxSource/mozilla-release/media/omx-plugin/include/gb/stagefright/MetaData.h:53:22: warning: multi-character character constant [-Wmultichar]
21:12.83 Warning: -Wmultichar in /opt/FirefoxSource/mozilla-release/media/omx-plugin/include/gb/stagefright/MetaData.h: multi-character character constant
21:12.83 /opt/FirefoxSource/mozilla-release/media/omx-plugin/include/gb/stagefright/MetaData.h:54:20: warning: multi-character character constant [-Wmultichar]
21:12.83 Warning: -Wmultichar in /opt/FirefoxSource/mozilla-release/media/omx-plugin/include/gb/stagefright/MetaData.h: multi-character character constant
21:12.83 /opt/FirefoxSource/mozilla-release/media/omx-plugin/include/gb/stagefright/MetaData.h:55:23: warning: multi-character character constant [-Wmultichar]
21:12.83 Warning: -Wmultichar in /opt/FirefoxSource/mozilla-release/media/omx-plugin/include/gb/stagefright/MetaData.h: multi-character character constant
21:12.83 /opt/FirefoxSource/mozilla-release/media/omx-plugin/include/gb/stagefright/MetaData.h:56:27: warning: multi-character character constant [-Wmultichar]
21:12.83 Warning: -Wmultichar in /opt/FirefoxSource/mozilla-release/media/omx-plugin/include/gb/stagefright/MetaData.h: multi-character character constant
21:12.83 /opt/FirefoxSource/mozilla-release/media/omx-plugin/include/gb/stagefright/MetaData.h:57:28: warning: multi-character character constant [-Wmultichar]
21:12.83 Warning: -Wmultichar in /opt/FirefoxSource/mozilla-release/media/omx-plugin/include/gb/stagefright/MetaData.h: multi-character character constant
21:12.83 /opt/FirefoxSource/mozilla-release/media/omx-plugin/include/gb/stagefright/MetaData.h:58:20: warning: multi-character character constant [-Wmultichar]
21:12.83 Warning: -Wmultichar in /opt/FirefoxSource/mozilla-release/media/omx-plugin/include/gb/stagefright/MetaData.h: multi-character character constant
21:12.83 /opt/FirefoxSource/mozilla-release/media/omx-plugin/include/gb/stagefright/MetaData.h:59:24: warning: multi-character character constant [-Wmultichar]
21:12.83 Warning: -Wmultichar in /opt/FirefoxSource/mozilla-release/media/omx-plugin/include/gb/stagefright/MetaData.h: multi-character character constant
21:12.83 /opt/FirefoxSource/mozilla-release/media/omx-plugin/include/gb/stagefright/MetaData.h:60:25: warning: multi-character character constant [-Wmultichar]
21:12.83 Warning: -Wmultichar in /opt/FirefoxSource/mozilla-release/media/omx-plugin/include/gb/stagefright/MetaData.h: multi-character character constant
21:12.83 /opt/FirefoxSource/mozilla-release/media/omx-plugin/include/gb/stagefright/MetaData.h:62:17: warning: multi-character character constant [-Wmultichar]
21:12.83 Warning: -Wmultichar in /opt/FirefoxSource/mozilla-release/media/omx-plugin/include/gb/stagefright/MetaData.h: multi-character character constant
21:12.83 /opt/FirefoxSource/mozilla-release/media/omx-plugin/include/gb/stagefright/MetaData.h:63:18: warning: multi-character character constant [-Wmultichar]
21:12.83 Warning: -Wmultichar in /opt/FirefoxSource/mozilla-release/media/omx-plugin/include/gb/stagefright/MetaData.h: multi-character character constant
21:12.83 /opt/FirefoxSource/mozilla-release/media/omx-plugin/include/gb/stagefright/MetaData.h:64:23: warning: multi-character character constant [-Wmultichar]
21:12.83 Warning: -Wmultichar in /opt/FirefoxSource/mozilla-release/media/omx-plugin/include/gb/stagefright/MetaData.h: multi-character character constant
21:12.83 /opt/FirefoxSource/mozilla-release/media/omx-plugin/include/gb/stagefright/MetaData.h:65:20: warning: multi-character character constant [-Wmultichar]
21:12.83 Warning: -Wmultichar in /opt/FirefoxSource/mozilla-release/media/omx-plugin/include/gb/stagefright/MetaData.h: multi-character character constant
21:12.83 /opt/FirefoxSource/mozilla-release/media/omx-plugin/include/gb/stagefright/MetaData.h:66:17: warning: multi-character character constant [-Wmultichar]
21:12.83 Warning: -Wmultichar in /opt/FirefoxSource/mozilla-release/media/omx-plugin/include/gb/stagefright/MetaData.h: multi-character character constant
21:12.83 /opt/FirefoxSource/mozilla-release/media/omx-plugin/include/gb/stagefright/MetaData.h:67:17: warning: multi-character character constant [-Wmultichar]
21:12.83 Warning: -Wmultichar in /opt/FirefoxSource/mozilla-release/media/omx-plugin/include/gb/stagefright/MetaData.h: multi-character character constant
21:12.83 /opt/FirefoxSource/mozilla-release/media/omx-plugin/include/gb/stagefright/MetaData.h:68:16: warning: multi-character character constant [-Wmultichar]
21:12.83 Warning: -Wmultichar in /opt/FirefoxSource/mozilla-release/media/omx-plugin/include/gb/stagefright/MetaData.h: multi-character character constant
21:12.84 /opt/FirefoxSource/mozilla-release/media/omx-plugin/include/gb/stagefright/MetaData.h:69:20: warning: multi-character character constant [-Wmultichar]
21:12.84 Warning: -Wmultichar in /opt/FirefoxSource/mozilla-release/media/omx-plugin/include/gb/stagefright/MetaData.h: multi-character character constant
21:12.84 /opt/FirefoxSource/mozilla-release/media/omx-plugin/include/gb/stagefright/MetaData.h:70:24: warning: multi-character character constant [-Wmultichar]
21:12.84 Warning: -Wmultichar in /opt/FirefoxSource/mozilla-release/media/omx-plugin/include/gb/stagefright/MetaData.h: multi-character character constant
21:12.84 /opt/FirefoxSource/mozilla-release/media/omx-plugin/include/gb/stagefright/MetaData.h:71:18: warning: multi-character character constant [-Wmultichar]
21:12.84 Warning: -Wmultichar in /opt/FirefoxSource/mozilla-release/media/omx-plugin/include/gb/stagefright/MetaData.h: multi-character character constant
21:12.84 /opt/FirefoxSource/mozilla-release/media/omx-plugin/include/gb/stagefright/MetaData.h:72:25: warning: multi-character character constant [-Wmultichar]
21:12.84 Warning: -Wmultichar in /opt/FirefoxSource/mozilla-release/media/omx-plugin/include/gb/stagefright/MetaData.h: multi-character character constant
21:12.84 /opt/FirefoxSource/mozilla-release/media/omx-plugin/include/gb/stagefright/MetaData.h:73:22: warning: multi-character character constant [-Wmultichar]
21:12.84 Warning: -Wmultichar in /opt/FirefoxSource/mozilla-release/media/omx-plugin/include/gb/stagefright/MetaData.h: multi-character character constant
21:12.84 /opt/FirefoxSource/mozilla-release/media/omx-plugin/include/gb/stagefright/MetaData.h:74:16: warning: multi-character character constant [-Wmultichar]
21:12.84 Warning: -Wmultichar in /opt/FirefoxSource/mozilla-release/media/omx-plugin/include/gb/stagefright/MetaData.h: multi-character character constant
21:12.84 /opt/FirefoxSource/mozilla-release/media/omx-plugin/include/gb/stagefright/MetaData.h:75:18: warning: multi-character character constant [-Wmultichar]
21:12.84 Warning: -Wmultichar in /opt/FirefoxSource/mozilla-release/media/omx-plugin/include/gb/stagefright/MetaData.h: multi-character character constant
21:12.84 /opt/FirefoxSource/mozilla-release/media/omx-plugin/include/gb/stagefright/MetaData.h:76:23: warning: multi-character character constant [-Wmultichar]
21:12.84 Warning: -Wmultichar in /opt/FirefoxSource/mozilla-release/media/omx-plugin/include/gb/stagefright/MetaData.h: multi-character character constant
21:12.84 /opt/FirefoxSource/mozilla-release/media/omx-plugin/include/gb/stagefright/MetaData.h:77:21: warning: multi-character character constant [-Wmultichar]
21:12.84 Warning: -Wmultichar in /opt/FirefoxSource/mozilla-release/media/omx-plugin/include/gb/stagefright/MetaData.h: multi-character character constant
21:12.84 /opt/FirefoxSource/mozilla-release/media/omx-plugin/include/gb/stagefright/MetaData.h:80:24: warning: multi-character character constant [-Wmultichar]
21:12.84 Warning: -Wmultichar in /opt/FirefoxSource/mozilla-release/media/omx-plugin/include/gb/stagefright/MetaData.h: multi-character character constant
21:12.84 /opt/FirefoxSource/mozilla-release/media/omx-plugin/include/gb/stagefright/MetaData.h:81:22: warning: multi-character character constant [-Wmultichar]
21:12.84 Warning: -Wmultichar in /opt/FirefoxSource/mozilla-release/media/omx-plugin/include/gb/stagefright/MetaData.h: multi-character character constant
21:12.84 /opt/FirefoxSource/mozilla-release/media/omx-plugin/include/gb/stagefright/MetaData.h:84:27: warning: multi-character character constant [-Wmultichar]
21:12.84 Warning: -Wmultichar in /opt/FirefoxSource/mozilla-release/media/omx-plugin/include/gb/stagefright/MetaData.h: multi-character character constant
21:12.84 /opt/FirefoxSource/mozilla-release/media/omx-plugin/include/gb/stagefright/MetaData.h:85:26: warning: multi-character character constant [-Wmultichar]
21:12.84 Warning: -Wmultichar in /opt/FirefoxSource/mozilla-release/media/omx-plugin/include/gb/stagefright/MetaData.h: multi-character character constant
21:12.84 /opt/FirefoxSource/mozilla-release/media/omx-plugin/include/gb/stagefright/MetaData.h:90:20: warning: multi-character character constant [-Wmultichar]
21:12.84 Warning: -Wmultichar in /opt/FirefoxSource/mozilla-release/media/omx-plugin/include/gb/stagefright/MetaData.h: multi-character character constant
21:12.84 /opt/FirefoxSource/mozilla-release/media/omx-plugin/include/gb/stagefright/MetaData.h:94:27: warning: multi-character character constant [-Wmultichar]
21:12.84 Warning: -Wmultichar in /opt/FirefoxSource/mozilla-release/media/omx-plugin/include/gb/stagefright/MetaData.h: multi-character character constant
21:12.84 /opt/FirefoxSource/mozilla-release/media/omx-plugin/include/gb/stagefright/MetaData.h:95:26: warning: multi-character character constant [-Wmultichar]
21:12.84 Warning: -Wmultichar in /opt/FirefoxSource/mozilla-release/media/omx-plugin/include/gb/stagefright/MetaData.h: multi-character character constant
21:12.84 /opt/FirefoxSource/mozilla-release/media/omx-plugin/include/gb/stagefright/MetaData.h:97:23: warning: multi-character character constant [-Wmultichar]
21:12.85 Warning: -Wmultichar in /opt/FirefoxSource/mozilla-release/media/omx-plugin/include/gb/stagefright/MetaData.h: multi-character character constant
21:12.85 /opt/FirefoxSource/mozilla-release/media/omx-plugin/include/gb/stagefright/MetaData.h:100:20: warning: multi-character character constant [-Wmultichar]
21:12.85 Warning: -Wmultichar in /opt/FirefoxSource/mozilla-release/media/omx-plugin/include/gb/stagefright/MetaData.h: multi-character character constant
21:12.85 /opt/FirefoxSource/mozilla-release/media/omx-plugin/include/gb/stagefright/MetaData.h:102:24: warning: multi-character character constant [-Wmultichar]
21:12.85 Warning: -Wmultichar in /opt/FirefoxSource/mozilla-release/media/omx-plugin/include/gb/stagefright/MetaData.h: multi-character character constant
21:12.85 /opt/FirefoxSource/mozilla-release/media/omx-plugin/include/gb/stagefright/MetaData.h:104:24: warning: multi-character character constant [-Wmultichar]
21:12.85 Warning: -Wmultichar in /opt/FirefoxSource/mozilla-release/media/omx-plugin/include/gb/stagefright/MetaData.h: multi-character character constant
21:12.85 /opt/FirefoxSource/mozilla-release/media/omx-plugin/include/gb/stagefright/MetaData.h:108:17: warning: multi-character character constant [-Wmultichar]
21:12.85 Warning: -Wmultichar in /opt/FirefoxSource/mozilla-release/media/omx-plugin/include/gb/stagefright/MetaData.h: multi-character character constant
21:12.85 /opt/FirefoxSource/mozilla-release/media/omx-plugin/include/gb/stagefright/MetaData.h:109:17: warning: multi-character character constant [-Wmultichar]
21:12.85 Warning: -Wmultichar in /opt/FirefoxSource/mozilla-release/media/omx-plugin/include/gb/stagefright/MetaData.h: multi-character character constant
21:12.85 /opt/FirefoxSource/mozilla-release/media/omx-plugin/include/gb/stagefright/MetaData.h:118:21: warning: multi-character character constant [-Wmultichar]
21:12.85 Warning: -Wmultichar in /opt/FirefoxSource/mozilla-release/media/omx-plugin/include/gb/stagefright/MetaData.h: multi-character character constant
21:12.85 /opt/FirefoxSource/mozilla-release/media/omx-plugin/include/gb/stagefright/MetaData.h:119:25: warning: multi-character character constant [-Wmultichar]
21:12.85 Warning: -Wmultichar in /opt/FirefoxSource/mozilla-release/media/omx-plugin/include/gb/stagefright/MetaData.h: multi-character character constant
21:12.85 /opt/FirefoxSource/mozilla-release/media/omx-plugin/include/gb/stagefright/MetaData.h:120:22: warning: multi-character character constant [-Wmultichar]
21:12.85 Warning: -Wmultichar in /opt/FirefoxSource/mozilla-release/media/omx-plugin/include/gb/stagefright/MetaData.h: multi-character character constant
21:12.85 /opt/FirefoxSource/mozilla-release/media/omx-plugin/include/gb/stagefright/MetaData.h:121:22: warning: multi-character character constant [-Wmultichar]
21:12.85 Warning: -Wmultichar in /opt/FirefoxSource/mozilla-release/media/omx-plugin/include/gb/stagefright/MetaData.h: multi-character character constant
21:12.85 /opt/FirefoxSource/mozilla-release/media/omx-plugin/include/gb/stagefright/MetaData.h:122:22: warning: multi-character character constant [-Wmultichar]
21:12.85 Warning: -Wmultichar in /opt/FirefoxSource/mozilla-release/media/omx-plugin/include/gb/stagefright/MetaData.h: multi-character character constant
21:12.85 /opt/FirefoxSource/mozilla-release/media/omx-plugin/include/gb/stagefright/MetaData.h:123:24: warning: multi-character character constant [-Wmultichar]
21:12.85 libstagefright.so
21:12.94 BionicGlue.o
21:12.94 arm.o
21:13.30 math.o
21:13.67 libmozglue.so
21:13.73 vdmx.o
21:14.14 vorg.o
21:14.17 OmxPlugin236.o
21:14.87 libomxplugingb.so
21:14.93 Unified_cpp_gfx_ots_src0.o
21:14.97 OmxPluginHoneycomb.o
21:15.32 Unified_cpp_gfx_ots_src1.o
21:15.67 libomxpluginhc.so
21:15.74 OmxPlugin235.o
21:16.48 libomxplugingb235.so
21:17.32 Unified_cpp_memory_mozalloc0.o
21:17.66 In file included from /opt/FirefoxSource/mozilla-release/objdir-droid/memory/mozalloc/Unified_cpp_memory_mozalloc0.cpp:11:0:
21:17.66 /opt/FirefoxSource/mozilla-release/memory/mozalloc/mozalloc_abort.cpp: In function 'void abort()':
21:17.66 Warning: enabled by default in /opt/FirefoxSource/mozilla-release/memory/mozalloc/mozalloc_abort.cpp: 'noreturn' function does return
21:17.66 /opt/FirefoxSource/mozilla-release/memory/mozalloc/mozalloc_abort.cpp:76:1: warning: 'noreturn' function does return [enabled by default]
21:17.66 libmozalloc.so
21:17.95 quickder.c: In function 'DecodeItem':
21:17.95 quickder.c:666:12: warning: variable 'optional' set but not used [-Wunused-but-set-variable]
21:18.26 derenc.c: In function 'der_encode':
21:18.26 derenc.c:282:22: warning: variable 'optional' set but not used [-Wunused-but-set-variable]
21:18.92 nssb64e.c: In function 'NSSBase64_EncodeItem_Util':
21:18.92 nssb64e.c:684:15: warning: 'out_len' may be used uninitialized in this function [-Wmaybe-uninitialized]
21:19.29 ocsp.c: In function 'ocsp_RemoveCacheItem':
21:19.29 ocsp.c:562:12: warning: variable 'couldRemoveFromHashTable' set but not used [-Wunused-but-set-variable]
21:19.85 certhigh.c: In function 'CERT_MatchNickname':
21:19.85 certhigh.c:28:9: warning: variable 'len' set but not used [-Wunused-but-set-variable]
21:20.85 secoid.c: In function 'SECOID_Init':
21:20.85 secoid.c:1922:19: warning: variable 'c' set but not used [-Wunused-but-set-variable]
21:21.32 certvfypkix.c: In function 'setRevocationMethod':
21:21.32 certvfypkix.c:1422:17: warning: comparison between signed and unsigned integer expressions [-Wsign-compare]
21:21.58 utilmod.c: In function 'nssutil_DeleteSecmodDBEntry.isra.1':
21:21.58 utilmod.c:545:12: warning: 'lib_len' may be used uninitialized in this function [-Wmaybe-uninitialized]
21:21.93 sechash.c: In function 'HASH_ResultLen':
21:21.93 sechash.c:263:5: warning: comparison of unsigned expression < 0 is always false [-Wtype-limits]
21:21.93 sechash.c: In function 'HASH_HashBuf':
21:21.93 sechash.c:288:5: warning: comparison of unsigned expression < 0 is always false [-Wtype-limits]
21:21.93 sechash.c: In function 'HASH_Create':
21:21.93 sechash.c:310:5: warning: comparison of unsigned expression < 0 is always false [-Wtype-limits]
21:22.07 utilpars.c: In function 'nssutil_mkSlotFlags':
21:22.07 utilpars.c:679:17: warning: comparison between signed and unsigned integer expressions [-Wsign-compare]
21:22.07 utilpars.c: In function 'nssutil_mkCipherFlags':
21:22.07 utilpars.c:891:17: warning: comparison between signed and unsigned integer expressions [-Wsign-compare]
21:22.07 utilpars.c:910:17: warning: comparison between signed and unsigned integer expressions [-Wsign-compare]
21:22.93 pk11akey.c: In function 'pk11_get_Decoded_ECPoint':
21:22.93 pk11akey.c:406:26: warning: comparison between signed and unsigned integer expressions [-Wsign-compare]
21:22.93 pk11akey.c:420:63: warning: comparison between signed and unsigned integer expressions [-Wsign-compare]
21:23.48 alg1485.c: In function 'cert_AVAOidTagToMaxLen':
21:23.48 alg1485.c:162:57: warning: signed and unsigned type in conditional expression [-Wsign-compare]
21:23.48 alg1485.c: In function 'AppendAVA':
21:23.48 alg1485.c:963:40: warning: signed and unsigned type in conditional expression [-Wsign-compare]
21:23.89 libgfx_ots_src.a.desc
21:23.97 pk11cert.c: In function 'pk11_fastCert':
21:23.97 pk11cert.c:231:14: warning: variable 'status' set but not used [-Wunused-but-set-variable]
21:23.97 pk11cert.c: In function 'PK11_TraverseCertsForNicknameInSlot':
21:23.97 pk11cert.c:2008:28: warning: variable 'pk11cb' set but not used [-Wunused-but-set-variable]
21:24.27 certdb.c: In function 'cert_VerifySubjectAltName':
21:24.27 certdb.c:1428:18: warning: variable 'hnLen' set but not used [-Wunused-but-set-variable]
21:24.27 certdb.c: In function 'CERT_ImportCerts':
21:24.27 certdb.c:2440:15: warning: variable 'rv' set but not used [-Wunused-but-set-variable]
21:24.27 certdb.c: In function 'CERT_UnlockCertRefCount':
21:24.27 certdb.c:2890:14: warning: variable 'prstat' set but not used [-Wunused-but-set-variable]
21:24.27 certdb.c: In function 'CERT_UnlockCertTrust':
21:24.27 certdb.c:2970:14: warning: variable 'prstat' set but not used [-Wunused-but-set-variable]
21:24.42 certificate.c: In function 'nssCertificateList_DoCallback':
21:24.42 certificate.c:898:14: warning: variable 'nssrv' set but not used [-Wunused-but-set-variable]
21:25.29 trustdomain.c: In function 'NSSTrustDomain_TraverseCertificates':
21:25.29 trustdomain.c:994:14: warning: variable 'status' set but not used [-Wunused-but-set-variable]
21:25.38 crl.c: In function 'crl_storeCRL':
21:25.38 crl.c:630:15: warning: variable 'rv' set but not used [-Wunused-but-set-variable]
21:25.38 crl.c: In function 'cert_CheckCertRevocationStatus':
21:25.38 crl.c:2688:27: warning: unused variable 'rv2' [-Wunused-variable]
21:25.38 crl.c: In function 'cert_CacheCRLByGeneralName':
21:25.38 crl.c:3045:32: warning: variable 'rv2' set but not used [-Wunused-but-set-variable]
21:25.66 tdcache.c: In function 'add_cert_to_cache':
21:25.66 tdcache.c:775:9: warning: variable 'handle' set but not used [-Wunused-but-set-variable]
21:25.66 tdcache.c: In function 'nssTrustDomain_RemoveCertFromCacheLOCKED':
21:25.66 tdcache.c:272:16: warning: 'nickname' may be used uninitialized in this function [-Wmaybe-uninitialized]
21:25.66 tdcache.c:332:14: note: 'nickname' was declared here
21:26.13 In file included from pk11load.c:26:0:
21:26.13 debug_module.c: In function 'log_handle':
21:26.13 debug_module.c:339:28: warning: comparison between signed and unsigned integer expressions [-Wsign-compare]
21:26.13 debug_module.c:343:28: warning: comparison between signed and unsigned integer expressions [-Wsign-compare]
21:26.13 pk11load.c: In function 'SECMOD_UnloadModule':
21:26.13 pk11load.c:592:28: warning: unused variable 'status' [-Wunused-variable]
21:26.56 pkibase.c: In function 'nssPKIObjectCollection_Traverse':
21:26.56 pkibase.c:906:14: warning: variable 'status' set but not used [-Wunused-but-set-variable]
21:26.56 pkibase.c: In function 'nssCertificateCollection_Create':
21:26.56 pkibase.c:1060:14: warning: variable 'status' set but not used [-Wunused-but-set-variable]
21:26.56 pkibase.c: In function 'nssCRLCollection_Create':
21:26.56 pkibase.c:1167:14: warning: variable 'status' set but not used [-Wunused-but-set-variable]
21:27.01 pk11merge.c: In function 'pk11_matchAcrossTokens':
21:27.01 pk11merge.c:100:32: warning: comparison between signed and unsigned integer expressions [-Wsign-compare]
21:27.02 pki3hack.c: In function 'DeleteCertTrustMatchingSlot':
21:27.02 pki3hack.c:1280:27: warning: comparison between signed and unsigned integer expressions [-Wsign-compare]
21:27.02 pki3hack.c: In function 'STAN_DeleteCertTrustMatchingSlot':
21:27.03 pki3hack.c:1340:19: warning: comparison between signed and unsigned integer expressions [-Wsign-compare]
21:27.88 devtoken.c: In function 'nssToken_TraverseCertificates':
21:27.88 devtoken.c:1469:14: warning: variable 'status' set but not used [-Wunused-but-set-variable]
21:28.00 pk11obj.c: In function 'PK11_MatchItem':
21:28.00 pk11obj.c:1799:72: warning: comparison between signed and unsigned integer expressions [-Wsign-compare]
21:28.00 pk11obj.c:1784:22: warning: variable 'parent' set but not used [-Wunused-but-set-variable]
21:28.28 list.c: In function 'nssList_Add':
21:28.28 list.c:220:14: warning: variable 'nssrv' set but not used [-Wunused-but-set-variable]
21:28.40 pk11pars.c: In function 'secmod_ParseModuleSpecForTokens':
21:28.40 pk11pars.c:364:47: warning: suggest braces around empty body in an 'else' statement [-Wempty-body]
21:28.40 pk11pars.c:366:47: warning: suggest braces around empty body in an 'else' statement [-Wempty-body]
21:28.40 pk11pars.c:375:6: warning: suggest braces around empty body in an 'else' statement [-Wempty-body]
21:28.40 pk11pars.c:384:7: warning: suggest braces around empty body in an 'else' statement [-Wempty-body]
21:28.40 pk11pars.c:393:7: warning: suggest braces around empty body in an 'else' statement [-Wempty-body]
21:28.40 pk11pars.c:402:7: warning: suggest braces around empty body in an 'else' statement [-Wempty-body]
21:28.40 pk11pars.c: In function 'secmod_MkAppendTokensList':
21:28.40 pk11pars.c:767:13: warning: comparison between signed and unsigned integer expressions [-Wsign-compare]
21:28.40 pk11pars.c:804:13: warning: comparison between signed and unsigned integer expressions [-Wsign-compare]
21:28.44 ckhelper.c: In function 'nssCKObject_GetAttributes':
21:28.44 ckhelper.c:139:36: warning: comparison between signed and unsigned integer expressions [-Wsign-compare]
21:28.44 ckhelper.c: In function 'nssCryptokiTrust_GetAttributes':
21:28.44 ckhelper.c:442:36: warning: comparison between signed and unsigned integer expressions [-Wsign-compare]
21:28.49 nsTestSample.o
21:28.69 nsTestSample
21:28.81 ShowSSEConfig.o
21:28.86 ShowSSEConfig
21:28.96 pk11pk12.c: In function 'PK11_ImportPrivateKeyInfoAndReturnKey':
21:28.96 pk11pk12.c:425:17: warning: variable 'keyType' set but not used [-Wunused-but-set-variable]
21:29.12 pk11pqg.c: In function 'PK11_PQG_ParamGenSeedLen':
21:29.12 pk11pqg.c:230:56: warning: signed and unsigned type in conditional expression [-Wsign-compare]
21:29.12 pk11pqg.c: In function 'PK11_PQG_ParamGen':
21:29.12 pk11pqg.c:241:56: warning: signed and unsigned type in conditional expression [-Wsign-compare]
21:29.12 pk11pqg.c: In function 'PK11_PQG_VerifyParams':
21:29.12 pk11pqg.c:295:19: warning: comparison between signed and unsigned integer expressions [-Wsign-compare]
21:29.87 pk11slot.c: In function 'PK11_InitToken':
21:29.87 pk11slot.c:1108:11: warning: variable 'tmp' set but not used [-Wunused-but-set-variable]
21:29.87 pk11slot.c: In function 'PK11_InitSlot':
21:29.87 pk11slot.c:1352:11: warning: variable 'tmp' set but not used [-Wunused-but-set-variable]
21:29.87 pk11slot.c: In function 'PK11_GetBestSlotMultipleWithAttributes':
21:29.87 pk11slot.c:2076:17: warning: comparison between signed and unsigned integer expressions [-Wsign-compare]
21:29.87 pk11slot.c:2094:18: warning: comparison between signed and unsigned integer expressions [-Wsign-compare]
21:29.87 pk11slot.c: In function 'PK11_ResetToken':
21:29.87 pk11slot.c:2317:22: warning: comparison between signed and unsigned integer expressions [-Wsign-compare]
21:29.87 pk11slot.c:2322:22: warning: comparison between signed and unsigned integer expressions [-Wsign-compare]
21:29.97 pk11skey.c: In function 'pk11_TokenKeyGenWithFlagsAndKeyType':
21:29.97 pk11skey.c:926:17: warning: comparison between signed and unsigned integer expressions [-Wsign-compare]
21:29.97 pk11skey.c: In function 'pk11_HandUnwrap':
21:29.97 pk11skey.c:2296:40: warning: signed and unsigned type in conditional expression [-Wsign-compare]
21:30.18 libgkmedias.a.desc
21:30.35 pk11util.c: In function 'SECMOD_UpdateSlotList':
21:30.35 pk11util.c:931:15: warning: comparison between signed and unsigned integer expressions [-Wsign-compare]
21:31.73 pkix_revocationchecker.c: In function 'PKIX_RevocationChecker_Check':
21:31.73 pkix_revocationchecker.c:353:25: warning: comparison between signed and unsigned integer expressions [-Wsign-compare]
21:32.93 pkix_tools.c: In function 'pkix_i2hex':
21:32.93 pkix_tools.c:482:9: warning: comparison is always true due to limited range of data type [-Wtype-limits]
21:34.14 pkix_build.c: In function 'pkix_Build_SelectCertsFromTrustAnchors':
21:34.14 pkix_build.c:1548:38: warning: comparison between signed and unsigned integer expressions [-Wsign-compare]
21:34.71 pkix_errpaths.c: In function 'PKIX_DoReturn':
21:34.71 pkix_errpaths.c:58:2: warning: suggest braces around empty body in an 'if' statement [-Wempty-body]
21:36.53 pkix_pl_cert.c: In function 'PKIX_PL_Cert_Create':
21:36.53 pkix_pl_cert.c:1518:22: warning: variable 'copyDER' set but not used [-Wunused-but-set-variable]
21:37.14 pkix_pl_lifecycle.c: In function 'pkix_pl_lifecycle_ObjectLeakCheck':
21:37.14 pkix_pl_lifecycle.c:87:55: warning: comparison between signed and unsigned integer expressions [-Wsign-compare]
21:37.14 pkix_pl_lifecycle.c: In function 'PKIX_PL_Shutdown':
21:37.14 pkix_pl_lifecycle.c:248:21: warning: variable 'numLeakedObjects' set but not used [-Wunused-but-set-variable]
21:37.26 pkix_pl_httpdefaultclient.c: In function 'pkix_pl_HttpDefaultClient_HdrCheckComplete':
21:37.26 pkix_pl_httpdefaultclient.c:268:32: warning: comparison between signed and unsigned integer expressions [-Wsign-compare]
21:37.26 pkix_pl_httpdefaultclient.c:285:41: warning: comparison between signed and unsigned integer expressions [-Wsign-compare]
21:37.27 pkix_pl_httpdefaultclient.c:293:40: warning: comparison between signed and unsigned integer expressions [-Wsign-compare]
21:37.27 pkix_pl_httpdefaultclient.c: In function 'pkix_pl_HttpDefaultClient_RecvBody':
21:37.27 pkix_pl_httpdefaultclient.c:925:39: warning: comparison between signed and unsigned integer expressions [-Wsign-compare]
21:37.27 pkix_pl_httpdefaultclient.c:940:31: warning: comparison between signed and unsigned integer expressions [-Wsign-compare]
21:37.27 pkix_pl_httpdefaultclient.c:945:31: warning: comparison between signed and unsigned integer expressions [-Wsign-compare]
21:37.27 pkix_pl_httpdefaultclient.c:951:38: warning: comparison between signed and unsigned integer expressions [-Wsign-compare]
21:37.27 pkix_pl_httpdefaultclient.c:995:39: warning: comparison between signed and unsigned integer expressions [-Wsign-compare]
21:37.27 pkix_pl_httpdefaultclient.c:1005:43: warning: comparison between signed and unsigned integer expressions [-Wsign-compare]
21:37.27 pkix_pl_httpdefaultclient.c: In function 'pkix_pl_HttpDefaultClient_KeepAliveSession':
21:37.27 pkix_pl_httpdefaultclient.c:1135:36: warning: variable 'client' set but not used [-Wunused-but-set-variable]
21:37.27 pkix_pl_httpdefaultclient.c: In function 'pkix_pl_HttpDefaultClient_TrySendAndReceive':
21:37.27 pkix_pl_httpdefaultclient.c:1429:63: warning: comparison between signed and unsigned integer expressions [-Wsign-compare]
21:37.27 pkix_pl_httpdefaultclient.c: In function 'pkix_pl_HttpDefaultClient_Cancel':
21:37.27 pkix_pl_httpdefaultclient.c:1487:36: warning: variable 'client' set but not used [-Wunused-but-set-variable]
21:37.96 pkix_pl_crl.c: In function 'pkix_pl_CRL_ToString':
21:37.96 pkix_pl_crl.c:455:58: warning: 'crlVersion' may be used uninitialized in this function [-Wmaybe-uninitialized]
21:37.96 pkix_pl_crl.c:354:21: note: 'crlVersion' was declared here
21:38.19 pkix_pl_object.c: In function 'pkix_pl_Object_GetHeader':
21:38.19 pkix_pl_object.c:115:34: warning: comparison between signed and unsigned integer expressions [-Wsign-compare]
21:38.59 pkix_pl_ldaprequest.c: In function 'pkix_pl_LdapRequest_Destroy':
21:38.59 pkix_pl_ldaprequest.c:266:30: warning: variable 'ldapRq' set but not used [-Wunused-but-set-variable]
21:39.29 pkix_pl_ldapdefaultclient.c: In function 'pkix_pl_LdapDefaultClient_VerifyBindResponse':
21:39.29 pkix_pl_ldapdefaultclient.c:371:21: warning: '*((void *)&msg+16).resultCode.data' may be used uninitialized in this function [-Wmaybe-uninitialized]
21:39.29 pkix_pl_ldapdefaultclient.c:354:21: note: '*((void *)&msg+16).resultCode.data' was declared here
21:40.08 nssinit.c: In function 'NSS_VersionCheck':
21:40.09 nssinit.c:1250:19: warning: variable 'c' set but not used [-Wunused-but-set-variable]
21:40.16 pkix_pl_pk11certstore.c: In function 'NameCacheHasFetchedCrlInfo':
21:40.16 pkix_pl_pk11certstore.c:382:22: warning: variable 'cert' set but not used [-Wunused-but-set-variable]
21:40.16 pkix_pl_pk11certstore.c: In function 'RemovePartitionedDpsFromList':
21:40.16 pkix_pl_pk11certstore.c:701:20: warning: comparison between signed and unsigned integer expressions [-Wsign-compare]
21:40.17 pkix_pl_pk11certstore.c: In function 'DownloadCrl':
21:40.17 pkix_pl_pk11certstore.c:782:16: warning: variable 'savedError' set but not used [-Wunused-but-set-variable]
21:40.89 pkix_pl_publickey.c: In function 'pkix_pl_PublicKey_Hashcode':
21:40.89 pkix_pl_publickey.c:214:21: warning: variable 'fullHash' set but not used [-Wunused-but-set-variable]
21:41.00 dtlscon.c: In function 'ssl3_DisableNonDTLSSuites':
21:41.00 dtlscon.c:107:19: warning: unused variable 'rv' [-Wunused-variable]
21:41.00 dtlscon.c: In function 'dtls_HandleHandshake':
21:41.00 dtlscon.c:399:37: warning: comparison between signed and unsigned integer expressions [-Wsign-compare]
21:41.00 dtlscon.c:428:48: warning: comparison between signed and unsigned integer expressions [-Wsign-compare]
21:41.00 dtlscon.c: In function 'dtls_TransmitMessageFlight':
21:41.00 dtlscon.c:679:60: warning: comparison between signed and unsigned integer expressions [-Wsign-compare]
21:41.00 dtlscon.c:679:120: warning: signed and unsigned type in conditional expression [-Wsign-compare]
21:41.00 dtlscon.c:717:26: warning: comparison between signed and unsigned integer expressions [-Wsign-compare]
21:41.00 dtlscon.c: In function 'dtls_SetMTU':
21:41.00 dtlscon.c:952:19: warning: comparison between signed and unsigned integer expressions [-Wsign-compare]
21:41.18 ssl3gthr.c: In function 'ssl3_GatherData':
21:41.18 ssl3gthr.c:75:9: warning: comparison between signed and unsigned integer expressions [-Wsign-compare]
21:41.35 sslauth.c: In function 'SSL_AuthCertificate':
21:41.35 sslauth.c:267:18: warning: unused variable 'error' [-Wunused-variable]
21:42.16 sslcon.c: In function 'ssl2_SendClear':
21:42.16 sslcon.c:865:17: warning: comparison between signed and unsigned integer expressions [-Wsign-compare]
21:42.16 sslcon.c:894:19: warning: comparison between signed and unsigned integer expressions [-Wsign-compare]
21:42.16 sslcon.c: In function 'ssl2_SendStream':
21:42.16 sslcon.c:944:13: warning: comparison between signed and unsigned integer expressions [-Wsign-compare]
21:42.16 sslcon.c:991:19: warning: comparison between signed and unsigned integer expressions [-Wsign-compare]
21:42.16 sslcon.c: In function 'ssl2_SendBlock':
21:42.16 sslcon.c:1058:13: warning: comparison between signed and unsigned integer expressions [-Wsign-compare]
21:42.16 sslcon.c: In function 'ssl2_ServerSetupSessionCypher':
21:42.16 sslcon.c:1624:15: warning: comparison between signed and unsigned integer expressions [-Wsign-compare]
21:42.16 sslcon.c:1648:20: warning: comparison between signed and unsigned integer expressions [-Wsign-compare]
21:42.16 sslcon.c: In function 'ssl2_HandleMessage':
21:42.16 sslcon.c:2498:9: warning: variable 'rv2' set but not used [-Wunused-but-set-variable]
21:42.16 sslcon.c: In function 'ssl2_HandleServerHelloMessage':
21:42.16 sslcon.c:2802:51: warning: comparison between signed and unsigned integer expressions [-Wsign-compare]
21:42.16 sslcon.c:2813:16: warning: comparison between signed and unsigned integer expressions [-Wsign-compare]
21:42.16 sslcon.c:2815:23: warning: comparison between signed and unsigned integer expressions [-Wsign-compare]
21:42.16 sslcon.c:2815:65: warning: signed and unsigned type in conditional expression [-Wsign-compare]
21:42.16 sslcon.c: In function 'NSSSSL_VersionCheck':
21:42.16 sslcon.c:3687:19: warning: variable 'c' set but not used [-Wunused-but-set-variable]
21:42.72 certread.c: In function 'CERT_DecodeCertPackage':
21:42.72 certread.c:419:16: warning: comparison between signed and unsigned integer expressions [-Wsign-compare]
21:42.72 certread.c:447:13: warning: comparison between signed and unsigned integer expressions [-Wsign-compare]
21:43.01 p12e.c: In function 'sec_PKCS12CreateSafeBag':
21:43.01 p12e.c:698:12: warning: variable 'setName' set but not used [-Wunused-but-set-variable]
21:43.01 p12e.c: In function 'sec_pkcs12_encoder_start_context':
21:43.01 p12e.c:1535:12: warning: variable 'rv' set but not used [-Wunused-but-set-variable]
21:43.45 ssl3con.c: In function 'ssl3_CompressMACEncryptRecord':
21:43.45 ssl3con.c:2559:12: warning: comparison between signed and unsigned integer expressions [-Wsign-compare]
21:43.45 ssl3con.c: In function 'ssl3_FlushHandshakeMessages':
21:43.45 ssl3con.c:3122:19: warning: comparison between signed and unsigned integer expressions [-Wsign-compare]
21:43.45 ssl3con.c: In function 'ssl3_HandleClientHello':
21:43.45 ssl3con.c:7781:23: warning: comparison between signed and unsigned integer expressions [-Wsign-compare]
21:43.45 ssl3con.c:8285:28: warning: comparison between signed and unsigned integer expressions [-Wsign-compare]
21:43.45 ssl3con.c: In function 'ssl3_HandleRSAClientKeyExchange':
21:43.45 ssl3con.c:9211:13: warning: variable 'pmsItem' set but not used [-Wunused-but-set-variable]
21:43.45 ssl3con.c:9207:12: warning: variable 'isTLS' set but not used [-Wunused-but-set-variable]
21:43.45 ssl3con.c: In function 'ssl3_HandleCertificateStatus':
21:43.45 ssl3con.c:9779:13: warning: comparison between signed and unsigned integer expressions [-Wsign-compare]
21:43.45 ssl3con.c: In function 'ssl3_HandleHandshakeMessage':
21:43.45 ssl3con.c:6950:22: warning: 'preferSha1' may be used uninitialized in this function [-Wmaybe-uninitialized]
21:43.45 ssl3con.c:6916:12: note: 'preferSha1' was declared here
21:43.45 ssl3con.c: In function 'ssl3_HandleRecord':
21:43.45 ssl3con.c:11589:21: warning: 'dtls_seq_num' may be used uninitialized in this function [-Wmaybe-uninitialized]
21:43.45 ssl3con.c:11309:14: note: 'dtls_seq_num' was declared here
21:43.59 p7decode.c: In function 'sec_pkcs7_verify_signature':
21:43.59 p7decode.c:1293:21: warning: variable 'crls' set but not used [-Wunused-but-set-variable]
21:43.86 p7encode.c: In function 'sec_pkcs7_encoder_start_encrypt':
21:43.86 p7encode.c:62:18: warning: variable 'wincx' set but not used [-Wunused-but-set-variable]
21:44.12 p7local.c: In function 'sec_PKCS7Decrypt':
21:44.12 p7local.c:556:28: warning: comparison between signed and unsigned integer expressions [-Wsign-compare]
21:44.27 ssl3ext.c: In function 'arrayContainsExtension':
21:44.27 ssl3ext.c:310:19: warning: comparison between signed and unsigned integer expressions [-Wsign-compare]
21:44.27 ssl3ext.c: In function 'ssl3_HandleServerNameXtn':
21:44.27 ssl3ext.c:417:43: warning: comparison between signed and unsigned integer expressions [-Wsign-compare]
21:44.27 ssl3ext.c:425:17: warning: variable 'type' set but not used [-Wunused-but-set-variable]
21:44.27 ssl3ext.c:457:22: warning: comparison between signed and unsigned integer expressions [-Wsign-compare]
21:44.27 ssl3ext.c:458:31: warning: comparison between signed and unsigned integer expressions [-Wsign-compare]
21:44.27 ssl3ext.c: In function 'ssl3_SendSessionTicketXtn':
21:44.27 ssl3ext.c:538:28: warning: comparison between signed and unsigned integer expressions [-Wsign-compare]
21:44.27 ssl3ext.c:561:25: warning: comparison between signed and unsigned integer expressions [-Wsign-compare]
21:44.27 ssl3ext.c: In function 'ssl3_ServerHandleAppProtoXtn':
21:44.27 ssl3ext.c:681:15: warning: comparison between signed and unsigned integer expressions [-Wsign-compare]
21:44.28 ssl3ext.c: In function 'ssl3_ClientSendNextProtoNegoXtn':
21:44.28 ssl3ext.c:782:28: warning: comparison between signed and unsigned integer expressions [-Wsign-compare]
21:44.28 ssl3ext.c:792:25: warning: comparison between signed and unsigned integer expressions [-Wsign-compare]
21:44.28 ssl3ext.c: In function 'ssl3_ClientSendAppProtoXtn':
21:44.28 ssl3ext.c:817:28: warning: comparison between signed and unsigned integer expressions [-Wsign-compare]
21:44.28 ssl3ext.c:857:25: warning: comparison between signed and unsigned integer expressions [-Wsign-compare]
21:44.28 ssl3ext.c: In function 'ssl3_ServerSendAppProtoXtn':
21:44.28 ssl3ext.c:886:28: warning: comparison between signed and unsigned integer expressions [-Wsign-compare]
21:44.28 ssl3ext.c:905:25: warning: comparison between signed and unsigned integer expressions [-Wsign-compare]
21:44.28 ssl3ext.c: In function 'ssl3_ServerSendStatusRequestXtn':
21:44.28 ssl3ext.c:952:28: warning: comparison between signed and unsigned integer expressions [-Wsign-compare]
21:44.28 ssl3ext.c: In function 'ssl3_ClientSendStatusRequestXtn':
21:44.28 ssl3ext.c:985:28: warning: comparison between signed and unsigned integer expressions [-Wsign-compare]
21:44.28 ssl3ext.c:1013:25: warning: comparison between signed and unsigned integer expressions [-Wsign-compare]
21:44.28 ssl3ext.c: In function 'ssl3_SendNewSessionTicket':
21:44.28 ssl3ext.c:1249:19: warning: comparison between signed and unsigned integer expressions [-Wsign-compare]
21:44.28 ssl3ext.c: In function 'ssl3_ServerHandleSessionTicketXtn':
21:44.28 ssl3ext.c:1587:23: warning: comparison between signed and unsigned integer expressions [-Wsign-compare]
21:44.28 ssl3ext.c: In function 'ssl3_SendRenegotiationInfoXtn':
21:44.28 ssl3ext.c:1981:28: warning: comparison between signed and unsigned integer expressions [-Wsign-compare]
21:44.28 ssl3ext.c: In function 'ssl3_ClientSendSigAlgsXtn':
21:44.28 ssl3ext.c:2356:28: warning: comparison between signed and unsigned integer expressions [-Wsign-compare]
21:44.28 ssl3ext.c:2370:25: warning: comparison between signed and unsigned integer expressions [-Wsign-compare]
21:44.28 ssl3ext.c: In function 'ssl3_ClientSendDraftVersionXtn':
21:44.28 ssl3ext.c:2446:28: warning: comparison between signed and unsigned integer expressions [-Wsign-compare]
21:44.28 ssl3ext.c:2459:25: warning: comparison between signed and unsigned integer expressions [-Wsign-compare]
21:44.60 cmscipher.c: In function 'NSS_CMSCipherContext_Decrypt':
21:44.60 cmscipher.c:525:28: warning: comparison between signed and unsigned integer expressions [-Wsign-compare]
21:44.66 /opt/FirefoxSource/mozilla-release/config/external/nss/nss.def: WARNING: no preprocessor directives found
21:44.70 /opt/FirefoxSource/mozilla-release/config/external/nss/nspr-dummy.def: WARNING: no preprocessor directives found
21:45.38 crmfpop.c: In function 'CRMF_CertReqMsgSetRAVerifiedPOP':
21:45.38 crmfpop.c:36:14: warning: variable 'dummy' set but not used [-Wunused-but-set-variable]
21:45.38 crmfpop.c: In function 'crmf_generic_encoder_callback':
21:45.38 crmfpop.c:119:38: warning: comparison between signed and unsigned integer expressions [-Wsign-compare]
21:45.38 crmfpop.c: In function 'crmf_encode_popoprivkey':
21:45.38 crmfpop.c:349:33: warning: comparison between signed and unsigned integer expressions [-Wsign-compare]
21:45.43 cmsencode.c: In function 'nss_cms_encoder_notify':
21:45.43 cmsencode.c:125:18: warning: variable 'poolp' set but not used [-Wunused-but-set-variable]
21:45.43 cmsencode.c: In function 'nss_cms_before_data':
21:45.43 cmsencode.c:204:18: warning: variable 'poolp' set but not used [-Wunused-but-set-variable]
21:45.52 sslsecur.c: In function 'SSL_ConfigSecureServerWithCertChain':
21:45.52 sslsecur.c:847:5: warning: comparison of unsigned expression < 0 is always false [-Wtype-limits]
21:45.52 sslsecur.c: In function 'ssl_SecureRecv':
21:45.52 sslsecur.c:1180:22: warning: variable 'sec' set but not used [-Wunused-but-set-variable]
21:46.01 crmfcont.c: In function 'CRMF_CreateEncryptedKeyWithEncryptedValue':
21:46.01 crmfcont.c:860:25: warning: variable 'dummy' set but not used [-Wunused-but-set-variable]
21:46.03 cmsrecinfo.c: In function 'NSS_CMSRecipientInfo_UnwrapBulkKey':
21:46.03 cmsrecinfo.c:529:21: warning: variable 'encalg' set but not used [-Wunused-but-set-variable]
21:46.60 cmmfchal.c: In function 'cmmf_create_witness_and_challenge':
21:46.60 cmmfchal.c:33:22: warning: variable 'id' set but not used [-Wunused-but-set-variable]
21:46.88 sslsock.c: In function 'ssl_WriteV':
21:46.88 sslsock.c:2524:30: warning: comparison between signed and unsigned integer expressions [-Wsign-compare]
21:46.88 sslsock.c:2537:68: warning: comparison between signed and unsigned integer expressions [-Wsign-compare]
21:46.88 sslsock.c:2556:28: warning: comparison between signed and unsigned integer expressions [-Wsign-compare]
21:46.88 sslsock.c:2556:59: warning: signed and unsigned type in conditional expression [-Wsign-compare]
21:46.88 sslsock.c:2559:23: warning: comparison between signed and unsigned integer expressions [-Wsign-compare]
21:46.88 sslsock.c:2565:56: warning: comparison between signed and unsigned integer expressions [-Wsign-compare]
21:47.78 sslinfo.c: In function 'SSL_DisableDefaultExportCipherSuites':
21:47.78 sslinfo.c:247:15: warning: variable 'rv' set but not used [-Wunused-but-set-variable]
21:47.78 sslinfo.c: In function 'SSL_DisableExportCipherSuites':
21:47.78 sslinfo.c:268:15: warning: variable 'rv' set but not used [-Wunused-but-set-variable]
21:47.78 smimeutil.c: In function 'NSSSMIME_VersionCheck':
21:47.78 smimeutil.c:770:19: warning: variable 'c' set but not used [-Wunused-but-set-variable]
21:47.78 smimeutil.c: In function 'NSS_SMIMEUtil_FindBulkAlgForRecipients':
21:47.78 smimeutil.c:446:9: warning: 'key_type' may be used uninitialized in this function [-Wmaybe-uninitialized]
21:47.78 smimeutil.c:425:14: note: 'key_type' was declared here
21:48.14 ssl3ecc.c: In function 'ssl3_DisableECCSuites':
21:48.14 ssl3ecc.c:969:19: warning: unused variable 'rv' [-Wunused-variable]
21:48.14 ssl3ecc.c: In function 'ssl3_SendSupportedCurvesXtn':
21:48.14 ssl3ecc.c:1130:28: warning: comparison between signed and unsigned integer expressions [-Wsign-compare]
21:48.14 ssl3ecc.c: In function 'ssl3_HandleSupportedCurvesXtn':
21:48.14 ssl3ecc.c:1238:35: warning: comparison between signed and unsigned integer expressions [-Wsign-compare]
21:48.30 libnss3.so
21:48.32 basicutil.c: In function 'SECU_PrintPRandOSError':
21:48.32 basicutil.c:628:30: warning: comparison between signed and unsigned integer expressions [-Wsign-compare]
21:48.32 basicutil.c:632:30: warning: comparison between signed and unsigned integer expressions [-Wsign-compare]
21:48.32 basicutil.c: In function 'SECU_SECItemHexStringToBinary':
21:48.32 basicutil.c:705:16: warning: comparison between signed and unsigned integer expressions [-Wsign-compare]
21:48.32 basicutil.c:716:16: warning: comparison between signed and unsigned integer expressions [-Wsign-compare]
21:48.32 basicutil.c: In function 'SECU_PrintAsHex':
21:48.32 basicutil.c:286:13: warning: 'column' may be used uninitialized in this function [-Wmaybe-uninitialized]
21:48.63 jarsign.c: In function 'jar_create_pk7':
21:48.63 jarsign.c:174:11: warning: variable 'errstring' set but not used [-Wunused-but-set-variable]
21:48.85 jar.c: In function 'JAR_find_next':
21:48.85 jar.c:423:30: warning: comparison between signed and unsigned integer expressions [-Wsign-compare]
21:48.85 jar.c: In function 'jar_find_first_cert':
21:48.85 jar.c:462:24: warning: comparison between signed and unsigned integer expressions [-Wsign-compare]
21:49.51 jarfile.c: In function 'jar_physical_inflate':
21:49.51 jarfile.c:341:32: warning: comparison between signed and unsigned integer expressions [-Wsign-compare]
21:49.51 jarfile.c:356:38: warning: comparison between signed and unsigned integer expressions [-Wsign-compare]
21:49.51 jarfile.c: In function 'jar_extract_mf':
21:49.51 jarfile.c:578:14: warning: comparison between signed and unsigned integer expressions [-Wsign-compare]
21:49.51 jarfile.c: In function 'jar_listzip':
21:49.51 jarfile.c:702:47: warning: comparison between signed and unsigned integer expressions [-Wsign-compare]
21:49.51 jarfile.c:768:43: warning: comparison between signed and unsigned integer expressions [-Wsign-compare]
21:49.51 jarfile.c: In function 'jar_listtar':
21:49.51 jarfile.c:830:45: warning: comparison between signed and unsigned integer expressions [-Wsign-compare]
21:49.51 jarfile.c:824:12: warning: variable 'when' set but not used [-Wunused-but-set-variable]
21:49.51 jarfile.c:823:14: warning: variable 'mode' set but not used [-Wunused-but-set-variable]
21:49.63 secutil.c: In function 'SECU_ChangePW2':
21:49.63 secutil.c:336:15: warning: variable 'rv' set but not used [-Wunused-but-set-variable]
21:49.63 secutil.c: In function 'SECU_PrintDumpDerIssuerAndSerial':
21:49.63 secutil.c:1554:19: warning: comparison between signed and unsigned integer expressions [-Wsign-compare]
21:49.63 secutil.c: In function 'secu_PrintPKCS7Signed':
21:49.63 secutil.c:2706:11: warning: passing argument 5 of 'SECU_PrintSignedData' from incompatible pointer type [enabled by default]
21:49.63 In file included from secutil.c:19:0:
21:49.63 secutil.h:260:12: note: expected 'SECU_PPFunc' but argument is of type 'int (*)(struct FILE *, const struct SECItem *, const char *, int)'
21:49.63 secutil.c: In function 'secu_PrintPKCS7SignedAndEnveloped':
21:49.63 secutil.c:2825:11: warning: passing argument 5 of 'SECU_PrintSignedData' from incompatible pointer type [enabled by default]
21:49.63 In file included from secutil.c:19:0:
21:49.63 secutil.h:260:12: note: expected 'SECU_PPFunc' but argument is of type 'int (*)(struct FILE *, const struct SECItem *, const char *, int)'
21:49.63 secutil.c: In function 'SEC_PrintCertificateAndTrust':
21:49.63 secutil.c:3155:10: warning: passing argument 5 of 'SECU_PrintSignedData' from incompatible pointer type [enabled by default]
21:49.63 secutil.c:3128:5: note: expected 'SECU_PPFunc' but argument is of type 'int (*)(struct FILE *, const struct SECItem *, const char *, int)'
21:49.63 secutil.c: In function 'SECU_StoreCRL':
21:49.63 secutil.c:3327:62: warning: comparison between signed and unsigned integer expressions [-Wsign-compare]
21:49.93 derprint.c: In function 'prettyPrintLength':
21:49.93 derprint.c:454:20: warning: comparison between signed and unsigned integer expressions [-Wsign-compare]
21:52.10 shlibsign.c: In function 'writeItem':
21:52.10 shlibsign.c:150:22: warning: comparison between signed and unsigned integer expressions [-Wsign-compare]
21:52.10 shlibsign.c: In function 'main':
21:52.10 shlibsign.c:908:40: warning: comparison between signed and unsigned integer expressions [-Wsign-compare]
21:52.12 cd mangle; /usr/bin/make libs
21:52.30 mkdir: das Verzeichnis „/opt/FirefoxSource/mozilla-release/objdir-droid/security/nss/lib/freebl“ kann nicht angelegt werden: Die Datei existiert bereits
21:52.67 loader.c: In function 'freebl_LoadDSO':
21:52.67 loader.c:135:14: warning: variable 'status' set but not used [-Wunused-but-set-variable]
21:52.67 loader.c: In function 'BL_Unload':
21:52.67 loader.c:904:20: warning: unused variable 'status' [-Wunused-variable]
21:52.84 ldvector.c: In function 'FREEBL_GetVector':
21:52.84 ldvector.c:301:19: warning: variable 'c' set but not used [-Wunused-but-set-variable]
21:53.36 token.c: In function 'nssCKFWToken_GetUTCTime':
21:53.36 token.c:1261:27: warning: variable 'z' set but not used [-Wunused-but-set-variable]
21:54.14 libdombindings_test_s.a.desc
21:54.37 rawhash.c: In function 'HASH_GetRawHashObject':
21:54.37 rawhash.c:156:5: warning: comparison of unsigned expression < 0 is always false [-Wtype-limits]
21:54.51 cd builtins; /usr/bin/make libs
21:54.85 keystuff.c: In function 'UpdateRNG':
21:54.85 keystuff.c:96:18: warning: comparison between signed and unsigned integer expressions [-Wsign-compare]
21:55.04 bfind.c: In function 'builtins_attrmatch':
21:55.04 bfind.c:122:11: warning: comparison between signed and unsigned integer expressions [-Wsign-compare]
21:55.12 binst.c: In function 'builtins_mdInstance_GetLibraryVersion':
21:55.12 binst.c:70:17: warning: variable 'c' set but not used [-Wunused-but-set-variable]
21:55.21 sha512.c: In function 'SHA512_Compress':
21:55.21 sha512.c:933:14: warning: unused variable 't1' [-Wunused-variable]
21:55.21 sha512.c:955:18: warning: unused variable 't2' [-Wunused-variable]
21:55.21 sha512.c:955:14: warning: unused variable 't1' [-Wunused-variable]
21:55.21 sha512.c: In function 'SHA512_End':
21:55.21 sha512.c:1229:14: warning: unused variable 't1' [-Wunused-variable]
21:55.21 sha512.c: In function 'SHA512_EndRaw':
21:55.21 sha512.c:1274:14: warning: unused variable 't1' [-Wunused-variable]
21:55.31 pk12util.c: In function 'p12u_InitContext':
21:55.31 pk12util.c:104:12: warning: variable 'fileExist' set but not used [-Wunused-but-set-variable]
21:55.31 pk12util.c: In function 'P12U_ListPKCS12File':
21:55.31 pk12util.c:762:30: warning: passing argument 5 of 'SECU_PrintSignedData' from incompatible pointer type [enabled by default]
21:55.31 In file included from pk12util.c:11:0:
21:55.31 /opt/FirefoxSource/mozilla-release/objdir-droid/dist/private/nss/secutil.h:260:12: note: expected 'SECU_PPFunc' but argument is of type 'int (*)(struct FILE *, const struct SECItem *, const char *, int)'
21:55.70 pk11.c: In function 'ListModule':
21:55.70 pk11.c:612:16: warning: comparison between signed and unsigned integer expressions [-Wsign-compare]
21:55.76 cts.c: In function 'CTS_DecryptUpdate':
21:55.76 cts.c:226:23: warning: comparison between signed and unsigned integer expressions [-Wsign-compare]
21:56.01 ytab.c: In function 'Pk11Install_yyparse':
21:56.01 ytab.c:219:5: warning: suggest parentheses around assignment used as truth value [-Wparentheses]
21:56.13 gcm.c: In function 'gcm_getX':
21:56.13 gcm.c:223:13: warning: comparison between signed and unsigned integer expressions [-Wsign-compare]
21:56.30 lex.Pk11Install_yy.cpp:1060:13: warning: 'Pkcs11Install_yyunput' defined but not used [-Wunused-function]
21:56.30 lex.Pk11Install_yy.cpp:1106:12: warning: 'input' defined but not used [-Wunused-function]
21:56.58 dh.c: In function 'DH_Derive':
21:56.58 dh.c:271:13: warning: comparison between signed and unsigned integer expressions [-Wsign-compare]
21:56.70 ecdecode.c: In function 'gf_populate_params':
21:56.70 ecdecode.c:120:5: warning: comparison of unsigned expression < 0 is always false [-Wtype-limits]
21:56.82 ec.c: In function 'ec_points_mul':
21:56.82 ec.c:89:17: warning: comparison between signed and unsigned integer expressions [-Wsign-compare]
21:56.82 ec.c: In function 'EC_ValidatePublicKey':
21:56.82 ec.c:450:33: warning: comparison between signed and unsigned integer expressions [-Wsign-compare]
21:57.09 dsa.c: In function 'DSA_VerifyDigest':
21:57.09 dsa.c:518:25: warning: comparison between signed and unsigned integer expressions [-Wsign-compare]
21:57.09 dsa.c:530:27: warning: comparison between signed and unsigned integer expressions [-Wsign-compare]
21:57.17 pqg.c: In function 'makePrimefromPrimesShaweTaylor':
21:57.17 pqg.c:617:34: warning: comparison between signed and unsigned integer expressions [-Wsign-compare]
21:57.17 pqg.c:687:28: warning: comparison between signed and unsigned integer expressions [-Wsign-compare]
21:57.17 pqg.c: In function 'makePrimefromSeedShaweTaylor':
21:57.17 pqg.c:849:28: warning: comparison between signed and unsigned integer expressions [-Wsign-compare]
21:57.17 pqg.c: In function 'pqg_ParamGen':
21:57.17 pqg.c:1232:18: warning: variable 'b' set but not used [-Wunused-but-set-variable]
21:57.17 pqg.c: In function 'PQG_VerifyParams':
21:57.17 pqg.c:1614:50: warning: comparison between signed and unsigned integer expressions [-Wsign-compare]
21:57.17 pqg.c:1672:25: warning: comparison between signed and unsigned integer expressions [-Wsign-compare]
21:57.17 pqg.c:1708:18: warning: comparison between signed and unsigned integer expressions [-Wsign-compare]
21:57.17 pqg.c:1709:25: warning: comparison between signed and unsigned integer expressions [-Wsign-compare]
21:57.17 pqg.c:1710:33: warning: comparison between signed and unsigned integer expressions [-Wsign-compare]
21:57.17 pqg.c:1733:29: warning: comparison between signed and unsigned integer expressions [-Wsign-compare]
21:57.17 pqg.c:1775:27: warning: 'type' may be used uninitialized in this function [-Wmaybe-uninitialized]
21:57.17 pqg.c:1595:16: note: 'type' was declared here
21:57.17 pqg.c:1777:5: warning: 'hashtype' may be used uninitialized in this function [-Wmaybe-uninitialized]
21:57.17 pqg.c:1594:19: note: 'hashtype' was declared here
21:57.29 shvfy.c: In function 'readItem':
21:57.29 shvfy.c:267:19: warning: comparison between signed and unsigned integer expressions [-Wsign-compare]
21:57.36 rsa.c: In function 'RSA_NewKey':
21:57.36 rsa.c:251:29: warning: comparison between signed and unsigned integer expressions [-Wsign-compare]
21:57.36 rsa.c: In function 'rsa_get_primes_from_exponents':
21:57.36 rsa.c:482:52: warning: comparison between signed and unsigned integer expressions [-Wsign-compare]
21:57.57 mpi/mpprime.c: In function 'mpp_make_prime':
21:57.57 mpi/mpprime.c:445:47: warning: comparison between signed and unsigned integer expressions [-Wsign-compare]
21:57.68 mpi/mplogic.c: In function 'mpl_num_set':
21:57.68 mpi/mplogic.c:230:20: warning: comparison between signed and unsigned integer expressions [-Wsign-compare]
21:57.68 mpi/mplogic.c: In function 'mpl_num_clear':
21:57.68 mpi/mplogic.c:260:20: warning: comparison between signed and unsigned integer expressions [-Wsign-compare]
21:58.40 ecl/ecp_521.c: In function 'ec_GFp_nistp521_mod':
21:58.40 ecl/ecp_521.c:42:73: warning: comparison between signed and unsigned integer expressions [-Wsign-compare]
21:58.40 ecl/ecp_521.c:50:18: warning: comparison between signed and unsigned integer expressions [-Wsign-compare]
21:58.63 mpi/mpi.c: In function 'mp_expt':
21:58.63 mpi/mpi.c:1114:20: warning: comparison between signed and unsigned integer expressions [-Wsign-compare]
21:58.63 mpi/mpi.c:1118:22: warning: comparison between signed and unsigned integer expressions [-Wsign-compare]
21:58.63 mpi/mpi.c: In function 's_mp_exptmod':
21:58.63 mpi/mpi.c:1497:20: warning: comparison between signed and unsigned integer expressions [-Wsign-compare]
21:58.63 mpi/mpi.c:1501:22: warning: comparison between signed and unsigned integer expressions [-Wsign-compare]
21:58.63 mpi/mpi.c: In function 'mp_trailing_zeros':
21:58.63 mpi/mpi.c:2012:45: warning: comparison between signed and unsigned integer expressions [-Wsign-compare]
21:58.63 mpi/mpi.c: In function 's_mp_fixup_reciprocal':
21:58.63 mpi/mpi.c:2164:19: warning: comparison between signed and unsigned integer expressions [-Wsign-compare]
21:58.63 mpi/mpi.c:2164:51: warning: signed and unsigned type in conditional expression [-Wsign-compare]
21:58.63 mpi/mpi.c:2166:11: warning: comparison between signed and unsigned integer expressions [-Wsign-compare]
21:58.63 mpi/mpi.c: In function 's_mp_lshd':
21:58.63 mpi/mpi.c:2938:18: warning: comparison between signed and unsigned integer expressions [-Wsign-compare]
21:58.63 mpi/mpi.c: In function 's_mp_mul_2':
21:58.63 mpi/mpi.c:3063:12: warning: comparison between signed and unsigned integer expressions [-Wsign-compare]
21:58.63 mpi/mpi.c: In function 's_mp_todigit':
21:58.63 mpi/mpi.c:4600:10: warning: comparison between signed and unsigned integer expressions [-Wsign-compare]
21:58.63 mpi/mpi.c: In function 'mp_to_unsigned_octets':
21:58.63 mpi/mpi.c:4720:29: warning: comparison between signed and unsigned integer expressions [-Wsign-compare]
21:58.63 mpi/mpi.c: In function 'mp_to_signed_octets':
21:58.63 mpi/mpi.c:4752:29: warning: comparison between signed and unsigned integer expressions [-Wsign-compare]
21:58.63 mpi/mpi.c:4766:20: warning: comparison between signed and unsigned integer expressions [-Wsign-compare]
21:58.63 mpi/mpi.c:4767:18: warning: comparison between signed and unsigned integer expressions [-Wsign-compare]
21:58.63 mpi/mpi.c: In function 'mp_to_fixlen_octets':
21:58.63 mpi/mpi.c:4792:29: warning: comparison between signed and unsigned integer expressions [-Wsign-compare]
21:58.63 mpi/mpi.c:4795:16: warning: comparison between signed and unsigned integer expressions [-Wsign-compare]
21:59.09 lgglue.c: In function 'sftkdb_resolvePath':
21:59.09 lgglue.c:44:24: warning: comparison between signed and unsigned integer expressions [-Wsign-compare]
21:59.45 lowpbe.c: In function 'nsspkcs5_PKCS12PBE':
21:59.45 lowpbe.c:519:22: warning: comparison between signed and unsigned integer expressions [-Wsign-compare]
21:59.95 pkcs11u.c: In function 'sftk_DeleteObject':
21:59.95 pkcs11u.c:1177:22: warning: unused variable 'to' [-Wunused-variable]
21:59.95 pkcs11u.c: In function 'sftk_NewTokenObject':
21:59.95 pkcs11u.c:1902:22: warning: variable 'tokObject' set but not used [-Wunused-but-set-variable]
22:00.03 sdb.c: In function 'sdb_FindObjectsInit':
22:00.03 sdb.c:702:28: warning: comparison between signed and unsigned integer expressions [-Wsign-compare]
22:00.03 sdb.c:727:32: warning: comparison between signed and unsigned integer expressions [-Wsign-compare]
22:00.03 sdb.c: In function 'sdb_GetAttributeValueNoLock':
22:00.03 sdb.c:848:17: warning: comparison between signed and unsigned integer expressions [-Wsign-compare]
22:00.03 sdb.c:900:34: warning: comparison between signed and unsigned integer expressions [-Wsign-compare]
22:00.03 sdb.c: In function 'sdb_SetAttributeValue':
22:00.03 sdb.c:978:27: warning: comparison between signed and unsigned integer expressions [-Wsign-compare]
22:00.03 sdb.c:1007:17: warning: comparison between signed and unsigned integer expressions [-Wsign-compare]
22:00.03 sdb.c: In function 'sdb_CreateObject':
22:00.03 sdb.c:1138:42: warning: comparison between signed and unsigned integer expressions [-Wsign-compare]
22:00.03 sdb.c:1168:17: warning: comparison between signed and unsigned integer expressions [-Wsign-compare]
22:00.14 sftkhmac.c: In function 'sftk_HMACConstantTime_Update':
22:00.14 sftkhmac.c:149:15: warning: unused variable 'rv' [-Wunused-variable]
22:00.14 sftkhmac.c: In function 'sftk_SSLv3MACConstantTime_Update':
22:00.14 sftkhmac.c:163:15: warning: unused variable 'rv' [-Wunused-variable]
22:00.31 pkcs11.c: In function 'sftk_GetPubKey':
22:00.31 pkcs11.c:1756:35: warning: comparison between signed and unsigned integer expressions [-Wsign-compare]
22:00.31 pkcs11.c:1764:35: warning: comparison between signed and unsigned integer expressions [-Wsign-compare]
22:00.31 pkcs11.c:1774:27: warning: comparison between signed and unsigned integer expressions [-Wsign-compare]
22:00.31 pkcs11.c: In function 'NSC_GetInfo':
22:00.31 pkcs11.c:3144:19: warning: variable 'c' set but not used [-Wunused-but-set-variable]
22:00.31 pkcs11.c: In function 'NSC_GetAttributeValue':
22:00.31 pkcs11.c:4314:58: warning: comparison between signed and unsigned integer expressions [-Wsign-compare]
22:00.31 pkcs11.c: In function 'sftk_emailhack':
22:00.31 pkcs11.c:4527:17: warning: comparison between signed and unsigned integer expressions [-Wsign-compare]
22:00.31 pkcs11.c: In function 'NSC_FindObjects':
22:00.31 pkcs11.c:4743:54: warning: signed and unsigned type in conditional expression [-Wsign-compare]
22:00.31 pkcs11.c: In function 'NSC_CreateObject':
22:00.31 pkcs11.c:4085:21: warning: 'moduleIndex' may be used uninitialized in this function [-Wmaybe-uninitialized]
22:00.31 pkcs11.c:4005:19: note: 'moduleIndex' was declared here
22:00.62 sftkpwd.c: In function 'sftk_updateMacs':
22:00.62 sftkpwd.c:908:17: warning: comparison between signed and unsigned integer expressions [-Wsign-compare]
22:00.62 sftkpwd.c:909:31: warning: comparison between signed and unsigned integer expressions [-Wsign-compare]
22:00.62 sftkpwd.c:930:17: warning: comparison between signed and unsigned integer expressions [-Wsign-compare]
22:00.62 sftkpwd.c:935:31: warning: comparison between signed and unsigned integer expressions [-Wsign-compare]
22:00.62 sftkpwd.c:868:11: warning: variable 'crv2' set but not used [-Wunused-but-set-variable]
22:00.62 sftkpwd.c:867:11: warning: variable 'crv' set but not used [-Wunused-but-set-variable]
22:00.62 sftkpwd.c: In function 'sftk_updateEncrypted':
22:00.62 sftkpwd.c:986:17: warning: comparison between signed and unsigned integer expressions [-Wsign-compare]
22:00.62 sftkpwd.c:993:31: warning: comparison between signed and unsigned integer expressions [-Wsign-compare]
22:00.62 sftkpwd.c: In function 'sftkdb_convertObjects':
22:00.62 sftkpwd.c:1125:38: warning: comparison between signed and unsigned integer expressions [-Wsign-compare]
22:00.64 sftkdb.c: In function 'sftkdb_fixupTemplateOut':
22:00.64 sftkdb.c:328:22: warning: variable 'data' set but not used [-Wunused-but-set-variable]
22:00.64 sftkdb.c:345:69: warning: comparison between signed and unsigned integer expressions [-Wsign-compare]
22:00.64 sftkdb.c: In function 'sftk_signTemplate':
22:00.64 sftkdb.c:520:17: warning: comparison between signed and unsigned integer expressions [-Wsign-compare]
22:00.64 sftkdb.c: In function 'sftkdb_CreateObject':
22:00.64 sftkdb.c:576:12: warning: variable 'inTransaction' set but not used [-Wunused-but-set-variable]
22:00.64 sftkdb.c: In function 'sftk_ExtractTemplate':
22:00.64 sftkdb.c:619:17: warning: comparison between signed and unsigned integer expressions [-Wsign-compare]
22:00.64 sftkdb.c:632:17: warning: comparison between signed and unsigned integer expressions [-Wsign-compare]
22:00.64 sftkdb.c: In function 'sftkdb_resolveConflicts':
22:00.64 sftkdb.c:1045:13: warning: comparison between signed and unsigned integer expressions [-Wsign-compare]
22:00.64 sftkdb.c: In function 'sftkdb_FindObjects':
22:00.65 sftkdb.c:1261:14: warning: comparison between signed and unsigned integer expressions [-Wsign-compare]
22:00.65 sftkdb.c: In function 'sftkdb_GetObjectTemplate':
22:00.65 sftkdb.c:1613:14: warning: comparison between signed and unsigned integer expressions [-Wsign-compare]
22:00.65 sftkdb.c:1631:63: warning: comparison between signed and unsigned integer expressions [-Wsign-compare]
22:00.65 sftkdb.c: In function 'sftkdb_handleIDAndName':
22:00.65 sftkdb.c:2014:11: warning: variable 'crv' set but not used [-Wunused-but-set-variable]
22:00.65 sftkdb.c: In function 'sftkdb_mergeObject':
22:00.65 sftkdb.c:2196:17: warning: comparison between signed and unsigned integer expressions [-Wsign-compare]
22:00.65 sftkdb.c: In function 'sftkdb_Update':
22:00.65 sftkdb.c:2301:38: warning: comparison between signed and unsigned integer expressions [-Wsign-compare]
22:01.26 pkcs11c.c: In function 'NSC_GenerateKeyPair':
22:01.26 pkcs11c.c:4340:9: warning: variable 'private_value_bits' set but not used [-Wunused-but-set-variable]
22:01.26 pkcs11c.c: In function 'sftk_PackagePrivateKey':
22:01.26 pkcs11c.c:4862:14: warning: variable 'fordebug' set but not used [-Wunused-but-set-variable]
22:01.26 pkcs11c.c: In function 'NSC_DeriveKey':
22:01.26 pkcs11c.c:6764:18: warning: comparison between signed and unsigned integer expressions [-Wsign-compare]
22:01.26 pkcs11c.c:6769:18: warning: comparison between signed and unsigned integer expressions [-Wsign-compare]
22:01.26 pkcs11c.c:6850:20: warning: comparison between signed and unsigned integer expressions [-Wsign-compare]
22:01.26 pkcs11c.c: In function 'NSC_GenerateKeyPair':
22:01.26 pkcs11c.c:4260:6: warning: 'subPrimeLen' may be used uninitialized in this function [-Wmaybe-uninitialized]
22:01.27 pkcs11c.c:4042:14: note: 'subPrimeLen' was declared here
22:01.27 pkcs11c.c:4212:23: warning: 'modulusLen' may be used uninitialized in this function [-Wmaybe-uninitialized]
22:01.27 pkcs11c.c:4041:14: note: 'modulusLen' was declared here
22:01.27 pkcs11c.c: In function 'NSC_GenerateKey':
22:01.27 pkcs11c.c:3968:13: warning: 'hashType' may be used uninitialized in this function [-Wmaybe-uninitialized]
22:01.40 libnspr.a.desc
22:01.40 libcrmf.a.desc
22:01.41 libsqlite.a.desc
22:01.46 Unified_c_manager_ssl_src0.o
22:01.46 PSMContentListener.o
22:01.46 nsCryptoHash.o
22:01.46 nsNSSCertificateDB.o
22:01.85 nsNSSComponent.o
22:02.47 nsNSSVersion.o
22:03.15 RegExp.o
22:03.15 CTypes.o
22:03.16 Unified_cpp_manager_ssl_src0.o
22:03.80 WriteArgument.o
22:03.83 WriteArgument
22:03.84 ssltunnel.o
22:04.03 BadCertServer.o
22:04.03 ClientAuthServer.o
22:04.23 Unified_cpp_manager_ssl_src1.o
22:04.40 GenerateOCSPResponse.o
22:04.83 OCSPStaplingServer.o
22:05.36 ssltunnel
22:05.43 Unified_cpp_manager_ssl_src2.o
22:05.65 BadCertServer
22:05.65 ClientAuthServer
22:05.88 GenerateOCSPResponse
22:05.99 OCSPStaplingServer
22:06.24 Library.o
22:11.35 Parser.o
22:12.53 ExecutableAllocatorPosix.o
22:14.36 In file included from /opt/FirefoxSource/mozilla-release/objdir-droid/security/manager/ssl/src/Unified_cpp_manager_ssl_src1.cpp:11:0:
22:14.36 /opt/FirefoxSource/mozilla-release/security/manager/ssl/src/nsNSSASN1Object.cpp: In function 'nsresult buildASN1ObjectFromDER(unsigned char*, unsigned char*, nsIASN1Sequence*)':
22:14.36 Warning: -Wmaybe-uninitialized in /opt/FirefoxSource/mozilla-release/security/manager/ssl/src/nsNSSASN1Object.cpp: 'bytesUsed' may be used uninitialized in this function
22:14.36 /opt/FirefoxSource/mozilla-release/security/manager/ssl/src/nsNSSASN1Object.cpp:131:22: warning: 'bytesUsed' may be used uninitialized in this function [-Wmaybe-uninitialized]
22:14.37 jsarray.o
22:14.67 jsatom.o
22:15.71 libsecurity_manager_ssl_src.a.desc
22:15.74 jsmath.o
22:18.63 /opt/FirefoxSource/mozilla-release/js/src/ctypes/CTypes.cpp: In function 'bool js::ctypes::ExplicitConvert(JSContext*, JS::HandleValue, JS::HandleObject, void*)':
22:18.63 Warning: -Wmaybe-uninitialized in /opt/FirefoxSource/mozilla-release/js/src/ctypes/CTypes.cpp: 'result' may be used uninitialized in this function
22:18.63 /opt/FirefoxSource/mozilla-release/js/src/ctypes/CTypes.cpp:2744:234: warning: 'result' may be used uninitialized in this function [-Wmaybe-uninitialized]
22:18.63 /opt/FirefoxSource/mozilla-release/js/src/ctypes/CTypes.cpp:2744:34: note: 'result' was declared here
22:18.63 Warning: -Wmaybe-uninitialized in /opt/FirefoxSource/mozilla-release/js/src/ctypes/CTypes.cpp: 'result' may be used uninitialized in this function
22:18.63 /opt/FirefoxSource/mozilla-release/js/src/ctypes/CTypes.cpp:2743:218: warning: 'result' may be used uninitialized in this function [-Wmaybe-uninitialized]
22:18.63 /opt/FirefoxSource/mozilla-release/js/src/ctypes/CTypes.cpp:2743:26: note: 'result' was declared here
22:18.63 Warning: -Wmaybe-uninitialized in /opt/FirefoxSource/mozilla-release/js/src/ctypes/CTypes.cpp: 'result' may be used uninitialized in this function
22:18.63 /opt/FirefoxSource/mozilla-release/js/src/ctypes/CTypes.cpp:2742:960: warning: 'result' may be used uninitialized in this function [-Wmaybe-uninitialized]
22:18.63 /opt/FirefoxSource/mozilla-release/js/src/ctypes/CTypes.cpp:2742:750: note: 'result' was declared here
22:18.63 jsutil.o
22:21.30 pm_stub.o
22:21.44 TraceLogging.o
22:21.56 TraceLoggingGraph.o
22:24.82 TraceLoggingTypes.o
22:25.86 Unified_cpp_js_src0.o
22:26.18 Unified_cpp_js_src1.o
22:26.18 Unified_cpp_js_src2.o
22:28.06 Unified_cpp_js_src3.o
22:28.72 Unified_cpp_js_src4.o
22:53.31 In file included from /opt/FirefoxSource/mozilla-release/js/src/jsobjinlines.h:24:0,
22:53.31                  from /opt/FirefoxSource/mozilla-release/js/src/frontend/BytecodeCompiler.cpp:20,
22:53.31                  from /opt/FirefoxSource/mozilla-release/objdir-droid/js/src/Unified_cpp_js_src1.cpp:20:
22:53.31 /opt/FirefoxSource/mozilla-release/js/src/jsgcinlines.h: In function 'void js::IterateScripts(JSRuntime*, JSCompartment*, void*, js::IterateScriptCallback)':
22:53.31 Warning: -Wmaybe-uninitialized in /opt/FirefoxSource/mozilla-release/js/src/jsgcinlines.h: '*((void*)(& i)+12).js::gc::ArenaCellIterImpl::thing' may be used uninitialized in this function
22:53.31 /opt/FirefoxSource/mozilla-release/js/src/jsgcinlines.h:229:27: warning: '*((void*)(& i)+12).js::gc::ArenaCellIterImpl::thing' may be used uninitialized in this function [-Wmaybe-uninitialized]
22:53.31 In file included from /opt/FirefoxSource/mozilla-release/objdir-droid/js/src/Unified_cpp_js_src1.cpp:101:0:
22:53.31 /opt/FirefoxSource/mozilla-release/js/src/gc/Iteration.cpp:108:38: note: '*((void*)(& i)+12).js::gc::ArenaCellIterImpl::thing' was declared here
22:53.31 In file included from /opt/FirefoxSource/mozilla-release/js/src/gc/Barrier.h:12:0,
22:53.31                  from /opt/FirefoxSource/mozilla-release/js/src/jsatom.h:14,
22:53.31                  from /opt/FirefoxSource/mozilla-release/js/src/vm/Runtime.h:21,
22:53.31                  from /opt/FirefoxSource/mozilla-release/js/src/jscntxt.h:15,
22:53.31                  from /opt/FirefoxSource/mozilla-release/js/src/frontend/BytecodeCompiler.cpp:9,
22:53.31                  from /opt/FirefoxSource/mozilla-release/objdir-droid/js/src/Unified_cpp_js_src1.cpp:20:
22:53.31 Warning: -Wmaybe-uninitialized in /opt/FirefoxSource/mozilla-release/js/src/gc/Heap.h: '*((void*)(& i)+12).js::gc::ArenaCellIterImpl::span.js::gc::FreeSpan::last' may be used uninitialized in this function
22:53.31 /opt/FirefoxSource/mozilla-release/js/src/gc/Heap.h:304:49: warning: '*((void*)(& i)+12).js::gc::ArenaCellIterImpl::span.js::gc::FreeSpan::last' may be used uninitialized in this function [-Wmaybe-uninitialized]
22:53.31 In file included from /opt/FirefoxSource/mozilla-release/objdir-droid/js/src/Unified_cpp_js_src1.cpp:101:0:
22:53.31 /opt/FirefoxSource/mozilla-release/js/src/gc/Iteration.cpp:108:38: note: '*((void*)(& i)+12).js::gc::ArenaCellIterImpl::span.js::gc::FreeSpan::last' was declared here
22:53.31 In file included from /opt/FirefoxSource/mozilla-release/js/src/jsobjinlines.h:24:0,
22:53.31                  from /opt/FirefoxSource/mozilla-release/js/src/frontend/BytecodeCompiler.cpp:20,
22:53.31                  from /opt/FirefoxSource/mozilla-release/objdir-droid/js/src/Unified_cpp_js_src1.cpp:20:
22:53.31 Warning: -Wmaybe-uninitialized in /opt/FirefoxSource/mozilla-release/js/src/jsgcinlines.h: '*((void*)(& i)+12).js::gc::ArenaCellIterImpl::span.js::gc::FreeSpan::first' may be used uninitialized in this function
22:53.31 /opt/FirefoxSource/mozilla-release/js/src/jsgcinlines.h:170:9: warning: '*((void*)(& i)+12).js::gc::ArenaCellIterImpl::span.js::gc::FreeSpan::first' may be used uninitialized in this function [-Wmaybe-uninitialized]
22:53.31 In file included from /opt/FirefoxSource/mozilla-release/objdir-droid/js/src/Unified_cpp_js_src1.cpp:101:0:
22:53.31 /opt/FirefoxSource/mozilla-release/js/src/gc/Iteration.cpp:108:38: note: '*((void*)(& i)+12).js::gc::ArenaCellIterImpl::span.js::gc::FreeSpan::first' was declared here
22:53.31 In file included from /opt/FirefoxSource/mozilla-release/js/src/jsobjinlines.h:24:0,
22:53.31                  from /opt/FirefoxSource/mozilla-release/js/src/frontend/BytecodeCompiler.cpp:20,
22:53.31                  from /opt/FirefoxSource/mozilla-release/objdir-droid/js/src/Unified_cpp_js_src1.cpp:20:
22:53.32 /opt/FirefoxSource/mozilla-release/js/src/jsgcinlines.h: In member function 'void js::gc::GCRuntime::markRuntime(JSTracer*, js::gc::GCRuntime::TraceOrMarkRuntime, js::gc::GCRuntime::TraceRootsOrUsedSaved)':
22:53.32 Warning: -Wmaybe-uninitialized in /opt/FirefoxSource/mozilla-release/js/src/jsgcinlines.h: '*((void*)(& i)+12).js::gc::ArenaCellIterImpl::thing' may be used uninitialized in this function
22:53.32 /opt/FirefoxSource/mozilla-release/js/src/jsgcinlines.h:219:53: warning: '*((void*)(& i)+12).js::gc::ArenaCellIterImpl::thing' may be used uninitialized in this function [-Wmaybe-uninitialized]
22:53.32 In file included from /opt/FirefoxSource/mozilla-release/objdir-droid/js/src/Unified_cpp_js_src1.cpp:137:0:
22:53.32 /opt/FirefoxSource/mozilla-release/js/src/gc/RootMarking.cpp:494:38: note: '*((void*)(& i)+12).js::gc::ArenaCellIterImpl::thing' was declared here
22:53.32 In file included from /opt/FirefoxSource/mozilla-release/js/src/gc/Barrier.h:12:0,
22:53.32                  from /opt/FirefoxSource/mozilla-release/js/src/jsatom.h:14,
22:53.32                  from /opt/FirefoxSource/mozilla-release/js/src/vm/Runtime.h:21,
22:53.32                  from /opt/FirefoxSource/mozilla-release/js/src/jscntxt.h:15,
22:53.32                  from /opt/FirefoxSource/mozilla-release/js/src/frontend/BytecodeCompiler.cpp:9,
22:53.32                  from /opt/FirefoxSource/mozilla-release/objdir-droid/js/src/Unified_cpp_js_src1.cpp:20:
22:53.32 Warning: -Wmaybe-uninitialized in /opt/FirefoxSource/mozilla-release/js/src/gc/Heap.h: '*((void*)(& i)+12).js::gc::ArenaCellIterImpl::span.js::gc::FreeSpan::last' may be used uninitialized in this function
22:53.32 /opt/FirefoxSource/mozilla-release/js/src/gc/Heap.h:304:49: warning: '*((void*)(& i)+12).js::gc::ArenaCellIterImpl::span.js::gc::FreeSpan::last' may be used uninitialized in this function [-Wmaybe-uninitialized]
22:53.32 In file included from /opt/FirefoxSource/mozilla-release/objdir-droid/js/src/Unified_cpp_js_src1.cpp:137:0:
22:53.32 /opt/FirefoxSource/mozilla-release/js/src/gc/RootMarking.cpp:494:38: note: '*((void*)(& i)+12).js::gc::ArenaCellIterImpl::span.js::gc::FreeSpan::last' was declared here
22:53.32 In file included from /opt/FirefoxSource/mozilla-release/js/src/jsobjinlines.h:24:0,
22:53.32                  from /opt/FirefoxSource/mozilla-release/js/src/frontend/BytecodeCompiler.cpp:20,
22:53.32                  from /opt/FirefoxSource/mozilla-release/objdir-droid/js/src/Unified_cpp_js_src1.cpp:20:
22:53.32 Warning: -Wmaybe-uninitialized in /opt/FirefoxSource/mozilla-release/js/src/jsgcinlines.h: '*((void*)(& i)+12).js::gc::ArenaCellIterImpl::span.js::gc::FreeSpan::first' may be used uninitialized in this function
22:53.32 /opt/FirefoxSource/mozilla-release/js/src/jsgcinlines.h:170:9: warning: '*((void*)(& i)+12).js::gc::ArenaCellIterImpl::span.js::gc::FreeSpan::first' may be used uninitialized in this function [-Wmaybe-uninitialized]
22:53.32 In file included from /opt/FirefoxSource/mozilla-release/objdir-droid/js/src/Unified_cpp_js_src1.cpp:137:0:
22:53.32 /opt/FirefoxSource/mozilla-release/js/src/gc/RootMarking.cpp:494:38: note: '*((void*)(& i)+12).js::gc::ArenaCellIterImpl::span.js::gc::FreeSpan::first' was declared here
22:53.32 In file included from /opt/FirefoxSource/mozilla-release/js/src/jsobjinlines.h:24:0,
22:53.32                  from /opt/FirefoxSource/mozilla-release/js/src/frontend/BytecodeCompiler.cpp:20,
22:53.32                  from /opt/FirefoxSource/mozilla-release/objdir-droid/js/src/Unified_cpp_js_src1.cpp:20:
22:53.32 /opt/FirefoxSource/mozilla-release/js/src/jsgcinlines.h: In member function 'void js::gc::GCRuntime::_ZN2js2gc9GCRuntime11markRuntimeEP8JSTracerNS1_18TraceOrMarkRuntimeENS1_21TraceRootsOrUsedSavedE.constprop.460(JSTracer*)':
22:53.32 Warning: -Wmaybe-uninitialized in /opt/FirefoxSource/mozilla-release/js/src/jsgcinlines.h: '*((void*)(& i)+12).js::gc::ArenaCellIterImpl::thing' may be used uninitialized in this function
22:53.32 /opt/FirefoxSource/mozilla-release/js/src/jsgcinlines.h:219:53: warning: '*((void*)(& i)+12).js::gc::ArenaCellIterImpl::thing' may be used uninitialized in this function [-Wmaybe-uninitialized]
22:53.32 In file included from /opt/FirefoxSource/mozilla-release/objdir-droid/js/src/Unified_cpp_js_src1.cpp:137:0:
22:53.32 /opt/FirefoxSource/mozilla-release/js/src/gc/RootMarking.cpp:494:38: note: '*((void*)(& i)+12).js::gc::ArenaCellIterImpl::thing' was declared here
22:53.32 In file included from /opt/FirefoxSource/mozilla-release/js/src/gc/Barrier.h:12:0,
22:53.32                  from /opt/FirefoxSource/mozilla-release/js/src/jsatom.h:14,
22:53.32                  from /opt/FirefoxSource/mozilla-release/js/src/vm/Runtime.h:21,
22:53.32                  from /opt/FirefoxSource/mozilla-release/js/src/jscntxt.h:15,
22:53.32                  from /opt/FirefoxSource/mozilla-release/js/src/frontend/BytecodeCompiler.cpp:9,
22:53.32                  from /opt/FirefoxSource/mozilla-release/objdir-droid/js/src/Unified_cpp_js_src1.cpp:20:
22:53.32 Warning: -Wmaybe-uninitialized in /opt/FirefoxSource/mozilla-release/js/src/gc/Heap.h: '*((void*)(& i)+12).js::gc::ArenaCellIterImpl::span.js::gc::FreeSpan::last' may be used uninitialized in this function
22:53.32 /opt/FirefoxSource/mozilla-release/js/src/gc/Heap.h:304:49: warning: '*((void*)(& i)+12).js::gc::ArenaCellIterImpl::span.js::gc::FreeSpan::last' may be used uninitialized in this function [-Wmaybe-uninitialized]
22:53.32 In file included from /opt/FirefoxSource/mozilla-release/objdir-droid/js/src/Unified_cpp_js_src1.cpp:137:0:
22:53.32 /opt/FirefoxSource/mozilla-release/js/src/gc/RootMarking.cpp:494:38: note: '*((void*)(& i)+12).js::gc::ArenaCellIterImpl::span.js::gc::FreeSpan::last' was declared here
22:53.32 In file included from /opt/FirefoxSource/mozilla-release/js/src/jsobjinlines.h:24:0,
22:53.32                  from /opt/FirefoxSource/mozilla-release/js/src/frontend/BytecodeCompiler.cpp:20,
22:53.32                  from /opt/FirefoxSource/mozilla-release/objdir-droid/js/src/Unified_cpp_js_src1.cpp:20:
22:53.33 Warning: -Wmaybe-uninitialized in /opt/FirefoxSource/mozilla-release/js/src/jsgcinlines.h: '*((void*)(& i)+12).js::gc::ArenaCellIterImpl::span.js::gc::FreeSpan::first' may be used uninitialized in this function
22:53.33 /opt/FirefoxSource/mozilla-release/js/src/jsgcinlines.h:170:9: warning: '*((void*)(& i)+12).js::gc::ArenaCellIterImpl::span.js::gc::FreeSpan::first' may be used uninitialized in this function [-Wmaybe-uninitialized]
22:53.33 In file included from /opt/FirefoxSource/mozilla-release/objdir-droid/js/src/Unified_cpp_js_src1.cpp:137:0:
22:53.33 /opt/FirefoxSource/mozilla-release/js/src/gc/RootMarking.cpp:494:38: note: '*((void*)(& i)+12).js::gc::ArenaCellIterImpl::span.js::gc::FreeSpan::first' was declared here
22:53.33 Unified_cpp_js_src5.o
22:53.33 Unified_cpp_js_src6.o
23:08.11 In file included from /opt/FirefoxSource/mozilla-release/js/src/jit/JitCompartment.h:17:0,
23:08.11                  from /opt/FirefoxSource/mozilla-release/js/src/jit/arm/Assembler-arm.h:17,
23:08.11                  from /opt/FirefoxSource/mozilla-release/js/src/jit/arm/MacroAssembler-arm.h:14,
23:08.11                  from /opt/FirefoxSource/mozilla-release/js/src/jit/MacroAssembler.h:17,
23:08.11                  from /opt/FirefoxSource/mozilla-release/js/src/asmjs/AsmJSModule.h:33,
23:08.11                  from /opt/FirefoxSource/mozilla-release/js/src/asmjs/AsmJSFrameIterator.cpp:21,
23:08.11                  from /opt/FirefoxSource/mozilla-release/objdir-droid/js/src/Unified_cpp_js_src0.cpp:2:
23:08.11 /opt/FirefoxSource/mozilla-release/js/src/jit/shared/Assembler-shared.h: In member function 'bool {anonymous}::FunctionCompiler::callPrivate(js::jit::MAsmJSCall::Callee, const {anonymous}::FunctionCompiler::Call&, js::jit::MIRType, js::jit::MDefinition**)':
23:08.11 Warning: -Wmaybe-uninitialized in /opt/FirefoxSource/mozilla-release/js/src/jit/shared/Assembler-shared.h: 'kind' may be used uninitialized in this function
23:08.11 /opt/FirefoxSource/mozilla-release/js/src/jit/shared/Assembler-shared.h:667:49: warning: 'kind' may be used uninitialized in this function [-Wmaybe-uninitialized]
23:08.11 In file included from /opt/FirefoxSource/mozilla-release/objdir-droid/js/src/Unified_cpp_js_src0.cpp:38:0:
23:08.11 /opt/FirefoxSource/mozilla-release/js/src/asmjs/AsmJSValidate.cpp:3035:28: note: 'kind' was declared here
23:08.11 In file included from /opt/FirefoxSource/mozilla-release/objdir-droid/js/src/Unified_cpp_js_src0.cpp:38:0:
23:08.11 /opt/FirefoxSource/mozilla-release/js/src/asmjs/AsmJSValidate.cpp: In function 'js::AsmJSNumLit ExtractSimdValue({anonymous}::ModuleCompiler&, js::frontend::ParseNode*)':
23:08.11 Warning: -Wmaybe-uninitialized in /opt/FirefoxSource/mozilla-release/js/src/asmjs/AsmJSValidate.cpp: 'type' may be used uninitialized in this function
23:08.11 /opt/FirefoxSource/mozilla-release/js/src/asmjs/AsmJSValidate.cpp:2161:5: warning: 'type' may be used uninitialized in this function [-Wmaybe-uninitialized]
23:08.11 In file included from /opt/FirefoxSource/mozilla-release/objdir-droid/js/src/Unified_cpp_js_src0.cpp:20:0:
23:08.11 /opt/FirefoxSource/mozilla-release/js/src/asmjs/AsmJSModule.cpp: In member function 'void js::AsmJSModule::CodeRange::updateOffsets(js::jit::MacroAssembler&)':
23:08.11 Warning: -Wmaybe-uninitialized in /opt/FirefoxSource/mozilla-release/js/src/asmjs/AsmJSModule.cpp: 'profilingEpilogueBefore' may be used uninitialized in this function
23:08.11 /opt/FirefoxSource/mozilla-release/js/src/asmjs/AsmJSModule.cpp:1360:61: warning: 'profilingEpilogueBefore' may be used uninitialized in this function [-Wmaybe-uninitialized]
23:08.11 Warning: -Wmaybe-uninitialized in /opt/FirefoxSource/mozilla-release/js/src/asmjs/AsmJSModule.cpp: 'profilingJumpBefore' may be used uninitialized in this function
23:08.11 /opt/FirefoxSource/mozilla-release/js/src/asmjs/AsmJSModule.cpp:1360:61: warning: 'profilingJumpBefore' may be used uninitialized in this function [-Wmaybe-uninitialized]
23:08.11 Warning: -Wmaybe-uninitialized in /opt/FirefoxSource/mozilla-release/js/src/asmjs/AsmJSModule.cpp: 'entryBefore' may be used uninitialized in this function
23:08.11 /opt/FirefoxSource/mozilla-release/js/src/asmjs/AsmJSModule.cpp:1360:61: warning: 'entryBefore' may be used uninitialized in this function [-Wmaybe-uninitialized]
23:08.12 In file included from /opt/FirefoxSource/mozilla-release/objdir-droid/js/src/Unified_cpp_js_src0.cpp:38:0:
23:08.12 /opt/FirefoxSource/mozilla-release/js/src/asmjs/AsmJSValidate.cpp: In function 'bool CheckFunction({anonymous}::ModuleCompiler&, js::LifoAlloc&, js::jit::MIRGenerator**, {anonymous}::ModuleCompiler::Func**)':
23:08.12 Warning: -Wmaybe-uninitialized in /opt/FirefoxSource/mozilla-release/js/src/asmjs/AsmJSValidate.cpp: 'min' may be used uninitialized in this function
23:08.12 /opt/FirefoxSource/mozilla-release/js/src/asmjs/AsmJSValidate.cpp:7380:62: warning: 'min' may be used uninitialized in this function [-Wmaybe-uninitialized]
23:08.12 /opt/FirefoxSource/mozilla-release/js/src/asmjs/AsmJSValidate.cpp:7332:20: note: 'min' was declared here
23:08.12 Warning: -Wmaybe-uninitialized in /opt/FirefoxSource/mozilla-release/js/src/asmjs/AsmJSValidate.cpp: 'fn' may be used uninitialized in this function
23:08.12 /opt/FirefoxSource/mozilla-release/js/src/asmjs/AsmJSValidate.cpp:7509:74: warning: 'fn' may be used uninitialized in this function [-Wmaybe-uninitialized]
23:08.12 In file included from /opt/FirefoxSource/mozilla-release/objdir-droid/js/src/Unified_cpp_js_src0.cpp:38:0:
23:08.12 /opt/FirefoxSource/mozilla-release/js/src/asmjs/AsmJSValidate.cpp: In function 'bool CheckCoercionArg({anonymous}::FunctionCompiler&, js::frontend::ParseNode*, js::AsmJSCoercion, js::jit::MDefinition**, {anonymous}::Type*)':
23:08.12 Warning: -Wmaybe-uninitialized in /opt/FirefoxSource/mozilla-release/js/src/asmjs/AsmJSValidate.cpp: 'retType' may be used uninitialized in this function
23:08.12 /opt/FirefoxSource/mozilla-release/js/src/asmjs/AsmJSValidate.cpp:5219:29: warning: 'retType' may be used uninitialized in this function [-Wmaybe-uninitialized]
23:08.12 Unified_cpp_js_src7.o
23:19.95 In file included from /opt/FirefoxSource/mozilla-release/js/src/vm/Shape-inl.h:22:0,
23:19.95                  from /opt/FirefoxSource/mozilla-release/js/src/jsscriptinlines.h:19,
23:19.95                  from /opt/FirefoxSource/mozilla-release/js/src/jit/BaselineCompiler.cpp:25,
23:19.95                  from /opt/FirefoxSource/mozilla-release/objdir-droid/js/src/Unified_cpp_js_src3.cpp:2:
23:19.95 /opt/FirefoxSource/mozilla-release/js/src/jsgcinlines.h: In function 'void js::jit::ToggleBaselineTraceLoggerScripts(JSRuntime*, bool)':
23:19.95 Warning: -Wmaybe-uninitialized in /opt/FirefoxSource/mozilla-release/js/src/jsgcinlines.h: '*((void*)(& i)+12).js::gc::ArenaCellIterImpl::thing' may be used uninitialized in this function
23:19.95 /opt/FirefoxSource/mozilla-release/js/src/jsgcinlines.h:219:53: warning: '*((void*)(& i)+12).js::gc::ArenaCellIterImpl::thing' may be used uninitialized in this function [-Wmaybe-uninitialized]
23:19.95 In file included from /opt/FirefoxSource/mozilla-release/objdir-droid/js/src/Unified_cpp_js_src3.cpp:56:0:
23:19.95 /opt/FirefoxSource/mozilla-release/js/src/jit/BaselineJIT.cpp:1152:31: note: '*((void*)(& i)+12).js::gc::ArenaCellIterImpl::thing' was declared here
23:19.95 In file included from /opt/FirefoxSource/mozilla-release/js/src/gc/Barrier.h:12:0,
23:19.95                  from /opt/FirefoxSource/mozilla-release/js/src/jsatom.h:14,
23:19.95                  from /opt/FirefoxSource/mozilla-release/js/src/vm/Runtime.h:21,
23:19.95                  from /opt/FirefoxSource/mozilla-release/js/src/jscntxt.h:15,
23:19.95                  from /opt/FirefoxSource/mozilla-release/js/src/jit/Ion.h:12,
23:19.95                  from /opt/FirefoxSource/mozilla-release/js/src/jit/FixedList.h:12,
23:19.95                  from /opt/FirefoxSource/mozilla-release/js/src/jit/BaselineCompiler.h:10,
23:19.95                  from /opt/FirefoxSource/mozilla-release/js/src/jit/BaselineCompiler.cpp:7,
23:19.95                  from /opt/FirefoxSource/mozilla-release/objdir-droid/js/src/Unified_cpp_js_src3.cpp:2:
23:19.95 Warning: -Wmaybe-uninitialized in /opt/FirefoxSource/mozilla-release/js/src/gc/Heap.h: '*((void*)(& i)+12).js::gc::ArenaCellIterImpl::span.js::gc::FreeSpan::last' may be used uninitialized in this function
23:19.95 /opt/FirefoxSource/mozilla-release/js/src/gc/Heap.h:304:49: warning: '*((void*)(& i)+12).js::gc::ArenaCellIterImpl::span.js::gc::FreeSpan::last' may be used uninitialized in this function [-Wmaybe-uninitialized]
23:19.96 In file included from /opt/FirefoxSource/mozilla-release/objdir-droid/js/src/Unified_cpp_js_src3.cpp:56:0:
23:19.96 /opt/FirefoxSource/mozilla-release/js/src/jit/BaselineJIT.cpp:1152:31: note: '*((void*)(& i)+12).js::gc::ArenaCellIterImpl::span.js::gc::FreeSpan::last' was declared here
23:19.96 In file included from /opt/FirefoxSource/mozilla-release/js/src/vm/Shape-inl.h:22:0,
23:19.96                  from /opt/FirefoxSource/mozilla-release/js/src/jsscriptinlines.h:19,
23:19.96                  from /opt/FirefoxSource/mozilla-release/js/src/jit/BaselineCompiler.cpp:25,
23:19.96                  from /opt/FirefoxSource/mozilla-release/objdir-droid/js/src/Unified_cpp_js_src3.cpp:2:
23:19.96 Warning: -Wmaybe-uninitialized in /opt/FirefoxSource/mozilla-release/js/src/jsgcinlines.h: '*((void*)(& i)+12).js::gc::ArenaCellIterImpl::span.js::gc::FreeSpan::first' may be used uninitialized in this function
23:19.96 /opt/FirefoxSource/mozilla-release/js/src/jsgcinlines.h:170:9: warning: '*((void*)(& i)+12).js::gc::ArenaCellIterImpl::span.js::gc::FreeSpan::first' may be used uninitialized in this function [-Wmaybe-uninitialized]
23:19.96 In file included from /opt/FirefoxSource/mozilla-release/objdir-droid/js/src/Unified_cpp_js_src3.cpp:56:0:
23:19.96 /opt/FirefoxSource/mozilla-release/js/src/jit/BaselineJIT.cpp:1152:31: note: '*((void*)(& i)+12).js::gc::ArenaCellIterImpl::span.js::gc::FreeSpan::first' was declared here
23:19.96 In file included from /opt/FirefoxSource/mozilla-release/js/src/vm/Shape-inl.h:22:0,
23:19.96                  from /opt/FirefoxSource/mozilla-release/js/src/jsscriptinlines.h:19,
23:19.96                  from /opt/FirefoxSource/mozilla-release/js/src/jit/BaselineCompiler.cpp:25,
23:19.96                  from /opt/FirefoxSource/mozilla-release/objdir-droid/js/src/Unified_cpp_js_src3.cpp:2:
23:19.96 /opt/FirefoxSource/mozilla-release/js/src/jsgcinlines.h: In static member function 'static void js::jit::JitRuntime::Mark(JSTracer*)':
23:19.96 Warning: -Wmaybe-uninitialized in /opt/FirefoxSource/mozilla-release/js/src/jsgcinlines.h: '*((void*)(& i)+12).js::gc::ArenaCellIterImpl::thing' may be used uninitialized in this function
23:19.96 /opt/FirefoxSource/mozilla-release/js/src/jsgcinlines.h:229:27: warning: '*((void*)(& i)+12).js::gc::ArenaCellIterImpl::thing' may be used uninitialized in this function [-Wmaybe-uninitialized]
23:19.96 In file included from /opt/FirefoxSource/mozilla-release/objdir-droid/js/src/Unified_cpp_js_src3.cpp:137:0:
23:19.96 /opt/FirefoxSource/mozilla-release/js/src/jit/Ion.cpp:542:34: note: '*((void*)(& i)+12).js::gc::ArenaCellIterImpl::thing' was declared here
23:19.96 In file included from /opt/FirefoxSource/mozilla-release/js/src/gc/Barrier.h:12:0,
23:19.96                  from /opt/FirefoxSource/mozilla-release/js/src/jsatom.h:14,
23:19.96                  from /opt/FirefoxSource/mozilla-release/js/src/vm/Runtime.h:21,
23:19.96                  from /opt/FirefoxSource/mozilla-release/js/src/jscntxt.h:15,
23:19.96                  from /opt/FirefoxSource/mozilla-release/js/src/jit/Ion.h:12,
23:19.96                  from /opt/FirefoxSource/mozilla-release/js/src/jit/FixedList.h:12,
23:19.96                  from /opt/FirefoxSource/mozilla-release/js/src/jit/BaselineCompiler.h:10,
23:19.96                  from /opt/FirefoxSource/mozilla-release/js/src/jit/BaselineCompiler.cpp:7,
23:19.96                  from /opt/FirefoxSource/mozilla-release/objdir-droid/js/src/Unified_cpp_js_src3.cpp:2:
23:19.96 Warning: -Wmaybe-uninitialized in /opt/FirefoxSource/mozilla-release/js/src/gc/Heap.h: '*((void*)(& i)+12).js::gc::ArenaCellIterImpl::span.js::gc::FreeSpan::last' may be used uninitialized in this function
23:19.96 /opt/FirefoxSource/mozilla-release/js/src/gc/Heap.h:304:49: warning: '*((void*)(& i)+12).js::gc::ArenaCellIterImpl::span.js::gc::FreeSpan::last' may be used uninitialized in this function [-Wmaybe-uninitialized]
23:19.96 In file included from /opt/FirefoxSource/mozilla-release/objdir-droid/js/src/Unified_cpp_js_src3.cpp:137:0:
23:19.96 /opt/FirefoxSource/mozilla-release/js/src/jit/Ion.cpp:542:34: note: '*((void*)(& i)+12).js::gc::ArenaCellIterImpl::span.js::gc::FreeSpan::last' was declared here
23:19.96 In file included from /opt/FirefoxSource/mozilla-release/js/src/vm/Shape-inl.h:22:0,
23:19.96                  from /opt/FirefoxSource/mozilla-release/js/src/jsscriptinlines.h:19,
23:19.96                  from /opt/FirefoxSource/mozilla-release/js/src/jit/BaselineCompiler.cpp:25,
23:19.96                  from /opt/FirefoxSource/mozilla-release/objdir-droid/js/src/Unified_cpp_js_src3.cpp:2:
23:19.96 Warning: -Wmaybe-uninitialized in /opt/FirefoxSource/mozilla-release/js/src/jsgcinlines.h: '*((void*)(& i)+12).js::gc::ArenaCellIterImpl::span.js::gc::FreeSpan::first' may be used uninitialized in this function
23:19.96 /opt/FirefoxSource/mozilla-release/js/src/jsgcinlines.h:170:9: warning: '*((void*)(& i)+12).js::gc::ArenaCellIterImpl::span.js::gc::FreeSpan::first' may be used uninitialized in this function [-Wmaybe-uninitialized]
23:19.96 In file included from /opt/FirefoxSource/mozilla-release/objdir-droid/js/src/Unified_cpp_js_src3.cpp:137:0:
23:19.96 /opt/FirefoxSource/mozilla-release/js/src/jit/Ion.cpp:542:34: note: '*((void*)(& i)+12).js::gc::ArenaCellIterImpl::span.js::gc::FreeSpan::first' was declared here
23:19.96 Unified_cpp_js_src8.o
23:26.00 Unified_cpp_js_src9.o
23:37.53 In file included from /opt/FirefoxSource/mozilla-release/js/src/jit/arm/MacroAssembler-arm.h:14:0,
23:37.53                  from /opt/FirefoxSource/mozilla-release/js/src/jit/MacroAssembler.h:17,
23:37.53                  from /opt/FirefoxSource/mozilla-release/js/src/jit/BaselineJIT.h:18,
23:37.53                  from /opt/FirefoxSource/mozilla-release/js/src/jit/BaselineIC.h:18,
23:37.53                  from /opt/FirefoxSource/mozilla-release/js/src/jit/VMFunctions.cpp:12,
23:37.53                  from /opt/FirefoxSource/mozilla-release/objdir-droid/js/src/Unified_cpp_js_src6.cpp:2:
23:37.53 /opt/FirefoxSource/mozilla-release/js/src/jit/arm/Assembler-arm.h: In static member function 'static void js::jit::Assembler::RetargetNearBranch(js::jit::Instruction*, int, bool)':
23:37.54 Warning: -Wmaybe-uninitialized in /opt/FirefoxSource/mozilla-release/js/src/jit/arm/Assembler-arm.h: 'c' may be used uninitialized in this function
23:37.54 /opt/FirefoxSource/mozilla-release/js/src/jit/arm/Assembler-arm.h:1813:85: warning: 'c' may be used uninitialized in this function [-Wmaybe-uninitialized]
23:37.54 In file included from /opt/FirefoxSource/mozilla-release/objdir-droid/js/src/Unified_cpp_js_src6.cpp:29:0:
23:37.54 /opt/FirefoxSource/mozilla-release/js/src/jit/arm/Assembler-arm.cpp:2507:26: note: 'c' was declared here
23:37.54 In file included from /opt/FirefoxSource/mozilla-release/js/src/jit/arm/MacroAssembler-arm.h:14:0,
23:37.54                  from /opt/FirefoxSource/mozilla-release/js/src/jit/MacroAssembler.h:17,
23:37.54                  from /opt/FirefoxSource/mozilla-release/js/src/jit/BaselineJIT.h:18,
23:37.54                  from /opt/FirefoxSource/mozilla-release/js/src/jit/BaselineIC.h:18,
23:37.54                  from /opt/FirefoxSource/mozilla-release/js/src/jit/VMFunctions.cpp:12,
23:37.54                  from /opt/FirefoxSource/mozilla-release/objdir-droid/js/src/Unified_cpp_js_src6.cpp:2:
23:37.54 /opt/FirefoxSource/mozilla-release/js/src/jit/arm/Assembler-arm.h: In function 'void js::jit::PatchJump(js::jit::CodeLocationJump&, js::jit::CodeLocationLabel)':
23:37.54 Warning: -Wmaybe-uninitialized in /opt/FirefoxSource/mozilla-release/js/src/jit/arm/Assembler-arm.h: 'c' may be used uninitialized in this function
23:37.54 /opt/FirefoxSource/mozilla-release/js/src/jit/arm/Assembler-arm.h:700:68: warning: 'c' may be used uninitialized in this function [-Wmaybe-uninitialized]
23:37.54 In file included from /opt/FirefoxSource/mozilla-release/objdir-droid/js/src/Unified_cpp_js_src6.cpp:29:0:
23:37.54 /opt/FirefoxSource/mozilla-release/js/src/jit/arm/Assembler-arm.cpp:539:26: note: 'c' was declared here
23:37.54 In file included from /opt/FirefoxSource/mozilla-release/objdir-droid/js/src/Unified_cpp_js_src6.cpp:29:0:
23:37.54 /opt/FirefoxSource/mozilla-release/js/src/jit/arm/Assembler-arm.cpp: In member function 'js::jit::Instruction* js::jit::Instruction::skipPool()':
23:37.54 Warning: -Wmaybe-uninitialized in /opt/FirefoxSource/mozilla-release/js/src/jit/arm/Assembler-arm.cpp: 'c' may be used uninitialized in this function
23:37.54 /opt/FirefoxSource/mozilla-release/js/src/jit/arm/Assembler-arm.cpp:2699:5: warning: 'c' may be used uninitialized in this function [-Wmaybe-uninitialized]
23:37.54 /opt/FirefoxSource/mozilla-release/js/src/jit/arm/Assembler-arm.cpp:2697:26: note: 'c' was declared here
23:37.54 Warning: -Wmaybe-uninitialized in /opt/FirefoxSource/mozilla-release/js/src/jit/arm/Assembler-arm.cpp: 'c' may be used uninitialized in this function
23:37.54 /opt/FirefoxSource/mozilla-release/js/src/jit/arm/Assembler-arm.cpp:2681:5: warning: 'c' may be used uninitialized in this function [-Wmaybe-uninitialized]
23:37.54 /opt/FirefoxSource/mozilla-release/js/src/jit/arm/Assembler-arm.cpp:2679:26: note: 'c' was declared here
23:37.54 /opt/FirefoxSource/mozilla-release/js/src/jit/arm/Assembler-arm.cpp: In member function 'js::jit::Instruction* js::jit::Instruction::next()':
23:37.54 Warning: -Wmaybe-uninitialized in /opt/FirefoxSource/mozilla-release/js/src/jit/arm/Assembler-arm.cpp: 'c' may be used uninitialized in this function
23:37.54 /opt/FirefoxSource/mozilla-release/js/src/jit/arm/Assembler-arm.cpp:2681:5: warning: 'c' may be used uninitialized in this function [-Wmaybe-uninitialized]
23:37.54 /opt/FirefoxSource/mozilla-release/js/src/jit/arm/Assembler-arm.cpp:2679:26: note: 'c' was declared here
23:37.54 Warning: -Wmaybe-uninitialized in /opt/FirefoxSource/mozilla-release/js/src/jit/arm/Assembler-arm.cpp: 'c' may be used uninitialized in this function
23:37.54 /opt/FirefoxSource/mozilla-release/js/src/jit/arm/Assembler-arm.cpp:2681:5: warning: 'c' may be used uninitialized in this function [-Wmaybe-uninitialized]
23:37.54 /opt/FirefoxSource/mozilla-release/js/src/jit/arm/Assembler-arm.cpp:2679:26: note: 'c' was declared here
23:37.54 In file included from /opt/FirefoxSource/mozilla-release/js/src/jit/arm/MacroAssembler-arm.h:14:0,
23:37.54                  from /opt/FirefoxSource/mozilla-release/js/src/jit/MacroAssembler.h:17,
23:37.54                  from /opt/FirefoxSource/mozilla-release/js/src/jit/BaselineJIT.h:18,
23:37.54                  from /opt/FirefoxSource/mozilla-release/js/src/jit/BaselineIC.h:18,
23:37.54                  from /opt/FirefoxSource/mozilla-release/js/src/jit/VMFunctions.cpp:12,
23:37.54                  from /opt/FirefoxSource/mozilla-release/objdir-droid/js/src/Unified_cpp_js_src6.cpp:2:
23:37.54 /opt/FirefoxSource/mozilla-release/js/src/jit/arm/Assembler-arm.h: In member function 'void js::jit::Assembler::bind(js::jit::Label*, js::jit::BufferOffset)':
23:37.54 Warning: -Wmaybe-uninitialized in /opt/FirefoxSource/mozilla-release/js/src/jit/arm/Assembler-arm.h: 'c' may be used uninitialized in this function
23:37.54 /opt/FirefoxSource/mozilla-release/js/src/jit/arm/Assembler-arm.h:1813:85: warning: 'c' may be used uninitialized in this function [-Wmaybe-uninitialized]
23:37.54 In file included from /opt/FirefoxSource/mozilla-release/objdir-droid/js/src/Unified_cpp_js_src6.cpp:29:0:
23:37.54 /opt/FirefoxSource/mozilla-release/js/src/jit/arm/Assembler-arm.cpp:2373:23: note: 'c' was declared here
23:37.54 In file included from /opt/FirefoxSource/mozilla-release/js/src/jit/arm/MacroAssembler-arm.h:14:0,
23:37.54                  from /opt/FirefoxSource/mozilla-release/js/src/jit/MacroAssembler.h:17,
23:37.54                  from /opt/FirefoxSource/mozilla-release/js/src/jit/BaselineJIT.h:18,
23:37.54                  from /opt/FirefoxSource/mozilla-release/js/src/jit/BaselineIC.h:18,
23:37.54                  from /opt/FirefoxSource/mozilla-release/js/src/jit/VMFunctions.cpp:12,
23:37.54                  from /opt/FirefoxSource/mozilla-release/objdir-droid/js/src/Unified_cpp_js_src6.cpp:2:
23:37.54 /opt/FirefoxSource/mozilla-release/js/src/jit/arm/Assembler-arm.h: In member function 'void js::jit::Assembler::bind(js::jit::RepatchLabel*)':
23:37.54 Warning: -Wmaybe-uninitialized in /opt/FirefoxSource/mozilla-release/js/src/jit/arm/Assembler-arm.h: 'cond' may be used uninitialized in this function
23:37.54 /opt/FirefoxSource/mozilla-release/js/src/jit/arm/Assembler-arm.h:1813:85: warning: 'cond' may be used uninitialized in this function [-Wmaybe-uninitialized]
23:37.54 In file included from /opt/FirefoxSource/mozilla-release/objdir-droid/js/src/Unified_cpp_js_src6.cpp:29:0:
23:37.54 /opt/FirefoxSource/mozilla-release/js/src/jit/arm/Assembler-arm.cpp:2400:19: note: 'cond' was declared here
23:37.54 In file included from /opt/FirefoxSource/mozilla-release/js/src/jit/arm/MacroAssembler-arm.h:14:0,
23:37.54                  from /opt/FirefoxSource/mozilla-release/js/src/jit/MacroAssembler.h:17,
23:37.55                  from /opt/FirefoxSource/mozilla-release/js/src/jit/BaselineJIT.h:18,
23:37.55                  from /opt/FirefoxSource/mozilla-release/js/src/jit/BaselineIC.h:18,
23:37.55                  from /opt/FirefoxSource/mozilla-release/js/src/jit/VMFunctions.cpp:12,
23:37.55                  from /opt/FirefoxSource/mozilla-release/objdir-droid/js/src/Unified_cpp_js_src6.cpp:2:
23:37.55 /opt/FirefoxSource/mozilla-release/js/src/jit/arm/Assembler-arm.h: In member function 'void js::jit::Assembler::retarget(js::jit::Label*, js::jit::Label*)':
23:37.55 Warning: -Wmaybe-uninitialized in /opt/FirefoxSource/mozilla-release/js/src/jit/arm/Assembler-arm.h: 'c' may be used uninitialized in this function
23:37.55 /opt/FirefoxSource/mozilla-release/js/src/jit/arm/Assembler-arm.h:1813:85: warning: 'c' may be used uninitialized in this function [-Wmaybe-uninitialized]
23:37.55 In file included from /opt/FirefoxSource/mozilla-release/objdir-droid/js/src/Unified_cpp_js_src6.cpp:29:0:
23:37.55 /opt/FirefoxSource/mozilla-release/js/src/jit/arm/Assembler-arm.cpp:2429:23: note: 'c' was declared here
23:37.55 In file included from /opt/FirefoxSource/mozilla-release/js/src/jit/arm/MacroAssembler-arm.h:14:0,
23:37.55                  from /opt/FirefoxSource/mozilla-release/js/src/jit/MacroAssembler.h:17,
23:37.55                  from /opt/FirefoxSource/mozilla-release/js/src/jit/BaselineJIT.h:18,
23:37.55                  from /opt/FirefoxSource/mozilla-release/js/src/jit/BaselineIC.h:18,
23:37.55                  from /opt/FirefoxSource/mozilla-release/js/src/jit/VMFunctions.cpp:12,
23:37.55                  from /opt/FirefoxSource/mozilla-release/objdir-droid/js/src/Unified_cpp_js_src6.cpp:2:
23:37.55 /opt/FirefoxSource/mozilla-release/js/src/jit/arm/Assembler-arm.h: In member function 'void js::jit::AssemblerBufferWithConstantPools<SliceSize, InstSize, Inst, Asm>::executableCopy(uint8_t*) [with unsigned int SliceSize = 1024u; unsigned int InstSize = 4u; Inst = js::jit::Instruction; Asm = js::jit::Assembler; uint8_t = unsigned char]':
23:37.55 Warning: -Wmaybe-uninitialized in /opt/FirefoxSource/mozilla-release/js/src/jit/arm/Assembler-arm.h: 'c' may be used uninitialized in this function
23:37.55 /opt/FirefoxSource/mozilla-release/js/src/jit/arm/Assembler-arm.h:1813:85: warning: 'c' may be used uninitialized in this function [-Wmaybe-uninitialized]
23:37.55 In file included from /opt/FirefoxSource/mozilla-release/objdir-droid/js/src/Unified_cpp_js_src6.cpp:29:0:
23:37.55 /opt/FirefoxSource/mozilla-release/js/src/jit/arm/Assembler-arm.cpp:2507:26: note: 'c' was declared here
23:38.01 Unified_cpp_js_src10.o
23:44.99 In file included from /opt/FirefoxSource/mozilla-release/objdir-droid/js/src/Unified_cpp_js_src4.cpp:11:0:
23:44.99 /opt/FirefoxSource/mozilla-release/js/src/jit/IonBuilder.cpp: In member function 'bool js::jit::IonBuilder::storeReferenceTypedObjectValue(js::jit::MDefinition*, const js::jit::LinearSum&, js::ReferenceTypeDescr::Type, js::jit::MDefinition*, js::PropertyName*)':
23:45.00 Warning: -Wmaybe-uninitialized in /opt/FirefoxSource/mozilla-release/js/src/jit/IonBuilder.cpp: 'store' may be used uninitialized in this function
23:45.00 /opt/FirefoxSource/mozilla-release/js/src/jit/IonBuilder.cpp:11666:24: warning: 'store' may be used uninitialized in this function [-Wmaybe-uninitialized]
23:45.00 In file included from /opt/FirefoxSource/mozilla-release/objdir-droid/js/src/Unified_cpp_js_src4.cpp:11:0:
23:45.00 /opt/FirefoxSource/mozilla-release/js/src/jit/IonBuilder.cpp: In member function 'bool js::jit::IonBuilder::pushReferenceLoadFromTypedObject(js::jit::MDefinition*, const js::jit::LinearSum&, js::ReferenceTypeDescr::Type, js::PropertyName*)':
23:45.00 Warning: -Wmaybe-uninitialized in /opt/FirefoxSource/mozilla-release/js/src/jit/IonBuilder.cpp: 'load' may be used uninitialized in this function
23:45.00 /opt/FirefoxSource/mozilla-release/js/src/jit/IonBuilder.cpp:7591:24: warning: 'load' may be used uninitialized in this function [-Wmaybe-uninitialized]
23:45.10 Unified_cpp_js_src11.o
24:01.38 Unified_cpp_js_src12.o
24:08.92 In file included from /opt/FirefoxSource/mozilla-release/js/src/vm/Stack.h:16:0,
24:08.92                  from /opt/FirefoxSource/mozilla-release/js/src/vm/Runtime.h:42,
24:08.92                  from /opt/FirefoxSource/mozilla-release/js/src/builtin/MapObject.h:12,
24:08.92                  from /opt/FirefoxSource/mozilla-release/js/src/jsobjinlines.h:12,
24:08.92                  from /opt/FirefoxSource/mozilla-release/js/src/proxy/ScriptedDirectProxyHandler.cpp:13,
24:08.92                  from /opt/FirefoxSource/mozilla-release/objdir-droid/js/src/Unified_cpp_js_src9.cpp:2:
24:08.92 /opt/FirefoxSource/mozilla-release/js/src/jit/JitFrameIterator.h: In member function 'void js::jit::JitFrameIterator::unaliasedForEachActual(Op, js::jit::ReadFrameArgsBehavior) const [with Op = js::CopyToHeap]':
24:08.92 Warning: -Wmaybe-uninitialized in /opt/FirefoxSource/mozilla-release/js/src/jit/JitFrameIterator.h: 'end' may be used uninitialized in this function
24:08.92 /opt/FirefoxSource/mozilla-release/js/src/jit/JitFrameIterator.h:249:9: warning: 'end' may be used uninitialized in this function [-Wmaybe-uninitialized]
24:08.92 Warning: -Wmaybe-uninitialized in /opt/FirefoxSource/mozilla-release/js/src/jit/JitFrameIterator.h: 'start' may be used uninitialized in this function
24:08.92 /opt/FirefoxSource/mozilla-release/js/src/jit/JitFrameIterator.h:229:10: warning: 'start' may be used uninitialized in this function [-Wmaybe-uninitialized]
24:09.10 In file included from /opt/FirefoxSource/mozilla-release/js/src/vm/Shape-inl.h:22:0,
24:09.10                  from /opt/FirefoxSource/mozilla-release/js/src/jsscriptinlines.h:19,
24:09.10                  from /opt/FirefoxSource/mozilla-release/js/src/jit/ExecutionMode-inl.h:12,
24:09.10                  from /opt/FirefoxSource/mozilla-release/js/src/jsinferinlines.h:27,
24:09.10                  from /opt/FirefoxSource/mozilla-release/js/src/jsapi.cpp:91,
24:09.10                  from /opt/FirefoxSource/mozilla-release/objdir-droid/js/src/Unified_cpp_js_src7.cpp:2:
24:09.10 /opt/FirefoxSource/mozilla-release/js/src/jsgcinlines.h: In function 'void js::ReleaseAllJITCode(js::FreeOp*)':
24:09.10 Warning: -Wmaybe-uninitialized in /opt/FirefoxSource/mozilla-release/js/src/jsgcinlines.h: '*((void*)(& i)+12).js::gc::ArenaCellIterImpl::thing' may be used uninitialized in this function
24:09.10 /opt/FirefoxSource/mozilla-release/js/src/jsgcinlines.h:229:27: warning: '*((void*)(& i)+12).js::gc::ArenaCellIterImpl::thing' may be used uninitialized in this function [-Wmaybe-uninitialized]
24:09.10 In file included from /opt/FirefoxSource/mozilla-release/objdir-droid/js/src/Unified_cpp_js_src7.cpp:92:0:
24:09.10 /opt/FirefoxSource/mozilla-release/js/src/jsgc.cpp:6799:27: note: '*((void*)(& i)+12).js::gc::ArenaCellIterImpl::thing' was declared here
24:09.10 In file included from /opt/FirefoxSource/mozilla-release/js/src/gc/Barrier.h:12:0,
24:09.10                  from /opt/FirefoxSource/mozilla-release/js/src/jsobj.h:21,
24:09.10                  from /opt/FirefoxSource/mozilla-release/js/src/jsarray.h:12,
24:09.10                  from /opt/FirefoxSource/mozilla-release/js/src/jsapi.cpp:22,
24:09.10                  from /opt/FirefoxSource/mozilla-release/objdir-droid/js/src/Unified_cpp_js_src7.cpp:2:
24:09.10 Warning: -Wmaybe-uninitialized in /opt/FirefoxSource/mozilla-release/js/src/gc/Heap.h: '*((void*)(& i)+12).js::gc::ArenaCellIterImpl::span.js::gc::FreeSpan::last' may be used uninitialized in this function
24:09.10 /opt/FirefoxSource/mozilla-release/js/src/gc/Heap.h:304:49: warning: '*((void*)(& i)+12).js::gc::ArenaCellIterImpl::span.js::gc::FreeSpan::last' may be used uninitialized in this function [-Wmaybe-uninitialized]
24:09.10 In file included from /opt/FirefoxSource/mozilla-release/objdir-droid/js/src/Unified_cpp_js_src7.cpp:92:0:
24:09.10 /opt/FirefoxSource/mozilla-release/js/src/jsgc.cpp:6799:27: note: '*((void*)(& i)+12).js::gc::ArenaCellIterImpl::span.js::gc::FreeSpan::last' was declared here
24:09.10 In file included from /opt/FirefoxSource/mozilla-release/js/src/vm/Shape-inl.h:22:0,
24:09.10                  from /opt/FirefoxSource/mozilla-release/js/src/jsscriptinlines.h:19,
24:09.10                  from /opt/FirefoxSource/mozilla-release/js/src/jit/ExecutionMode-inl.h:12,
24:09.10                  from /opt/FirefoxSource/mozilla-release/js/src/jsinferinlines.h:27,
24:09.10                  from /opt/FirefoxSource/mozilla-release/js/src/jsapi.cpp:91,
24:09.10                  from /opt/FirefoxSource/mozilla-release/objdir-droid/js/src/Unified_cpp_js_src7.cpp:2:
24:09.10 Warning: -Wmaybe-uninitialized in /opt/FirefoxSource/mozilla-release/js/src/jsgcinlines.h: '*((void*)(& i)+12).js::gc::ArenaCellIterImpl::span.js::gc::FreeSpan::first' may be used uninitialized in this function
24:09.10 /opt/FirefoxSource/mozilla-release/js/src/jsgcinlines.h:170:9: warning: '*((void*)(& i)+12).js::gc::ArenaCellIterImpl::span.js::gc::FreeSpan::first' may be used uninitialized in this function [-Wmaybe-uninitialized]
24:09.10 In file included from /opt/FirefoxSource/mozilla-release/objdir-droid/js/src/Unified_cpp_js_src7.cpp:92:0:
24:09.10 /opt/FirefoxSource/mozilla-release/js/src/jsgc.cpp:6799:27: note: '*((void*)(& i)+12).js::gc::ArenaCellIterImpl::span.js::gc::FreeSpan::first' was declared here
24:09.10 In file included from /opt/FirefoxSource/mozilla-release/js/src/vm/Shape-inl.h:22:0,
24:09.10                  from /opt/FirefoxSource/mozilla-release/js/src/jsscriptinlines.h:19,
24:09.10                  from /opt/FirefoxSource/mozilla-release/js/src/jit/ExecutionMode-inl.h:12,
24:09.10                  from /opt/FirefoxSource/mozilla-release/js/src/jsinferinlines.h:27,
24:09.10                  from /opt/FirefoxSource/mozilla-release/js/src/jsapi.cpp:91,
24:09.10                  from /opt/FirefoxSource/mozilla-release/objdir-droid/js/src/Unified_cpp_js_src7.cpp:2:
24:09.10 /opt/FirefoxSource/mozilla-release/js/src/jsgcinlines.h: In function 'void js::PurgeJITCaches(JS::Zone*)':
24:09.10 Warning: -Wmaybe-uninitialized in /opt/FirefoxSource/mozilla-release/js/src/jsgcinlines.h: '*((void*)(& i)+12).js::gc::ArenaCellIterImpl::thing' may be used uninitialized in this function
24:09.10 /opt/FirefoxSource/mozilla-release/js/src/jsgcinlines.h:229:27: warning: '*((void*)(& i)+12).js::gc::ArenaCellIterImpl::thing' may be used uninitialized in this function [-Wmaybe-uninitialized]
24:09.10 In file included from /opt/FirefoxSource/mozilla-release/objdir-droid/js/src/Unified_cpp_js_src7.cpp:92:0:
24:09.10 /opt/FirefoxSource/mozilla-release/js/src/jsgc.cpp:6817:30: note: '*((void*)(& i)+12).js::gc::ArenaCellIterImpl::thing' was declared here
24:09.10 In file included from /opt/FirefoxSource/mozilla-release/js/src/gc/Barrier.h:12:0,
24:09.10                  from /opt/FirefoxSource/mozilla-release/js/src/jsobj.h:21,
24:09.11                  from /opt/FirefoxSource/mozilla-release/js/src/jsarray.h:12,
24:09.11                  from /opt/FirefoxSource/mozilla-release/js/src/jsapi.cpp:22,
24:09.11                  from /opt/FirefoxSource/mozilla-release/objdir-droid/js/src/Unified_cpp_js_src7.cpp:2:
24:09.11 Warning: -Wmaybe-uninitialized in /opt/FirefoxSource/mozilla-release/js/src/gc/Heap.h: '*((void*)(& i)+12).js::gc::ArenaCellIterImpl::span.js::gc::FreeSpan::last' may be used uninitialized in this function
24:09.11 /opt/FirefoxSource/mozilla-release/js/src/gc/Heap.h:304:49: warning: '*((void*)(& i)+12).js::gc::ArenaCellIterImpl::span.js::gc::FreeSpan::last' may be used uninitialized in this function [-Wmaybe-uninitialized]
24:09.11 In file included from /opt/FirefoxSource/mozilla-release/objdir-droid/js/src/Unified_cpp_js_src7.cpp:92:0:
24:09.11 /opt/FirefoxSource/mozilla-release/js/src/jsgc.cpp:6817:30: note: '*((void*)(& i)+12).js::gc::ArenaCellIterImpl::span.js::gc::FreeSpan::last' was declared here
24:09.11 In file included from /opt/FirefoxSource/mozilla-release/js/src/vm/Shape-inl.h:22:0,
24:09.11                  from /opt/FirefoxSource/mozilla-release/js/src/jsscriptinlines.h:19,
24:09.11                  from /opt/FirefoxSource/mozilla-release/js/src/jit/ExecutionMode-inl.h:12,
24:09.11                  from /opt/FirefoxSource/mozilla-release/js/src/jsinferinlines.h:27,
24:09.11                  from /opt/FirefoxSource/mozilla-release/js/src/jsapi.cpp:91,
24:09.11                  from /opt/FirefoxSource/mozilla-release/objdir-droid/js/src/Unified_cpp_js_src7.cpp:2:
24:09.11 Warning: -Wmaybe-uninitialized in /opt/FirefoxSource/mozilla-release/js/src/jsgcinlines.h: '*((void*)(& i)+12).js::gc::ArenaCellIterImpl::span.js::gc::FreeSpan::first' may be used uninitialized in this function
24:09.11 /opt/FirefoxSource/mozilla-release/js/src/jsgcinlines.h:170:9: warning: '*((void*)(& i)+12).js::gc::ArenaCellIterImpl::span.js::gc::FreeSpan::first' may be used uninitialized in this function [-Wmaybe-uninitialized]
24:09.11 In file included from /opt/FirefoxSource/mozilla-release/objdir-droid/js/src/Unified_cpp_js_src7.cpp:92:0:
24:09.11 /opt/FirefoxSource/mozilla-release/js/src/jsgc.cpp:6817:30: note: '*((void*)(& i)+12).js::gc::ArenaCellIterImpl::span.js::gc::FreeSpan::first' was declared here
24:09.11 In file included from /opt/FirefoxSource/mozilla-release/js/src/vm/Stack.h:16:0,
24:09.11                  from /opt/FirefoxSource/mozilla-release/js/src/vm/Runtime.h:42,
24:09.11                  from /opt/FirefoxSource/mozilla-release/js/src/jscntxt.h:15,
24:09.11                  from /opt/FirefoxSource/mozilla-release/js/src/jsapi.cpp:25,
24:09.11                  from /opt/FirefoxSource/mozilla-release/objdir-droid/js/src/Unified_cpp_js_src7.cpp:2:
24:09.11 /opt/FirefoxSource/mozilla-release/js/src/jit/JitFrameIterator.h: In member function 'void js::jit::JitFrameIterator::unaliasedForEachActual(Op, js::jit::ReadFrameArgsBehavior) const [with Op = js::CopyTo]':
24:09.11 Warning: -Wmaybe-uninitialized in /opt/FirefoxSource/mozilla-release/js/src/jit/JitFrameIterator.h: 'end' may be used uninitialized in this function
24:09.11 /opt/FirefoxSource/mozilla-release/js/src/jit/JitFrameIterator.h:229:10: warning: 'end' may be used uninitialized in this function [-Wmaybe-uninitialized]
24:09.11 Warning: -Wmaybe-uninitialized in /opt/FirefoxSource/mozilla-release/js/src/jit/JitFrameIterator.h: 'start' may be used uninitialized in this function
24:09.11 /opt/FirefoxSource/mozilla-release/js/src/jit/JitFrameIterator.h:229:10: warning: 'start' may be used uninitialized in this function [-Wmaybe-uninitialized]
24:09.11 In file included from /opt/FirefoxSource/mozilla-release/js/src/vm/Shape-inl.h:22:0,
24:09.11                  from /opt/FirefoxSource/mozilla-release/js/src/jsscriptinlines.h:19,
24:09.11                  from /opt/FirefoxSource/mozilla-release/js/src/jit/ExecutionMode-inl.h:12,
24:09.11                  from /opt/FirefoxSource/mozilla-release/js/src/jsinferinlines.h:27,
24:09.11                  from /opt/FirefoxSource/mozilla-release/js/src/jsapi.cpp:91,
24:09.11                  from /opt/FirefoxSource/mozilla-release/objdir-droid/js/src/Unified_cpp_js_src7.cpp:2:
24:09.11 /opt/FirefoxSource/mozilla-release/js/src/jsgcinlines.h: In member function 'void js::types::TypeZone::clearAllNewScriptsOnOOM()':
24:09.11 Warning: -Wmaybe-uninitialized in /opt/FirefoxSource/mozilla-release/js/src/jsgcinlines.h: '*((void*)(& iter)+12).js::gc::ArenaCellIterImpl::thing' may be used uninitialized in this function
24:09.11 /opt/FirefoxSource/mozilla-release/js/src/jsgcinlines.h:219:53: warning: '*((void*)(& iter)+12).js::gc::ArenaCellIterImpl::thing' may be used uninitialized in this function [-Wmaybe-uninitialized]
24:09.11 In file included from /opt/FirefoxSource/mozilla-release/objdir-droid/js/src/Unified_cpp_js_src7.cpp:101:0:
24:09.11 /opt/FirefoxSource/mozilla-release/js/src/jsinfer.cpp:5197:34: note: '*((void*)(& iter)+12).js::gc::ArenaCellIterImpl::thing' was declared here
24:09.11 In file included from /opt/FirefoxSource/mozilla-release/js/src/gc/Barrier.h:12:0,
24:09.11                  from /opt/FirefoxSource/mozilla-release/js/src/jsobj.h:21,
24:09.11                  from /opt/FirefoxSource/mozilla-release/js/src/jsarray.h:12,
24:09.11                  from /opt/FirefoxSource/mozilla-release/js/src/jsapi.cpp:22,
24:09.11                  from /opt/FirefoxSource/mozilla-release/objdir-droid/js/src/Unified_cpp_js_src7.cpp:2:
24:09.11 Warning: -Wmaybe-uninitialized in /opt/FirefoxSource/mozilla-release/js/src/gc/Heap.h: '*((void*)(& iter)+12).js::gc::ArenaCellIterImpl::span.js::gc::FreeSpan::last' may be used uninitialized in this function
24:09.12 /opt/FirefoxSource/mozilla-release/js/src/gc/Heap.h:304:49: warning: '*((void*)(& iter)+12).js::gc::ArenaCellIterImpl::span.js::gc::FreeSpan::last' may be used uninitialized in this function [-Wmaybe-uninitialized]
24:09.12 In file included from /opt/FirefoxSource/mozilla-release/objdir-droid/js/src/Unified_cpp_js_src7.cpp:101:0:
24:09.12 /opt/FirefoxSource/mozilla-release/js/src/jsinfer.cpp:5197:34: note: '*((void*)(& iter)+12).js::gc::ArenaCellIterImpl::span.js::gc::FreeSpan::last' was declared here
24:09.12 In file included from /opt/FirefoxSource/mozilla-release/js/src/vm/Shape-inl.h:22:0,
24:09.12                  from /opt/FirefoxSource/mozilla-release/js/src/jsscriptinlines.h:19,
24:09.12                  from /opt/FirefoxSource/mozilla-release/js/src/jit/ExecutionMode-inl.h:12,
24:09.12                  from /opt/FirefoxSource/mozilla-release/js/src/jsinferinlines.h:27,
24:09.12                  from /opt/FirefoxSource/mozilla-release/js/src/jsapi.cpp:91,
24:09.12                  from /opt/FirefoxSource/mozilla-release/objdir-droid/js/src/Unified_cpp_js_src7.cpp:2:
24:09.12 Warning: -Wmaybe-uninitialized in /opt/FirefoxSource/mozilla-release/js/src/jsgcinlines.h: '*((void*)(& iter)+12).js::gc::ArenaCellIterImpl::span.js::gc::FreeSpan::first' may be used uninitialized in this function
24:09.12 /opt/FirefoxSource/mozilla-release/js/src/jsgcinlines.h:170:9: warning: '*((void*)(& iter)+12).js::gc::ArenaCellIterImpl::span.js::gc::FreeSpan::first' may be used uninitialized in this function [-Wmaybe-uninitialized]
24:09.12 In file included from /opt/FirefoxSource/mozilla-release/objdir-droid/js/src/Unified_cpp_js_src7.cpp:101:0:
24:09.12 /opt/FirefoxSource/mozilla-release/js/src/jsinfer.cpp:5197:34: note: '*((void*)(& iter)+12).js::gc::ArenaCellIterImpl::span.js::gc::FreeSpan::first' was declared here
24:39.68 In file included from /opt/FirefoxSource/mozilla-release/objdir-droid/js/src/Unified_cpp_js_src11.cpp:56:0:
24:39.68 /opt/FirefoxSource/mozilla-release/js/src/vm/String.cpp: In function 'JSString* js::ConcatStrings(js::ExclusiveContext*, typename js::MaybeRooted<JSString*, allowGC>::HandleType, typename js::MaybeRooted<JSString*, allowGC>::HandleType) [with js::AllowGC allowGC = (js::AllowGC)1u; typename js::MaybeRooted<JSString*, allowGC>::HandleType = JS::Handle<JSString*>]':
24:39.68 Warning: -Wmaybe-uninitialized in /opt/FirefoxSource/mozilla-release/js/src/vm/String.cpp: 'twoByteBuf' may be used uninitialized in this function
24:39.68 /opt/FirefoxSource/mozilla-release/js/src/vm/String.cpp:464:1: warning: 'twoByteBuf' may be used uninitialized in this function [-Wmaybe-uninitialized]
24:39.68 Warning: -Wmaybe-uninitialized in /opt/FirefoxSource/mozilla-release/js/src/vm/String.cpp: 'latin1Buf' may be used uninitialized in this function
24:39.68 /opt/FirefoxSource/mozilla-release/js/src/vm/String.cpp:506:82: warning: 'latin1Buf' may be used uninitialized in this function [-Wmaybe-uninitialized]
24:39.68 /opt/FirefoxSource/mozilla-release/js/src/vm/String.cpp: In function 'JSString* js::ConcatStrings(js::ExclusiveContext*, typename js::MaybeRooted<JSString*, allowGC>::HandleType, typename js::MaybeRooted<JSString*, allowGC>::HandleType) [with js::AllowGC allowGC = (js::AllowGC)0u; typename js::MaybeRooted<JSString*, allowGC>::HandleType = JSString*]':
24:39.68 Warning: -Wmaybe-uninitialized in /opt/FirefoxSource/mozilla-release/js/src/vm/String.cpp: 'twoByteBuf' may be used uninitialized in this function
24:39.68 /opt/FirefoxSource/mozilla-release/js/src/vm/String.cpp:464:1: warning: 'twoByteBuf' may be used uninitialized in this function [-Wmaybe-uninitialized]
24:39.68 Warning: -Wmaybe-uninitialized in /opt/FirefoxSource/mozilla-release/js/src/vm/String.cpp: 'latin1Buf' may be used uninitialized in this function
24:39.68 /opt/FirefoxSource/mozilla-release/js/src/vm/String.cpp:506:82: warning: 'latin1Buf' may be used uninitialized in this function [-Wmaybe-uninitialized]
24:39.68 libjs_static.a
24:40.57 Unified_cpp_js_src_gdb0.o
24:40.57 Unified_cpp_js_src_shell0.o
24:40.58 Unified_cpp_js_src_jsapi-tests0.o
24:40.58 Unified_cpp_js_src_jsapi-tests1.o
24:40.59 StaticXULComponentsStart.o
24:40.80 libxul_s.a.desc
24:40.80 libxul.so
24:43.56 gdb-tests
24:45.03 Unified_cpp_js_src_jsapi-tests2.o
24:49.63 Unified_cpp_js_src_jsapi-tests3.o
24:50.34 Unified_cpp_js_src_jsapi-tests4.o
24:50.87 js
24:52.43 Unified_cpp_js_src_jsapi-tests5.o
25:04.89 jsapi-tests
26:43.43 TestAudioEventTimeline.o
26:43.48 PropertiesTest.o
26:43.48 ReadNTLM.o
26:43.51 triplescat.o
26:43.55 TestComponent.o
26:43.69 libtest656331.so
26:43.85 TestComponent.o
26:44.03 libtestcomponent.so
26:44.03 triplescat
26:44.07 TestBlockingSocket.o
26:44.16 test_tone.o
26:44.39 test_tone
26:44.45 TestCSPParser.o
26:44.45 TestGetURL.o
26:44.52 TestTXMgr.o
26:44.60 TestCallbacks.o
26:45.43 TestAudioEventTimeline
26:45.63 test_AsXXX_helpers.o
26:45.63 test_async_callbacks_with_spun_event_loops.o
26:45.83 TestDNS.o
26:45.93 TestNativeXMLHttpRequest.o
26:46.56 test_asyncStatementExecution_transaction.o
26:46.57 TestPlainTextSerializer.o
26:46.59 TestTXMgr
26:46.69 TestComponent.o
26:46.86 libtestcompnoaslr.so
26:46.97 rdfpoll.o
26:47.10 TestIncrementalDownload.o
26:47.37 test_binding_params.o
26:47.46 rdfpoll
26:47.55 test_file_perms.o
26:47.56 TestOpen.o
26:47.89 TestCSPParser
26:47.89 TestGetURL
26:47.97 TestNativeXMLHttpRequest
26:48.04 TestPlainTextSerializer
26:48.20 test_mutex.o
26:48.39 test_service_init_background_thread.o
26:48.52 test_statement_scoper.o
26:48.79 TestPageLoad.o
26:48.99 test_StatementCache.o
26:49.16 test_transaction_helper.o
26:49.33 TestAudioChannelService.o
26:49.78 test_true_async.o
26:50.02 TestProtocols.o
26:50.27 test_unlock_notify.o
26:50.67 TestAudioChannelService
26:50.85 xpcshell.o
26:51.04 xpcshell
26:51.16 Unified_cpp_components_native0.o
26:51.17 test_AsXXX_helpers
26:51.17 test_async_callbacks_with_spun_event_loops
26:51.25 test_asyncStatementExecution_transaction
26:51.33 test_binding_params
26:51.40 test_file_perms
26:51.49 test_mutex
26:51.51 TestServ.o
26:51.57 test_service_init_background_thread
26:51.65 test_statement_scoper
26:51.73 test_StatementCache
26:51.75 TestLineBreak.o
26:51.83 test_transaction_helper
26:51.91 test_true_async
26:51.94 libxpctest.so
26:51.99 test_unlock_notify
26:52.05 Unified_cpp_xpcom_sample0.o
26:52.22 TestAppShellSteadyState.o
26:52.44 libxpcomsample.so
26:52.47 TestLineBreak
26:52.61 Unified_cpp_streamconv_test0.o
26:52.88 TestCertDB.o
26:53.07 TestCertDB
26:53.18 nsIFileEnumerator.o
26:53.18 TestArguments.o
26:53.26 TestStandardURL.o
26:53.40 TestStreamConv
26:53.52 TestBlockingProcess.o
26:53.56 TestStartupCache.o
26:53.60 TestCallTemplates.o
26:53.65 TestINIParser.o
26:53.96 TestPRIntN.o
26:54.37 TestQuickReturn.o
26:54.44 TestRacingServiceManager.o
26:54.44 TestStreamLoader.o
26:54.47 TestStartupCache
26:54.53 TestAppShellSteadyState
26:54.60 TestRegistrationOrder.o
26:54.62 TestThreadPoolListener.o
26:54.64 TestMinStringAPI.o
26:55.00 TestUpload.o
26:55.22 TestTimers.o
26:55.29 TestUnicodeArguments.o
26:55.33 TestMinStringAPI
26:55.44 rdfcat.o
26:55.85 ShowAlignments.o
26:55.89 TestAutoPtr.o
26:55.91 rdfcat
26:55.91 NormalizationTest.o
26:55.91 UnicharSelfTest.o
26:55.97 TestAutoRef.o
26:56.00 TestWebGLElementArrayCache.o
26:56.20 TestURLParser.o
26:56.48 TestCOMArray.o
26:56.85 NormalizationTest
26:56.85 UnicharSelfTest
26:56.96 TestCOMPtr.o
26:57.23 TestAudioBuffers.o
26:57.23 TestAudioMixer.o
26:57.32 TestWebGLElementArrayCache
26:57.47 TestAudioBuffers
26:57.50 urltest.o
26:57.53 TestCOMPtrEq.o
26:58.01 TestDeque.o
26:58.03 TestBind.o
26:58.22 TestAudioMixer
26:58.28 TestFile.o
26:58.29 TestCookie.o
26:58.40 TestHashtables.o
26:58.82 TestSTSParser.o
26:58.89 TestID.o
26:58.98 TestUDPSocket.o
26:59.70 TestNsRefPtr.o
26:59.80 TestObserverArray.o
27:00.06 PropertiesTest
27:00.06 ReadNTLM
27:00.14 TestObserverService.o
27:00.22 TestBlockingSocket
27:00.28 TestCallbacks
27:00.36 TestPipe.o
27:00.76 TestPLDHash.o
27:00.79 TestStringAPI.o
27:00.82 TestDNS
27:00.90 TestIncrementalDownload
27:00.92 TestTArray.o
27:00.99 TestOpen
27:01.06 TestPageLoad
27:01.14 TestProtocols
27:01.15 TestServ
27:01.22 TestStandardURL
27:01.23 TestStreamLoader
27:01.30 TestTextFormatter.o
27:01.30 TestUpload
27:01.34 TestThreadUtils.o
27:01.39 TestJemalloc.o
27:01.39 TestURLParser
27:01.48 urltest
27:01.56 TestBind
27:01.63 TestCookie
27:01.71 TestSTSParser
27:01.79 TestUDPSocket
27:02.15 nsIFileEnumerator
27:02.15 TestArguments
27:02.15 TestBlockingProcess
27:02.17 TestCallTemplates
27:02.22 TestINIParser
27:02.23 TestPRIntN
27:02.24 TestQuickReturn
27:02.29 TestRacingServiceManager
27:02.30 TestRegistrationOrder
27:02.32 TestThreadPoolListener
27:02.35 TestTimers
27:02.38 TestUnicodeArguments
27:02.40 ShowAlignments
27:02.44 TestAutoPtr
27:02.45 TestAutoRef
27:02.47 TestCOMArray
27:02.50 TestCOMPtr
27:02.53 TestCOMPtrEq
27:02.55 TestDeque
27:02.59 TestFile
27:02.61 TestHashtables
27:02.62 TestID
27:02.71 TestNsRefPtr
27:02.71 TestObserverArray
27:02.72 TestObserverService
27:02.78 TestPipe
27:02.79 TestPLDHash
27:02.80 TestStringAPI
27:02.86 TestTextFormatter
27:02.87 TestThreadUtils
27:02.87 TestJemalloc
27:05.19 TestTArray
27:20.60 /opt/FirefoxSource/mozilla-release/mobile/android/modules/WebappManager.jsm: WARNING: no preprocessor directives found
27:20.64 /opt/FirefoxSource/mozilla-release/mobile/android/components/BrowserCLH.js: WARNING: no preprocessor directives found
27:20.89 /opt/FirefoxSource/mozilla-release/mobile/android/components/HelperAppDialog.js: WARNING: no preprocessor directives found
27:21.09 /opt/FirefoxSource/mozilla-release/mobile/android/components/Sidebar.js: WARNING: no useful preprocessor directives found
27:21.57 Warning: missing module: resource://gre/modules/AddonManager.jsm
27:21.71 Warning: missing module: ../../framescript/FrameScriptManager.jsm
27:21.71 Warning: missing module: ../../framescript/FrameScriptManager.jsm
27:21.72 Warning: missing module: ../../framescript/FrameScriptManager.jsm
27:22.00 Exporting extension to source/test/addons/packed.xpi.
27:22.00 Exporting extension to source/test/addons/simple-prefs.xpi.
27:22.00 Exporting extension to source/test/addons/l10n.xpi.
27:22.00 Exporting extension to source/test/addons/require.xpi.
27:22.09 Warning: missing module: resource://gre/modules/AddonManager.jsm
27:22.19 Warning: missing module: ../../framescript/FrameScriptManager.jsm
27:22.20 Exporting extension to source/test/addons/unpacked.xpi.
27:22.23 Exporting extension to source/test/addons/addon-manager.xpi.
27:22.26 Warning: missing module: resource://gre/modules/AddonManager.jsm
27:22.27 Warning: missing module: ../../framescript/FrameScriptManager.jsm
27:22.27 Exporting extension to source/test/addons/e10s.xpi.
27:22.38 Exporting extension to source/test/addons/manifest-localized.xpi.
27:22.39 Warning: missing module: ../../framescript/FrameScriptManager.jsm
27:22.42 Exporting extension to source/test/addons/unsafe-content-script.xpi.
27:22.45 Warning: missing module: resource://gre/modules/AddonManager.jsm
27:22.54 Exporting extension to source/test/addons/page-mod-debugger-pre.xpi.
27:22.56 Warning: missing module: ../../framescript/FrameScriptManager.jsm
27:22.60 Warning: missing module: resource://gre/modules/AddonManager.jsmExporting extension to source/test/addons/standard-id.xpi.
27:22.62 Warning: missing module: ../../framescript/FrameScriptManager.jsm
27:22.72 Exporting extension to source/test/addons/places.xpi.
27:22.78 /opt/FirefoxSource/mozilla-release/addon-sdk/source/python-lib/cuddlefish/xpi.py:22: UserWarning: Duplicate name: 'locale/'
27:22.78   zf.writestr(dirinfo, "")
27:22.79 Exporting extension to source/test/addons/translators.xpi.
27:22.79 Exporting extension to source/test/addons/l10n-properties.xpi.
27:22.83 Warning: missing module: resource://gre/modules/AddonManager.jsm
27:22.85 Warning: missing module: ../../framescript/FrameScriptManager.jsm
27:22.90 Exporting extension to source/test/addons/main.xpi.
27:22.96 Exporting extension to source/test/addons/self.xpi.
27:22.97 Exporting extension to source/test/addons/preferences-branch.xpi.
27:23.00 Exporting extension to source/test/addons/content-permissions.xpi.
27:23.05 Warning: missing module: resource://gre/modules/AddonManager.jsm
27:23.10 Warning: missing module: ../../framescript/FrameScriptManager.jsm
27:23.10 Warning: missing module: ../../framescript/FrameScriptManager.jsm
27:23.11 Warning: missing module: ../../framescript/FrameScriptManager.jsm
27:23.18 Exporting extension to source/test/addons/curly-id.xpi.
27:23.18 Exporting extension to source/test/addons/e10s-tabs.xpi.
27:23.21 Exporting extension to source/test/addons/tab-close-on-startup.xpi.
27:23.45 Exporting extension to source/test/addons/private-browsing-supported.xpi.
27:23.54 Warning: missing module: resource://gre/modules/AddonManager.jsm
27:23.54 Exporting extension to source/test/addons/packaging.xpi.
27:23.62 Warning: missing module: resource://gre/modules/AddonManager.jsm
27:23.66 Exporting extension to source/test/addons/contributors.xpi.
27:23.73 Warning: missing module: ../../framescript/FrameScriptManager.jsm
27:23.75 Exporting extension to source/test/addons/predefined-id-with-at.xpi.
27:23.78 Warning: missing module: resource://gre/modules/AddonManager.jsm
27:23.91 Exporting extension to source/test/addons/author-email.xpi.
27:23.94 Exporting extension to source/test/addons/symbiont.xpi.
27:23.95 Warning: missing module: ../../framescript/FrameScriptManager.jsm
27:23.98 Exporting extension to source/test/addons/child_process.xpi.
27:24.09 Exporting extension to source/test/addons/page-mod-debugger-post.xpi.
27:24.30 Warning: missing module: resource://gre/modules/AddonManager.jsm
27:24.30 Warning: missing module: ../../framescript/FrameScriptManager.jsm
27:24.35 Warning: missing module: resource://gre/modules/AddonManager.jsm
27:24.41 Warning: missing module: ../../framescript/FrameScriptManager.jsm
27:24.48 Exporting extension to source/test/addons/developers.xpi.
27:24.49 Exporting extension to source/test/addons/chrome.xpi.
27:24.56 Exporting extension to source/test/addons/simple-prefs-regression.xpi.
27:24.68 Warning: missing module: ../framescript/FrameScriptManager.jsm
27:24.74 Warning: missing module: ../../framescript/FrameScriptManager.jsm
27:24.79 Warning: missing module: ../../framescript/FrameScriptManager.jsm
27:24.89 Exporting extension to source/test/addons/simple-prefs-l10n.xpi.
27:25.03 Exporting extension to source/test/addons/layout-change.xpi.
27:25.10 /opt/FirefoxSource/mozilla-release/config/rules.mk:1512: warning: overriding recipe for target '../../../dist/bin/modules/LoginManagerParent.jsm'
27:25.10 /opt/FirefoxSource/mozilla-release/config/rules.mk:1447: warning: ignoring old recipe for target '../../../dist/bin/modules/LoginManagerParent.jsm'
27:28.71 /opt/FirefoxSource/mozilla-release/netwerk/base/public/security-prefs.js: WARNING: no preprocessor directives found
27:33.52   adding: install.rdf (deflated 52%)
27:33.74   adding: plugins/libnptest.so (deflated 64%)
27:33.96   adding: plugins/libnpsecondtest.so (deflated 64%)
27:36.61 /opt/FirefoxSource/mozilla-release/config/rules.mk:1512: warning: overriding recipe for target '../../../dist/bin/modules/LoginManagerParent.jsm'
27:36.61 /opt/FirefoxSource/mozilla-release/config/rules.mk:1447: warning: ignoring old recipe for target '../../../dist/bin/modules/LoginManagerParent.jsm'
27:44.97 /opt/FirefoxSource/mozilla-release/mobile/android/thirdparty/jap/branding/locales/en-US/brand.properties: WARNING: no useful preprocessor directives found
27:45.18 /opt/FirefoxSource/mozilla-release/mobile/locales/en-US/overrides/netError.dtd: WARNING: no preprocessor directives found
27:45.19 /opt/FirefoxSource/mozilla-release/mobile/locales/en-US/overrides/appstrings.properties: WARNING: no useful preprocessor directives found
27:45.19 /opt/FirefoxSource/mozilla-release/mobile/locales/en-US/overrides/passwordmgr.properties: WARNING: no useful preprocessor directives found
27:46.06 make[5]: *** No rule to make target 'mozglue/GeckoLoader.java.in', needed by 'generated/org/mozilla/gecko/mozglue/GeckoLoader.java'.  Schluss.
27:46.06 make[5]: *** Warte auf noch nicht beendete Prozesse...
27:46.11 /opt/FirefoxSource/mozilla-release/mobile/android/base/WebappManifestFragment.xml.frag.in: WARNING: no preprocessor directives found
27:46.17 /opt/FirefoxSource/mozilla-release/config/recurse.mk:82: recipe for target 'mobile/android/base/libs' failed
27:46.17 make[4]: *** [mobile/android/base/libs] Error 2
27:46.17 /opt/FirefoxSource/mozilla-release/config/recurse.mk:36: recipe for target 'libs' failed
27:46.17 make[3]: *** [libs] Error 2
27:46.17 /opt/FirefoxSource/mozilla-release/config/rules.mk:541: recipe for target 'default' failed
27:46.17 make[2]: *** [default] Error 2
27:46.17 /opt/FirefoxSource/mozilla-release/client.mk:398: recipe for target 'realbuild' failed
27:46.17 make[1]: *** [realbuild] Error 2
27:46.17 client.mk:171: recipe for target 'build' failed
27:46.17 make: *** [build] Error 2
27:46.20 383 compiler warnings present.
27:51.63 Notification center failed: Install the python dbus module to get a notification when the build finishes.
Build step 'Shell ausführen' marked build as failure
[PostBuildScript] - Execution post build scripts.
[PostBuildScript] Build is not success : do not execute script
Finished: FAILURE