Console Output

Skipping 540 KB.. Full Log
27:27.30 HTMLTableElement.o
27:27.75 SVGAnimateMotionElement.o
27:28.51 nsXMLElement.o
27:28.54 nsPropertyTable.o
27:30.04 HTMLTableRowElement.o
27:30.10 SVGAnimateTransformElement.o
27:31.11 nsRange.o
27:31.44 nsReferencedElement.o
27:32.50 SVGAnimatedAngle.o
27:33.00 SVGAnimatedBoolean.o
27:34.63 HTMLTableSectionElement.o
27:34.87 HTMLTemplateElement.o
27:34.93 SVGAnimatedEnumeration.o
27:36.77 SVGAnimatedInteger.o
27:38.01 SVGAnimatedLength.o
27:38.17 HTMLTextAreaElement.o
27:38.84 XMLDocument.o
27:38.84 nsScriptElement.o
27:38.84 nsXMLContentSink.o
27:40.16 SVGAnimatedLengthList.o
27:40.87 HTMLTimeElement.o
27:41.10 nsScriptLoader.o
27:42.49 SVGAnimatedNumber.o
27:43.10 nsStubDocumentObserver.o
27:43.72 nsXMLFragmentContentSink.o
27:44.77 SVGAnimatedNumberList.o
27:45.78 HTMLTitleElement.o
27:46.69 SVGAnimatedPathSegList.o
27:46.84 nsStubMutationObserver.o
27:47.01 nsStyleLinkElement.o
27:47.14 nsStyledElement.o
27:48.26 HTMLTrackElement.o
27:48.27 nsXMLPrettyPrinter.o
27:48.66 SVGAnimatedPointList.o
27:50.70 SVGAnimatedPreserveAspectRatio.o
27:50.84 HTMLUnknownElement.o
27:50.86 nsSyncLoadService.o
27:52.68 SVGAnimatedRect.o
27:52.87 HTMLVideoElement.o
27:53.51 nsTextFragment.o
27:55.27 SVGAnimatedString.o
27:55.34 nsTextNode.o
27:55.86 nsTraversal.o
27:56.68 MediaError.o
27:56.90 XULDocument.o
27:56.91 nsXULCommandDispatcher.o
27:57.33 SVGAnimatedTransformList.o
27:58.09 nsTreeSanitizer.o
27:59.13 SVGAnimationElement.o
28:00.03 nsViewportInfo.o
28:00.89 RadioNodeList.o
28:01.17 SVGAttrValueWrapper.o
28:02.78 nsXHTMLContentSerializer.o
28:03.30 nsXMLContentSerializer.o
28:04.21 TextTrackManager.o
28:04.30 SVGCircleElement.o
28:05.57 nsXMLHttpRequest.o
28:05.64 nsXULContentSink.o
28:06.59 SVGClipPathElement.o
28:06.82 TimeRanges.o
28:07.85 nsXULControllers.o
28:08.24 nsXMLNameSpaceMap.o
28:09.42 SVGContentUtils.o
28:11.65 nsXULPrototypeCache.o
28:11.87 SVGDefsElement.o
28:12.33 nsXULPrototypeDocument.o
28:12.46 UndoManager.o
28:15.60 nsXULContextMenuBuilder.o
28:15.60 nsXULElement.o
28:15.82 ValidityState.o
28:16.15 SVGDescElement.o
28:17.53 nsXULPopupListener.o
28:18.42 SVGElementFactory.o
28:19.41 SVGEllipseElement.o
28:19.45 nsDOMStringMap.o
28:20.08 nsFormSubmission.o
28:21.26 SVGFEBlendElement.o
28:22.53 nsGenericHTMLElement.o
28:23.81 nsContentSupportMap.o
28:23.81 nsContentTestNode.o
28:23.91 SVGFEColorMatrixElement.o
28:24.89 nsGenericHTMLFrameElement.o
28:25.28 nsFilteredContentIterator.o
28:25.28 nsTextServicesDocument.o
28:26.02 nsInstantiationNode.o
28:26.56 nsRDFBinding.o
28:26.89 SVGFEComponentTransferElement.o
28:27.62 nsRDFConInstanceTestNode.o
28:28.24 nsRDFConMemberTestNode.o
28:28.90 nsRDFPropertyTestNode.o
28:29.81 nsRDFQuery.o
28:30.03 SVGFECompositeElement.o
28:30.73 nsResourceSet.o
28:31.26 nsRuleNetwork.o
28:31.42 nsTemplateMatch.o
28:31.54 /opt/FirefoxSource/mozilla-release/editor/txtsvc/nsTextServicesDocument.cpp: In member function 'nsresult nsTextServicesDocument::GetUncollapsedSelection(nsITextServicesDocument::TSDBlockSelectionStatus*, int32_t*, int32_t*)':
28:31.55 Warning: -Wmaybe-uninitialized in /opt/FirefoxSource/mozilla-release/editor/txtsvc/nsTextServicesDocument.cpp: 'e2s1' may be used uninitialized in this function
28:31.55 /opt/FirefoxSource/mozilla-release/editor/txtsvc/nsTextServicesDocument.cpp:2826:3: warning: 'e2s1' may be used uninitialized in this function [-Wmaybe-uninitialized]
28:31.55 Warning: -Wmaybe-uninitialized in /opt/FirefoxSource/mozilla-release/editor/txtsvc/nsTextServicesDocument.cpp: 'e1s2' may be used uninitialized in this function
28:31.55 /opt/FirefoxSource/mozilla-release/editor/txtsvc/nsTextServicesDocument.cpp:2826:3: warning: 'e1s2' may be used uninitialized in this function [-Wmaybe-uninitialized]
28:31.56 ChangeAttributeTxn.o
28:31.57 ChangeCSSInlineStyleTxn.o
28:32.04 CreateElementTxn.o
28:32.15 nsTemplateRule.o
28:32.86 DeleteNodeTxn.o
28:32.99 nsTreeRows.o
28:33.16 SVGFEConvolveMatrixElement.o
28:33.38 nsHTMLDNSPrefetch.o
28:34.10 nsXMLBinding.o
28:34.86 DeleteRangeTxn.o
28:35.30 nsXULContentBuilder.o
28:35.90 SVGFEDiffuseLightingElement.o
28:36.87 DeleteTextTxn.o
28:37.08 nsIConstraintValidation.o
28:37.14 nsXULContentUtils.o
28:39.54 SVGFEDisplacementMapElement.o
28:39.61 EditAggregateTxn.o
28:39.69 nsRadioVisitor.o
28:40.56 nsXULSortService.o
28:42.19 nsTextEditorState.o
28:42.27 EditTxn.o
28:42.47 nsXULTemplateBuilder.o
28:42.80 IMETextTxn.o
28:43.06 InsertElementTxn.o
28:43.13 SVGFEDistantLightElement.o
28:43.77 nsXULTemplateQueryProcessorRDF.o
28:45.66 InsertTextTxn.o
28:46.69 SVGFEDropShadowElement.o
28:47.54 JoinElementTxn.o
28:47.95 PlaceholderTxn.o
28:48.44 nsXULTemplateQueryProcessorStorage.o
28:49.80 SetDocTitleTxn.o
28:50.02 SplitElementTxn.o
28:50.05 SVGFEFloodElement.o
28:51.27 nsXULTemplateQueryProcessorXML.o
28:51.80 nsEditor.o
28:52.73 nsInternetCiter.o
28:52.73 nsPlaintextDataTransfer.o
28:53.08 nsXULTemplateResultRDF.o
28:53.16 nsPlaintextEditor.o
28:53.65 SVGFEGaussianBlurElement.o
28:53.69 nsEditorCommands.o
28:55.77 nsTextEditRules.o
28:56.21 nsXULTemplateResultSetRDF.o
28:56.86 nsXULTemplateResultStorage.o
28:57.17 SVGFEImageElement.o
28:57.39 nsXULTemplateResultXML.o
28:57.95 nsXULTreeBuilder.o
28:59.89 nsTextEditRulesBidi.o
29:00.17 nsEditorController.o
29:00.64 SVGFEMergeElement.o
29:02.03 nsEditorEventListener.o
29:02.22 nsEditorUtils.o
29:03.01 SVGFEMergeNodeElement.o
29:03.74 nsTextEditUtils.o
29:04.48 TextEditorTest.o
29:04.48 TypeInState.o
29:04.54 nsEditProperty.o
29:05.65 SVGFEMorphologyElement.o
29:06.47 nsSelectionState.o
29:06.52 nsHTMLAbsPosition.o
29:06.78 nsHTMLAnonymousUtils.o
29:08.29 SVGFEOffsetElement.o
29:08.31 nsTransactionItem.o
29:08.31 nsTransactionList.o
29:09.00 nsTransactionManager.o
29:09.45 nsStyleSheetTxns.o
29:09.60 nsTransactionManagerFactory.o
29:10.34 nsHTMLCSSUtils.o
29:10.48 nsTransactionStack.o
29:11.38 nsComposeTxtSrvFilter.o
29:11.38 nsComposerCommands.o
29:11.79 SVGFEPointLightElement.o
29:12.29 nsComposerCommandsUpdater.o
29:13.10 nsHTMLDataTransfer.o
29:13.74 nsComposerController.o
29:14.45 nsComposerDocumentCommands.o
29:14.49 nsComposerRegistration.o
29:14.89 SVGFESpecularLightingElement.o
29:15.13 nsEditingSession.o
29:15.58 SVGFESpotLightElement.o
29:16.19 nsHTMLEditRules.o
29:16.29 nsEditorSpellCheck.o
29:18.26 nsHTMLEditUtils.o
29:18.95 SVGFETileElement.o
29:21.09 nsCSSRuleProcessor.o
29:21.09 nsFontFaceLoader.o
29:21.25 AnimationCommon.o
29:22.28 SVGFETurbulenceElement.o
29:25.37 nsDocumentViewer.o
29:25.37 nsPresArena.o
29:25.42 /opt/FirefoxSource/mozilla-release/layout/style/nsCSSRuleProcessor.cpp: In member function 'nsRestyleHint nsCSSRuleProcessor::HasStateDependentStyle(ElementDependentRuleProcessorData*, mozilla::dom::Element*, nsCSSPseudoElements::Type, mozilla::EventStates)':
29:25.42 Warning: -Wmaybe-uninitialized in /opt/FirefoxSource/mozilla-release/layout/style/nsCSSRuleProcessor.cpp: 'selectorForPseudo' may be used uninitialized in this function
29:25.42 /opt/FirefoxSource/mozilla-release/layout/style/nsCSSRuleProcessor.cpp:2682:52: warning: 'selectorForPseudo' may be used uninitialized in this function [-Wmaybe-uninitialized]
29:25.42 /opt/FirefoxSource/mozilla-release/layout/style/nsCSSRuleProcessor.cpp:2643:22: note: 'selectorForPseudo' was declared here
29:25.43 CSS.o
29:25.69 SVGFilterElement.o
29:26.96 nsHTMLEditor.o
29:28.97 nsHTMLEditorEventListener.o
29:29.16 SVGForeignObjectElement.o
29:30.01 CSSRuleList.o
29:32.10 SVGFragmentIdentifier.o
29:32.44 CSSStyleSheet.o
29:32.98 CSSVariableDeclarations.o
29:33.89 nsPresShell.o
29:34.40 nsRefreshDriver.o
29:36.10 SVGGElement.o
29:36.60 nsHTMLEditorStyle.o
29:37.74 /opt/FirefoxSource/mozilla-release/layout/style/CSSStyleSheet.cpp: In member function 'bool nsMediaExpression::Matches(nsPresContext*, const nsCSSValue&) const':
29:37.74 Warning: -Wmaybe-uninitialized in /opt/FirefoxSource/mozilla-release/layout/style/CSSStyleSheet.cpp: 'cmp' may be used uninitialized in this function
29:37.74 /opt/FirefoxSource/mozilla-release/layout/style/CSSStyleSheet.cpp:277:21: warning: 'cmp' may be used uninitialized in this function [-Wmaybe-uninitialized]
29:37.74 CSSVariableResolver.o
29:38.54 nsHTMLInlineTableEditor.o
29:38.59 SVGGradientElement.o
29:38.87 CSSVariableValues.o
29:39.57 CounterStyleManager.o
29:40.10 Declaration.o
29:40.87 SVGGraphicsElement.o
29:42.72 nsHTMLObjectResizer.o
29:43.41 ErrorReporter.o
29:43.68 SVGIFrameElement.o
29:44.79 nsHTMLURIRefObject.o
29:45.11 ImageLoader.o
29:46.00 SVGImageElement.o
29:47.07 Loader.o
29:47.43 nsTableEditor.o
29:47.94 nsWSRunObject.o
29:49.21 ActiveLayerTracker.o
29:49.31 SVGIntegerPairSMILType.o
29:50.77 MediaQueryList.o
29:52.40 SVGLength.o
29:52.54 SVGLengthList.o
29:54.42 DisplayItemClip.o
29:54.91 SVGLengthListSMILType.o
29:55.79 StyleAnimationValue.o
29:57.20 SVGLineElement.o
29:57.63 StyleRule.o
29:57.74 DisplayListClipState.o
29:58.14 nsLineLayout.o
29:58.14 nsObjectFrame.o
29:59.23 SVGMPathElement.o
30:00.23 FrameLayerBuilder.o
30:01.68 /opt/FirefoxSource/mozilla-release/layout/style/StyleAnimationValue.cpp: In function 'void ExtractBorderColor(nsStyleContext*, const void*, mozilla::css::Side, mozilla::StyleAnimationValue&)':
30:01.68 Warning: -Wmaybe-uninitialized in /opt/FirefoxSource/mozilla-release/layout/style/StyleAnimationValue.cpp: 'color' may be used uninitialized in this function
30:01.68 /opt/FirefoxSource/mozilla-release/layout/style/StyleAnimationValue.cpp:3702:25: warning: 'color' may be used uninitialized in this function [-Wmaybe-uninitialized]
30:01.68 /opt/FirefoxSource/mozilla-release/layout/style/StyleAnimationValue.cpp:2726:11: note: 'color' was declared here
30:01.68 /opt/FirefoxSource/mozilla-release/layout/style/StyleAnimationValue.cpp: In static member function 'static bool mozilla::StyleAnimationValue::ExtractComputedValue(nsCSSProperty, nsStyleContext*, mozilla::StyleAnimationValue&)':
30:01.68 Warning: -Wmaybe-uninitialized in /opt/FirefoxSource/mozilla-release/layout/style/StyleAnimationValue.cpp: 'color' may be used uninitialized in this function
30:01.68 /opt/FirefoxSource/mozilla-release/layout/style/StyleAnimationValue.cpp:3702:25: warning: 'color' may be used uninitialized in this function [-Wmaybe-uninitialized]
30:01.68 /opt/FirefoxSource/mozilla-release/layout/style/StyleAnimationValue.cpp:2959:19: note: 'color' was declared here
30:01.71 nsAnimationManager.o
30:01.94 SVGMarkerElement.o
30:02.90 FrameChildList.o
30:03.28 FramePropertyTable.o
30:04.61 nsCSSAnonBoxes.o
30:04.78 SVGMaskElement.o
30:07.64 SVGMatrix.o
30:08.50 MathMLTextRunFactory.o
30:09.25 nsCSSDataBlock.o
30:09.51 nsCSSKeywords.o
30:09.82 GeometryUtils.o
30:10.32 MaskLayerImageCache.o
30:10.37 SVGMetadataElement.o
30:10.55 ScrollbarActivity.o
30:12.08 nsCSSParser.o
30:12.33 nsCSSProps.o
30:12.44 SVGMotionSMILAnimationFunction.o
30:13.02 /opt/FirefoxSource/mozilla-release/layout/generic/MathMLTextRunFactory.cpp: In member function 'virtual void MathMLTextRunFactory::RebuildTextRun(nsTransformedTextRun*, gfxContext*)':
30:13.03 Warning: -Wmaybe-uninitialized in /opt/FirefoxSource/mozilla-release/layout/generic/MathMLTextRunFactory.cpp: 'mathVar' may be used uninitialized in this function
30:13.03 /opt/FirefoxSource/mozilla-release/layout/generic/MathMLTextRunFactory.cpp:692:10: warning: 'mathVar' may be used uninitialized in this function [-Wmaybe-uninitialized]
30:13.03 /opt/FirefoxSource/mozilla-release/layout/generic/MathMLTextRunFactory.cpp:590:11: note: 'mathVar' was declared here
30:13.03 StickyScrollContainer.o
30:14.39 PaintTracker.o
30:14.71 SVGMotionSMILAttr.o
30:15.75 TextOverflow.o
30:15.91 PositionedEventTargeting.o
30:16.02 RestyleManager.o
30:17.54 SVGMotionSMILPathUtils.o
30:19.05 nsAbsoluteContainingBlock.o
30:19.87 SVGMotionSMILType.o
30:19.91 RestyleTracker.o
30:21.15 SVGNumberList.o
30:21.43 /opt/FirefoxSource/mozilla-release/layout/style/nsCSSParser.cpp: In member function 'bool {anonymous}::CSSParserImpl::ParseGridLine(nsCSSValue&)':
30:21.43 Warning: -Wmaybe-uninitialized in /opt/FirefoxSource/mozilla-release/layout/style/nsCSSParser.cpp: 'integer' may be used uninitialized in this function
30:21.43 /opt/FirefoxSource/mozilla-release/layout/style/nsCSSParser.cpp:8583:56: warning: 'integer' may be used uninitialized in this function [-Wmaybe-uninitialized]
30:21.43 /opt/FirefoxSource/mozilla-release/layout/style/nsCSSParser.cpp:8525:11: note: 'integer' was declared here
30:21.43 nsCSSPseudoClasses.o
30:22.36 SVGNumberListSMILType.o
30:23.43 nsBRFrame.o
30:24.00 nsCSSPseudoElements.o
30:24.33 nsCSSRules.o
30:24.60 nsCSSScanner.o
30:24.66 SVGNumberPairSMILType.o
30:25.85 /opt/FirefoxSource/mozilla-release/layout/base/RestyleManager.cpp: In member function 'void mozilla::ElementRestyler::RestyleChildren(nsRestyleHint)':
30:25.85 Warning: -Wmaybe-uninitialized in /opt/FirefoxSource/mozilla-release/layout/base/RestyleManager.cpp: 'lastContinuation' may be used uninitialized in this function
30:25.85 /opt/FirefoxSource/mozilla-release/layout/base/RestyleManager.cpp:2622:41: warning: 'lastContinuation' may be used uninitialized in this function [-Wmaybe-uninitialized]
30:25.85 /opt/FirefoxSource/mozilla-release/layout/base/RestyleManager.cpp:2605:13: note: 'lastContinuation' was declared here
30:25.86 SelectionCarets.o
30:26.50 nsBlockFrame.o
30:26.72 SVGOrientSMILType.o
30:26.86 SVGPathData.o
30:28.79 StackArena.o
30:29.06 nsCSSValue.o
30:29.08 SVGPathElement.o
30:29.46 nsBlockReflowContext.o
30:29.77 nsComputedDOMStyle.o
30:32.51 SVGPathSegListSMILType.o
30:33.15 nsDOMCSSAttrDeclaration.o
30:33.51 TouchCaret.o
30:33.67 nsBidi.o
30:36.43 /opt/FirefoxSource/mozilla-release/layout/generic/nsBlockFrame.cpp: In member function 'void nsBlockFrame::AddFrames(nsFrameList&, nsIFrame*)':
30:36.43 Warning: -Wmaybe-uninitialized in /opt/FirefoxSource/mozilla-release/layout/generic/nsBlockFrame.cpp: 'overflowLines' may be used uninitialized in this function
30:36.43 /opt/FirefoxSource/mozilla-release/layout/generic/nsBlockFrame.cpp:4959:72: warning: 'overflowLines' may be used uninitialized in this function [-Wmaybe-uninitialized]
30:36.43 nsBlockReflowState.o
30:36.62 SVGPathSegUtils.o
30:38.21 nsBidiPresUtils.o
30:38.73 nsCSSColorUtils.o
30:38.74 SVGPatternElement.o
30:39.36 nsBulletFrame.o
30:39.41 /opt/FirefoxSource/mozilla-release/layout/style/nsComputedDOMStyle.cpp: In member function 'mozilla::dom::CSSValue* nsComputedDOMStyle::DoGetOutlineWidth()':
30:39.41 Warning: -Wmaybe-uninitialized in /opt/FirefoxSource/mozilla-release/layout/style/nsComputedDOMStyle.cpp: 'width' may be used uninitialized in this function
30:39.41 /opt/FirefoxSource/mozilla-release/layout/style/nsComputedDOMStyle.cpp:2696:26: warning: 'width' may be used uninitialized in this function [-Wmaybe-uninitialized]
30:39.41 /opt/FirefoxSource/mozilla-release/layout/style/nsComputedDOMStyle.cpp: In member function 'mozilla::dom::CSSValue* nsComputedDOMStyle::DoGetTextDecorationColor()':
30:39.41 Warning: -Wmaybe-uninitialized in /opt/FirefoxSource/mozilla-release/layout/style/nsComputedDOMStyle.cpp: 'color' may be used uninitialized in this function
30:39.41 /opt/FirefoxSource/mozilla-release/layout/style/nsComputedDOMStyle.cpp:3121:29: warning: 'color' may be used uninitialized in this function [-Wmaybe-uninitialized]
30:39.41 /opt/FirefoxSource/mozilla-release/layout/style/nsComputedDOMStyle.cpp: In member function 'mozilla::dom::CSSValue* nsComputedDOMStyle::GetBorderColorFor(mozilla::css::Side)':
30:39.41 Warning: -Wmaybe-uninitialized in /opt/FirefoxSource/mozilla-release/layout/style/nsComputedDOMStyle.cpp: 'color' may be used uninitialized in this function
30:39.41 /opt/FirefoxSource/mozilla-release/layout/style/nsComputedDOMStyle.cpp:4426:29: warning: 'color' may be used uninitialized in this function [-Wmaybe-uninitialized]
30:39.42 nsDOMCSSDeclaration.o
30:40.09 SVGPointList.o
30:42.41 nsDOMCSSRGBColor.o
30:42.53 nsCanvasFrame.o
30:43.28 SVGPointListSMILType.o
30:43.82 nsCSSFrameConstructor.o
30:43.98 nsCSSRendering.o
30:45.13 nsDOMCSSRect.o
30:45.66 SVGPolygonElement.o
30:45.84 nsDOMCSSValueList.o
30:46.47 nsHTMLCSSStyleSheet.o
30:47.00 nsColumnSetFrame.o
30:47.14 nsHTMLStyleSheet.o
30:47.68 SVGPolylineElement.o
30:49.34 nsLayoutStylesheetCache.o
30:50.37 SVGPreserveAspectRatio.o
30:51.57 nsContainerFrame.o
30:52.44 nsMediaFeatures.o
30:52.68 SVGRect.o
30:53.65 nsCSSRenderingBorders.o
30:54.52 SVGRectElement.o
30:54.73 nsNthIndexCache.o
30:55.15 nsFirstLetterFrame.o
30:56.43 SVGSVGElement.o
30:56.88 nsROCSSPrimitiveValue.o
30:58.69 nsRuleData.o
30:59.13 SVGScriptElement.o
30:59.52 nsFlexContainerFrame.o
31:00.09 /opt/FirefoxSource/mozilla-release/layout/base/nsCSSRendering.cpp: In function 'bool _ZL14IsOpaqueBorderRK13nsStyleBorder.part.39(const nsStyleBorder&)':
31:00.09 Warning: -Wmaybe-uninitialized in /opt/FirefoxSource/mozilla-release/layout/base/nsCSSRendering.cpp: 'color' may be used uninitialized in this function
31:00.10 /opt/FirefoxSource/mozilla-release/layout/base/nsCSSRendering.cpp:1667:50: warning: 'color' may be used uninitialized in this function [-Wmaybe-uninitialized]
31:00.10 /opt/FirefoxSource/mozilla-release/layout/base/nsCSSRendering.cpp:1658:11: note: 'color' was declared here
31:00.10 /opt/FirefoxSource/mozilla-release/layout/base/nsCSSRendering.cpp: In static member function 'static void nsCSSRendering::PaintOutline(nsPresContext*, nsRenderingContext&, nsIFrame*, const nsRect&, const nsRect&, nsStyleContext*)':
31:00.10 Warning: -Wmaybe-uninitialized in /opt/FirefoxSource/mozilla-release/layout/base/nsCSSRendering.cpp: 'width' may be used uninitialized in this function
31:00.10 /opt/FirefoxSource/mozilla-release/layout/base/nsCSSRendering.cpp:852:65: warning: 'width' may be used uninitialized in this function [-Wmaybe-uninitialized]
31:00.10 /opt/FirefoxSource/mozilla-release/layout/base/nsCSSRendering.cpp: In static member function 'static void nsCSSRendering::PaintGradient(nsPresContext*, nsRenderingContext&, nsStyleGradient*, const nsRect&, const nsRect&, const nsRect&, const CSSIntRect&, const nsSize&)':
31:00.10 Warning: -Wmaybe-uninitialized in /opt/FirefoxSource/mozilla-release/layout/base/nsCSSRendering.cpp: 'position' may be used uninitialized in this function
31:00.10 /opt/FirefoxSource/mozilla-release/layout/base/nsCSSRendering.cpp:353:40: warning: 'position' may be used uninitialized in this function [-Wmaybe-uninitialized]
31:00.10 /opt/FirefoxSource/mozilla-release/layout/base/nsCSSRendering.cpp:2287:12: note: 'position' was declared here
31:00.10 /opt/FirefoxSource/mozilla-release/layout/base/nsCSSRendering.cpp: In static member function 'static void nsCSSRendering::PaintBackgroundWithSC(nsPresContext*, nsRenderingContext&, nsIFrame*, const nsRect&, const nsRect&, nsStyleContext*, const nsStyleBorder&, uint32_t, nsRect*, int32_t)':
31:00.10 Warning: -Wmaybe-uninitialized in /opt/FirefoxSource/mozilla-release/layout/base/nsCSSRendering.cpp: 'isSolidBorder' may be used uninitialized in this function
31:00.10 /opt/FirefoxSource/mozilla-release/layout/base/nsCSSRendering.cpp:2805:9: warning: 'isSolidBorder' may be used uninitialized in this function [-Wmaybe-uninitialized]
31:00.10 /opt/FirefoxSource/mozilla-release/layout/base/nsCSSRendering.cpp:2718:8: note: 'isSolidBorder' was declared here
31:00.10 Warning: -Wmaybe-uninitialized in /opt/FirefoxSource/mozilla-release/layout/base/nsCSSRendering.cpp: 'currentBackgroundClip' may be used uninitialized in this function
31:00.10 /opt/FirefoxSource/mozilla-release/layout/base/nsCSSRendering.cpp:2809:9: warning: 'currentBackgroundClip' may be used uninitialized in this function [-Wmaybe-uninitialized]
31:00.10 /opt/FirefoxSource/mozilla-release/layout/base/nsCSSRendering.cpp:2717:11: note: 'currentBackgroundClip' was declared here
31:00.10 nsCaret.o
31:00.22 nsRuleNode.o
31:01.08 nsStyleContext.o
31:02.64 nsFloatManager.o
31:02.90 nsCounterManager.o
31:03.76 SVGSetElement.o
31:06.38 SVGStopElement.o
31:06.63 /opt/FirefoxSource/mozilla-release/layout/generic/nsFlexContainerFrame.cpp: In member function 'void nsFlexContainerFrame::DoFlexLayout(nsPresContext*, nsHTMLReflowMetrics&, const nsHTMLReflowState&, nsReflowStatus&, nscoord, nscoord, nsTArray<nsFlexContainerFrame::StrutInfo>&, const nsFlexContainerFrame::FlexboxAxisTracker&)':
31:06.63 Warning: -Wmaybe-uninitialized in /opt/FirefoxSource/mozilla-release/layout/generic/nsFlexContainerFrame.cpp: 'flexContainerAscent' may be used uninitialized in this function
31:06.63 /opt/FirefoxSource/mozilla-release/layout/generic/nsFlexContainerFrame.cpp:3392:3: warning: 'flexContainerAscent' may be used uninitialized in this function [-Wmaybe-uninitialized]
31:06.63 /opt/FirefoxSource/mozilla-release/layout/generic/nsFlexContainerFrame.cpp:3214:11: note: 'flexContainerAscent' was declared here
31:06.64 nsFontInflationData.o
31:07.22 nsDisplayList.o
31:08.73 SVGStringList.o
31:09.10 nsFrame.o
31:09.99 /opt/FirefoxSource/mozilla-release/layout/style/nsRuleNode.cpp: In static member function 'static nscoord nsRuleNode::CalcFontPointSize(int32_t, int32_t, nsPresContext*, nsFontSizeType)':
31:09.99 Warning: -Wmaybe-uninitialized in /opt/FirefoxSource/mozilla-release/layout/style/nsRuleNode.cpp: 'column' may be used uninitialized in this function
31:09.99 /opt/FirefoxSource/mozilla-release/layout/style/nsRuleNode.cpp:2884:55: warning: 'column' may be used uninitialized in this function [-Wmaybe-uninitialized]
31:10.00 /opt/FirefoxSource/mozilla-release/layout/style/nsRuleNode.cpp:2862:12: note: 'column' was declared here
31:10.00 /opt/FirefoxSource/mozilla-release/layout/style/nsRuleNode.cpp: In static member function 'static bool nsRuleNode::HasAuthorSpecifiedRules(nsStyleContext*, uint32_t, bool)':
31:10.00 Warning: -Wmaybe-uninitialized in /opt/FirefoxSource/mozilla-release/layout/style/nsRuleNode.cpp: 'textShadowOffset' may be used uninitialized in this function
31:10.00 /opt/FirefoxSource/mozilla-release/layout/style/nsRuleNode.cpp:9096:65: warning: 'textShadowOffset' may be used uninitialized in this function [-Wmaybe-uninitialized]
31:10.00 Warning: -Wmaybe-uninitialized in /opt/FirefoxSource/mozilla-release/layout/style/nsRuleNode.cpp: 'paddingOffset' may be used uninitialized in this function
31:10.00 /opt/FirefoxSource/mozilla-release/layout/style/nsRuleNode.cpp:9092:65: warning: 'paddingOffset' may be used uninitialized in this function [-Wmaybe-uninitialized]
31:10.00 Warning: -Wmaybe-uninitialized in /opt/FirefoxSource/mozilla-release/layout/style/nsRuleNode.cpp: 'borderOffset' may be used uninitialized in this function
31:10.00 /opt/FirefoxSource/mozilla-release/layout/style/nsRuleNode.cpp:9088:63: warning: 'borderOffset' may be used uninitialized in this function [-Wmaybe-uninitialized]
31:10.00 nsStyleCoord.o
31:10.27 In file included from ../../dist/include/nsAString.h:23:0,
31:10.27                  from ../../dist/include/nsSubstring.h:10,
31:10.27                  from ../../dist/include/nsString.h:12,
31:10.27                  from ../../dist/include/nsStringGlue.h:18,
31:10.27                  from ../../dist/include/nsHashKeys.h:18,
31:10.27                  from /opt/FirefoxSource/mozilla-release/layout/base/nsIPresShell.h:28,
31:10.27                  from /opt/FirefoxSource/mozilla-release/layout/base/nsPresContext.h:16,
31:10.27                  from /opt/FirefoxSource/mozilla-release/layout/base/../style/nsRuleNode.h:14,
31:10.27                  from /opt/FirefoxSource/mozilla-release/layout/base/../style/nsStyleContext.h:11,
31:10.27                  from /opt/FirefoxSource/mozilla-release/layout/base/../generic/nsIFrame.h:25,
31:10.27                  from /opt/FirefoxSource/mozilla-release/layout/base/nsGenConList.h:11,
31:10.27                  from /opt/FirefoxSource/mozilla-release/layout/base/nsCounterManager.h:13,
31:10.27                  from /opt/FirefoxSource/mozilla-release/layout/base/nsCounterManager.cpp:9:
31:10.27 ../../dist/include/nsTSubstring.h: In member function 'void nsCounterUseNode::GetText(nsString&)':
31:10.27 Warning: -Wmaybe-uninitialized in /opt/FirefoxSource/mozilla-release/objdir-droid/dist/include/nsTSubstring.h: 'separator' may be used uninitialized in this function
31:10.27 ../../dist/include/nsTSubstring.h:526:40: warning: 'separator' may be used uninitialized in this function [-Wmaybe-uninitialized]
31:10.27 /opt/FirefoxSource/mozilla-release/layout/base/nsCounterManager.cpp:94:21: note: 'separator' was declared here
31:10.27 nsDisplayListInvalidation.o
31:11.02 SVGStyleElement.o
31:12.31 SVGSwitchElement.o
31:12.35 nsFrameList.o
31:12.80 /opt/FirefoxSource/mozilla-release/layout/style/nsStyleContext.cpp: In member function 'nsChangeHint nsStyleContext::CalcStyleDifference(nsStyleContext*, nsChangeHint)':
31:12.80 Warning: -Wmaybe-uninitialized in /opt/FirefoxSource/mozilla-release/layout/style/nsStyleContext.cpp: 'otherVisDecColor' may be used uninitialized in this function
31:12.80 /opt/FirefoxSource/mozilla-release/layout/style/nsStyleContext.cpp:610:7: warning: 'otherVisDecColor' may be used uninitialized in this function [-Wmaybe-uninitialized]
31:12.80 /opt/FirefoxSource/mozilla-release/layout/style/nsStyleContext.cpp:604:32: note: 'otherVisDecColor' was declared here
31:12.80 Warning: -Wmaybe-uninitialized in /opt/FirefoxSource/mozilla-release/layout/style/nsStyleContext.cpp: 'thisVisDecColor' may be used uninitialized in this function
31:12.80 /opt/FirefoxSource/mozilla-release/layout/style/nsStyleContext.cpp:610:7: warning: 'thisVisDecColor' may be used uninitialized in this function [-Wmaybe-uninitialized]
31:12.80 /opt/FirefoxSource/mozilla-release/layout/style/nsStyleContext.cpp:604:15: note: 'thisVisDecColor' was declared here
31:12.80 Warning: -Wmaybe-uninitialized in /opt/FirefoxSource/mozilla-release/layout/style/nsStyleContext.cpp: 'otherColor' may be used uninitialized in this function
31:12.80 /opt/FirefoxSource/mozilla-release/layout/style/nsStyleContext.cpp:580:7: warning: 'otherColor' may be used uninitialized in this function [-Wmaybe-uninitialized]
31:12.80 /opt/FirefoxSource/mozilla-release/layout/style/nsStyleContext.cpp:579:26: note: 'otherColor' was declared here
31:12.80 Warning: -Wmaybe-uninitialized in /opt/FirefoxSource/mozilla-release/layout/style/nsStyleContext.cpp: 'otherColor' may be used uninitialized in this function
31:12.80 /opt/FirefoxSource/mozilla-release/layout/style/nsStyleContext.cpp:567:9: warning: 'otherColor' may be used uninitialized in this function [-Wmaybe-uninitialized]
31:12.80 /opt/FirefoxSource/mozilla-release/layout/style/nsStyleContext.cpp:564:28: note: 'otherColor' was declared here
31:12.80 Warning: -Wmaybe-uninitialized in /opt/FirefoxSource/mozilla-release/layout/style/nsStyleContext.cpp: 'thisColor' may be used uninitialized in this function
31:12.80 /opt/FirefoxSource/mozilla-release/layout/style/nsStyleContext.cpp:567:9: warning: 'thisColor' may be used uninitialized in this function [-Wmaybe-uninitialized]
31:12.80 /opt/FirefoxSource/mozilla-release/layout/style/nsStyleContext.cpp:564:17: note: 'thisColor' was declared here
31:12.80 nsStyleSet.o
31:13.57 nsStyleStruct.o
31:14.70 SVGSymbolElement.o
31:18.28 SVGTSpanElement.o
31:18.34 nsStyleTransformMatrix.o
31:20.65 SVGTests.o
31:21.49 /opt/FirefoxSource/mozilla-release/layout/base/nsDisplayList.cpp: In static member function 'static bool nsDisplayBackgroundImage::AppendBackgroundItemsToTop(nsDisplayListBuilder*, nsIFrame*, nsDisplayList*)':
31:21.49 Warning: -Wmaybe-uninitialized in /opt/FirefoxSource/mozilla-release/layout/base/nsDisplayList.cpp: 'color' may be used uninitialized in this function
31:21.49 /opt/FirefoxSource/mozilla-release/layout/base/nsDisplayList.cpp:1880:3: warning: 'color' may be used uninitialized in this function [-Wmaybe-uninitialized]
31:21.50 nsFrameManager.o
31:22.07 /opt/FirefoxSource/mozilla-release/layout/generic/nsFrame.cpp: In static member function 'static int32_t nsFrame::GetLineNumber(nsIFrame*, bool, nsIFrame**)':
31:22.07 Warning: -Wmaybe-uninitialized in /opt/FirefoxSource/mozilla-release/layout/generic/nsFrame.cpp: 'thisBlock' may be used uninitialized in this function
31:22.07 /opt/FirefoxSource/mozilla-release/layout/generic/nsFrame.cpp:6747:42: warning: 'thisBlock' may be used uninitialized in this function [-Wmaybe-uninitialized]
31:22.07 /opt/FirefoxSource/mozilla-release/layout/generic/nsFrame.cpp: In member function 'nsresult nsIFrame::PeekOffsetParagraph(nsPeekOffsetStruct*)':
31:22.07 Warning: -Wmaybe-uninitialized in /opt/FirefoxSource/mozilla-release/layout/generic/nsFrame.cpp: 'blockFrameOrBR.nsContentAndOffset::mOffset' may be used uninitialized in this function
31:22.07 /opt/FirefoxSource/mozilla-release/layout/generic/nsFrame.cpp:6225:54: warning: 'blockFrameOrBR.nsContentAndOffset::mOffset' may be used uninitialized in this function [-Wmaybe-uninitialized]
31:22.07 /opt/FirefoxSource/mozilla-release/layout/generic/nsFrame.cpp: In member function 'bool nsIFrame::FinishAndStoreOverflow(nsOverflowAreas&, nsSize, nsSize*)':
31:22.07 Warning: -Wmaybe-uninitialized in /opt/FirefoxSource/mozilla-release/layout/generic/nsFrame.cpp: 'width' may be used uninitialized in this function
31:22.07 /opt/FirefoxSource/mozilla-release/layout/generic/nsFrame.cpp:7189:37: warning: 'width' may be used uninitialized in this function [-Wmaybe-uninitialized]
31:22.07 /opt/FirefoxSource/mozilla-release/layout/generic/nsFrame.cpp:7110:11: note: 'width' was declared here
31:22.08 nsFrameSetFrame.o
31:22.97 /opt/FirefoxSource/mozilla-release/layout/style/nsStyleStruct.cpp: In member function 'nsChangeHint nsStyleTextReset::CalcDifference(const nsStyleTextReset&) const':
31:22.97 Warning: -Wmaybe-uninitialized in /opt/FirefoxSource/mozilla-release/layout/style/nsStyleStruct.cpp: 'otherDecColor' may be used uninitialized in this function
31:22.97 /opt/FirefoxSource/mozilla-release/layout/style/nsStyleStruct.cpp:3037:5: warning: 'otherDecColor' may be used uninitialized in this function [-Wmaybe-uninitialized]
31:22.97 Warning: -Wmaybe-uninitialized in /opt/FirefoxSource/mozilla-release/layout/style/nsStyleStruct.cpp: 'decColor' may be used uninitialized in this function
31:22.97 /opt/FirefoxSource/mozilla-release/layout/style/nsStyleStruct.cpp:3037:5: warning: 'decColor' may be used uninitialized in this function [-Wmaybe-uninitialized]
31:22.97 nsStyleUtil.o
31:23.46 SVGTextContentElement.o
31:24.30 nsFrameState.o
31:24.46 nsFrameTraversal.o
31:24.56 nsTransitionManager.o
31:25.62 SVGTextElement.o
31:27.46 nsGenConList.o
31:28.87 SVGTextPathElement.o
31:29.61 nsFrameUtil.o
31:29.91 nsLayoutDebugger.o
31:31.13 nsGfxScrollFrame.o
31:31.59 SVGTextPositioningElement.o
31:32.61 nsLayoutHistoryState.o
31:33.26 SVGTitleElement.o
31:33.32 nsGridContainerFrame.o
31:34.26 nsLayoutUtils.o
31:34.76 nsPresContext.o
31:35.93 SVGTransform.o
31:35.96 nsHTMLCanvasFrame.o
31:38.15 nsHTMLReflowMetrics.o
31:38.25 SVGTransformList.o
31:40.39 SVGTransformListParser.o
31:41.26 SVGTransformListSMILType.o
31:41.44 SVGTransformableElement.o
31:42.02 nsHTMLReflowState.o
31:42.15 SVGUseElement.o
31:42.68 nsQuoteList.o
31:44.49 nsImageFrame.o
31:47.20 /opt/FirefoxSource/mozilla-release/layout/base/nsLayoutUtils.cpp: In static member function 'static nscoord nsLayoutUtils::ComputeWidthValue(nsRenderingContext*, nsIFrame*, nscoord, nscoord, nscoord, const nsStyleCoord&)':
31:47.20 Warning: -Wmaybe-uninitialized in /opt/FirefoxSource/mozilla-release/layout/base/nsLayoutUtils.cpp: 'result' may be used uninitialized in this function
31:47.20 /opt/FirefoxSource/mozilla-release/layout/base/nsLayoutUtils.cpp:3971:11: warning: 'result' may be used uninitialized in this function [-Wmaybe-uninitialized]
31:47.23 nsImageMap.o
31:47.44 SVGViewBoxSMILType.o
31:50.74 /opt/FirefoxSource/mozilla-release/layout/generic/nsHTMLReflowState.cpp: In member function 'void nsHTMLReflowState::InitConstraints(nsPresContext*, nscoord, nscoord, const nsMargin*, const nsMargin*, nsIAtom*)':
31:50.74 Warning: -Wmaybe-uninitialized in /opt/FirefoxSource/mozilla-release/layout/generic/nsHTMLReflowState.cpp: 'fType' may be used uninitialized in this function
31:50.74 /opt/FirefoxSource/mozilla-release/layout/generic/nsHTMLReflowState.cpp:1992:37: warning: 'fType' may be used uninitialized in this function [-Wmaybe-uninitialized]
31:50.81 nsButtonFrameRenderer.o
31:50.82 nsColorControlFrame.o
31:51.63 SVGViewElement.o
31:54.22 SVGZoomEvent.o
31:54.43 nsStyleChangeList.o
31:55.49 nsInlineFrame.o
31:56.02 nsComboboxControlFrame.o
31:57.74 nsStyleSheetService.o
31:57.75 nsISVGPoint.o
31:59.97 nsIntervalSet.o
32:00.43 nsFieldSetFrame.o
32:01.85 nsSVGAngle.o
32:03.90 nsSVGAnimatedTransformList.o
32:04.52 /opt/FirefoxSource/mozilla-release/layout/base/nsStyleSheetService.cpp: In member function 'virtual nsresult nsStyleSheetService::UnregisterSheet(nsIURI*, uint32_t)':
32:04.52 Warning: -Wmaybe-uninitialized in /opt/FirefoxSource/mozilla-release/layout/base/nsStyleSheetService.cpp: 'message' may be used uninitialized in this function
32:04.52 /opt/FirefoxSource/mozilla-release/layout/base/nsStyleSheetService.cpp:266:51: warning: 'message' may be used uninitialized in this function [-Wmaybe-uninitialized]
32:04.53 nsFileControlFrame.o
32:04.81 nsLeafFrame.o
32:05.23 nsLineBox.o
32:07.24 nsSVGBoolean.o
32:07.47 BasicTableLayoutStrategy.o
32:07.49 FixedTableLayoutStrategy.o
32:08.98 nsFormControlFrame.o
32:09.63 nsPageContentFrame.o
32:10.55 nsSVGClass.o
32:12.05 SpanningCellSorter.o
32:12.83 /opt/FirefoxSource/mozilla-release/content/svg/content/src/nsSVGBoolean.cpp: In member function 'nsresult nsSVGBoolean::SetBaseValueAtom(const nsIAtom*, nsSVGElement*)':
32:12.83 Warning: -Wmaybe-uninitialized in /opt/FirefoxSource/mozilla-release/content/svg/content/src/nsSVGBoolean.cpp: 'val' may be used uninitialized in this function
32:12.83 /opt/FirefoxSource/mozilla-release/content/svg/content/src/nsSVGBoolean.cpp:68:24: warning: 'val' may be used uninitialized in this function [-Wmaybe-uninitialized]
32:12.83 nsSVGDataParser.o
32:12.92 nsPageFrame.o
32:13.77 nsGfxButtonControlFrame.o
32:14.79 nsSVGElement.o
32:15.40 nsCellMap.o
32:15.80 nsPlaceholderFrame.o
32:15.95 nsSVGEnum.o
32:16.10 nsTableCellFrame.o
32:17.00 nsGfxCheckboxControlFrame.o
32:19.61 nsSelection.o
32:20.25 nsGfxRadioControlFrame.o
32:20.52 nsTableColFrame.o
32:21.48 nsSVGFeatures.o
32:23.04 nsSimplePageSequenceFrame.o
32:23.43 nsSVGFilters.o
32:23.79 nsHTMLButtonControlFrame.o
32:24.83 nsSVGInteger.o
32:25.09 nsTableColGroupFrame.o
32:27.21 nsImageControlFrame.o
32:28.20 nsTableFrame.o
32:29.09 nsSVGIntegerPair.o
32:30.82 nsLegendFrame.o
32:31.35 nsSVGLength2.o
32:31.38 nsSplittableFrame.o
32:31.54 nsTableOuterFrame.o
32:33.74 nsSVGNumber2.o
32:34.35 nsListControlFrame.o
32:36.05 nsSubDocumentFrame.o
32:37.16 nsSVGNumberPair.o
32:37.98 nsMeterFrame.o
32:38.72 nsTextFrame.o
32:39.02 /opt/FirefoxSource/mozilla-release/layout/tables/nsTableFrame.cpp: In member function 'void nsTableFrame::HomogenousInsertFrames(nsIFrame::ChildListID, nsIFrame*, nsFrameList&)':
32:39.02 Warning: -Wmaybe-uninitialized in /opt/FirefoxSource/mozilla-release/layout/tables/nsTableFrame.cpp: 'content' may be used uninitialized in this function
32:39.02 /opt/FirefoxSource/mozilla-release/layout/tables/nsTableFrame.cpp:2343:59: warning: 'content' may be used uninitialized in this function [-Wmaybe-uninitialized]
32:39.02 /opt/FirefoxSource/mozilla-release/layout/tables/nsTableFrame.cpp:2337:19: note: 'content' was declared here
32:39.04 nsTablePainter.o
32:39.53 nsSVGPathDataParser.o
32:41.86 nsSVGPathGeometryElement.o
32:43.11 /opt/FirefoxSource/mozilla-release/layout/tables/nsTableOuterFrame.cpp: In member function 'virtual void nsTableOuterFrame::Reflow(nsPresContext*, nsHTMLReflowMetrics&, const nsHTMLReflowState&, nsReflowStatus&)':
32:43.11 Warning: -Wmaybe-uninitialized in /opt/FirefoxSource/mozilla-release/layout/tables/nsTableOuterFrame.cpp: 'captionFirstReflow' may be used uninitialized in this function
32:43.11 /opt/FirefoxSource/mozilla-release/layout/tables/nsTableOuterFrame.cpp:1036:59: warning: 'captionFirstReflow' may be used uninitialized in this function [-Wmaybe-uninitialized]
32:43.11 /opt/FirefoxSource/mozilla-release/layout/tables/nsTableOuterFrame.cpp:903:8: note: 'captionFirstReflow' was declared here
32:43.11 nsTableRowFrame.o
32:43.82 nsTextFrameUtils.o
32:44.43 nsSVGPolyElement.o
32:45.11 nsNumberControlFrame.o
32:46.50 nsTableRowGroupFrame.o
32:47.52 nsSVGString.o
32:49.27 nsProgressFrame.o
32:50.31 nsSVGTransform.o
32:52.33 nsSVGViewBox.o
32:53.08 nsTextRunTransformations.o
32:54.08 nsRangeFrame.o
32:54.83 nsVideoFrame.o
32:55.20 SVGFEContainerFrame.o
32:55.20 SVGFEImageFrame.o
32:55.87 SVGFELeafFrame.o
32:57.68 nsViewportFrame.o
32:58.33 nsSelectsAreaFrame.o
32:58.37 SVGFEUnstyledLeafFrame.o
32:59.08 SVGTextFrame.o
33:01.42 SVGViewFrame.o
33:02.14 nsFilterInstance.o
33:03.51 nsTextControlFrame.o
33:05.30 nsSVGAFrame.o
33:06.72 nsBox.o
33:06.72 nsBoxFrame.o
33:09.02 nsSVGClipPathFrame.o
33:09.25 nsSVGContainerFrame.o
33:09.91 nsBoxLayout.o
33:12.47 nsSVGEffects.o
33:12.64 nsSVGFilterFrame.o
33:13.01 nsSVGFilterInstance.o
33:14.33 nsBoxLayoutState.o
33:16.06 RenderFrameChild.o
33:16.06 RenderFrameParent.o
33:16.40 nsBoxObject.o
33:16.55 nsSVGForeignObjectFrame.o
33:16.56 nsMathMLChar.o
33:16.56 nsMathMLContainerFrame.o
33:17.47 nsButtonBoxFrame.o
33:20.31 nsSVGGFrame.o
33:20.45 nsContainerBoxObject.o
33:21.56 nsMathMLFrame.o
33:24.05 nsSVGGenericContainerFrame.o
33:24.27 nsDeckFrame.o
33:25.68 nsMathMLOperators.o
33:26.19 nsMathMLSelectedFrame.o
33:27.22 inCSSValueSearch.o
33:27.22 inDOMUtils.o
33:27.23 nsSVGGradientFrame.o
33:27.54 nsDocElementBoxFrame.o
33:29.55 inDOMView.o
33:29.63 nsSVGImageFrame.o
33:29.71 nsMathMLTokenFrame.o
33:30.65 nsGroupBoxFrame.o
33:33.21 nsSVGInnerSVGFrame.o
33:33.41 nsMathMLmactionFrame.o
33:33.99 inDeepTreeWalker.o
33:34.21 nsImageBoxFrame.o
33:36.47 inFlasher.o
33:37.14 nsSVGIntegrationUtils.o
33:37.40 nsMathMLmencloseFrame.o
33:37.75 nsLeafBoxFrame.o
33:38.42 inLayoutUtils.o
33:40.93 nsSVGMarkerFrame.o
33:41.05 nsMathMLmfencedFrame.o
33:41.27 inSearchLoop.o
33:42.01 nsListBoxBodyFrame.o
33:43.92 nsFontFace.o
33:44.10 nsFontFaceList.o
33:45.30 nsListBoxLayout.o
33:45.33 nsSVGMaskFrame.o
33:45.55 nsMathMLmfracFrame.o
33:48.91 nsSVGOuterSVGFrame.o
33:49.10 nsMathMLmmultiscriptsFrame.o
33:49.60 nsListBoxObject.o
33:50.10 nsSVGPaintServerFrame.o
33:51.94 nsListItemFrame.o
33:52.57 nsPrintData.o
33:52.57 nsPrintEngine.o
33:53.30 nsMathMLmoFrame.o
33:54.32 nsMenuBarFrame.o
33:54.85 nsPagePrintTimer.o
33:54.89 nsSVGPathGeometryFrame.o
33:57.08 nsMathMLmpaddedFrame.o
33:57.46 nsMenuBarListener.o
33:57.95 nsSVGPatternFrame.o
34:00.63 nsPrintObject.o
34:00.75 nsMenuBoxObject.o
34:00.99 nsMathMLmphantomFrame.o
34:02.49 nsSVGStopFrame.o
34:03.05 nsPrintPreviewListener.o
34:03.31 nsMenuFrame.o
34:04.54 nsMathMLmrootFrame.o
34:05.70 nsMenuPopupFrame.o
34:06.56 nsSVGSwitchFrame.o
34:07.40 nsMathMLmrowFrame.o
34:07.77 nsMathMLmspaceFrame.o
34:09.43 nsSVGUseFrame.o
34:10.48 nsPopupBoxObject.o
34:10.90 nsMathMLmsqrtFrame.o
34:11.10 nsContentDLF.o
34:11.10 nsLayoutModule.o
34:12.65 nsSVGUtils.o
34:13.78 nsLayoutStatics.o
34:14.35 nsMathMLmtableFrame.o
34:15.84 nsPopupSetFrame.o
34:17.72 nsMathMLmunderoverFrame.o
34:18.41 nsProgressMeterFrame.o
34:20.91 nsRepeatService.o
34:21.66 nsResizerFrame.o
34:22.61 nsMathMLsemanticsFrame.o
34:23.37 nsRootBoxFrame.o
34:23.50 nsDocShell.o
34:23.51 LoadContext.o
34:26.88 nsScrollBoxFrame.o
34:29.32 nsScrollBoxObject.o
34:29.40 nsSHEntry.o
34:29.40 nsSHEntryShared.o
34:30.55 nsSHTransaction.o
34:30.79 LoadInfo.o
34:32.07 nsScrollbarButtonFrame.o
34:32.27 nsSHistory.o
34:32.90 SerializedLoadContext.o
34:33.12 nsAboutRedirector.o
34:34.45 nsScrollbarFrame.o
34:34.49 nsDSURIContentListener.o
34:34.66 nsDocShellModule.o
34:35.20 nsDefaultURIFixup.o
34:35.91 nsSliderFrame.o
34:37.30 nsDocShellEditorData.o
34:37.31 nsAutoWindowStateHelper.o
34:37.31 nsDialogParamBlock.o
34:38.76 nsWindowWatcher.o
34:38.77 nsSplitterFrame.o
34:38.78 nsSprocketLayout.o
34:40.54 nsDocShellEnumerator.o
34:41.22 nsDocShellLoadInfo.o
34:41.62 nsDocShellTransferableHooks.o
34:42.14 nsDownloadHistory.o
34:42.42 nsWebNavigationInfo.o
34:42.71 nsStackFrame.o
34:42.91 nsStackLayout.o
34:43.47 nsTextBoxFrame.o
34:43.68 nsAppStartupNotifier.o
34:44.37 nsTitleBarFrame.o
34:45.56 /opt/FirefoxSource/mozilla-release/layout/xul/nsSprocketLayout.cpp: In member function 'void nsSprocketLayout::AlignChildren(nsIFrame*, nsBoxLayoutState&)':
34:45.56 Warning: -Wmaybe-uninitialized in /opt/FirefoxSource/mozilla-release/layout/xul/nsSprocketLayout.cpp: 'y' may be used uninitialized in this function
34:45.56 /opt/FirefoxSource/mozilla-release/layout/xul/nsSprocketLayout.cpp:973:22: warning: 'y' may be used uninitialized in this function [-Wmaybe-uninitialized]
34:45.56 Warning: -Wmaybe-uninitialized in /opt/FirefoxSource/mozilla-release/layout/xul/nsSprocketLayout.cpp: 'x' may be used uninitialized in this function
34:45.56 /opt/FirefoxSource/mozilla-release/layout/xul/nsSprocketLayout.cpp:993:22: warning: 'x' may be used uninitialized in this function [-Wmaybe-uninitialized]
34:45.56 Warning: -Wmaybe-uninitialized in /opt/FirefoxSource/mozilla-release/layout/xul/nsSprocketLayout.cpp: 'isLTR' may be used uninitialized in this function
34:45.56 /opt/FirefoxSource/mozilla-release/layout/xul/nsSprocketLayout.cpp:989:45: warning: 'isLTR' may be used uninitialized in this function [-Wmaybe-uninitialized]
34:45.56 Warning: -Wmaybe-uninitialized in /opt/FirefoxSource/mozilla-release/layout/xul/nsSprocketLayout.cpp: 'maxAscent' may be used uninitialized in this function
34:45.56 /opt/FirefoxSource/mozilla-release/layout/xul/nsSprocketLayout.cpp:967:54: warning: 'maxAscent' may be used uninitialized in this function [-Wmaybe-uninitialized]
34:45.56 nsXULLabelFrame.o
34:45.99 nsXULPopupManager.o
34:45.99 nsXULTooltipListener.o
34:48.88 /opt/FirefoxSource/mozilla-release/layout/xul/nsTextBoxFrame.cpp: In member function 'void nsTextBoxFrame::DrawText(nsRenderingContext&, const nsRect&, const nsRect&, const nscolor*)':
34:48.88 Warning: -Wmaybe-uninitialized in /opt/FirefoxSource/mozilla-release/layout/xul/nsTextBoxFrame.cpp: 'underColor' may be used uninitialized in this function
34:48.88 /opt/FirefoxSource/mozilla-release/layout/xul/nsTextBoxFrame.cpp:488:43: warning: 'underColor' may be used uninitialized in this function [-Wmaybe-uninitialized]
34:48.88 Warning: -Wmaybe-uninitialized in /opt/FirefoxSource/mozilla-release/layout/xul/nsTextBoxFrame.cpp: 'overColor' may be used uninitialized in this function
34:48.88 /opt/FirefoxSource/mozilla-release/layout/xul/nsTextBoxFrame.cpp:495:42: warning: 'overColor' may be used uninitialized in this function [-Wmaybe-uninitialized]
34:48.88 Warning: -Wmaybe-uninitialized in /opt/FirefoxSource/mozilla-release/layout/xul/nsTextBoxFrame.cpp: 'strikeColor' may be used uninitialized in this function
34:48.88 /opt/FirefoxSource/mozilla-release/layout/xul/nsTextBoxFrame.cpp:573:37: warning: 'strikeColor' may be used uninitialized in this function [-Wmaybe-uninitialized]
34:48.88 Warning: -Wmaybe-uninitialized in /opt/FirefoxSource/mozilla-release/layout/xul/nsTextBoxFrame.cpp: 'strikeStyle' may be used uninitialized in this function
34:48.88 /opt/FirefoxSource/mozilla-release/layout/xul/nsTextBoxFrame.cpp:573:37: warning: 'strikeStyle' may be used uninitialized in this function [-Wmaybe-uninitialized]
34:48.88 Warning: -Wmaybe-uninitialized in /opt/FirefoxSource/mozilla-release/layout/xul/nsTextBoxFrame.cpp: 'underStyle' may be used uninitialized in this function
34:48.88 /opt/FirefoxSource/mozilla-release/layout/xul/nsTextBoxFrame.cpp:488:43: warning: 'underStyle' may be used uninitialized in this function [-Wmaybe-uninitialized]
34:48.88 Warning: -Wmaybe-uninitialized in /opt/FirefoxSource/mozilla-release/layout/xul/nsTextBoxFrame.cpp: 'overStyle' may be used uninitialized in this function
34:48.88 /opt/FirefoxSource/mozilla-release/layout/xul/nsTextBoxFrame.cpp:495:42: warning: 'overStyle' may be used uninitialized in this function [-Wmaybe-uninitialized]
34:49.01 nsFind.o
34:49.01 nsWebBrowserFind.o
34:51.03 nsWebBrowserPersist.o
34:52.15 nsBaseCommandController.o
34:52.15 nsCommandGroup.o
34:52.17 nsCommandManager.o
34:52.35 nsPrintProgress.o
34:52.35 nsPrintProgressParams.o
34:52.53 nsCommandParams.o
34:52.83 nsControllerCommandTable.o
34:53.12 nsPrintingPromptService.o
34:53.70 nsEmbeddingModule.o
34:53.82 nsCommandHandler.o
34:53.82 nsContextMenuInfo.o
34:54.12 nsDocShellTreeOwner.o
34:54.48 nsWebBrowserModule.o
34:55.17 nsEmbedStream.o
34:55.40 nsAppShellFactory.o
34:55.40 nsAppShellService.o
34:56.21 nsAppShellWindowEnumerator.o
34:56.30 nsWebBrowser.o
34:56.73 nsWebBrowserContentPolicy.o
34:57.50 ANPCanvas.o
34:57.50 ANPPaint.o
34:57.91 ANPPath.o
34:58.05 nsChromeTreeOwner.o
34:58.30 ANPTypeface.o
34:58.68 SkANP.o
34:59.09 /opt/FirefoxSource/mozilla-release/other-licenses/skia-npapi/ANPTypeface.cpp: In function 'int32_t anp_getFontPath(const ANPTypeface*, char*, int32_t, int32_t*)':
34:59.09 Warning: -Wunused-variable in /opt/FirefoxSource/mozilla-release/other-licenses/skia-npapi/ANPTypeface.cpp: unused variable 'stream'
34:59.09 /opt/FirefoxSource/mozilla-release/other-licenses/skia-npapi/ANPTypeface.cpp:63:15: warning: unused variable 'stream' [-Wunused-variable]
34:59.49 CharDistribution.o
34:59.50 JpCntx.o
34:59.59 nsContentTreeOwner.o
34:59.79 LangBulgarianModel.o
34:59.93 LangCyrillicModel.o
35:00.04 LangGreekModel.o
35:00.13 LangHebrewModel.o
35:00.15 nsUdetXPCOMWrapper.o
35:00.15 nsUniversalCharDetModule.o
35:00.22 LangHungarianModel.o
35:00.31 LangThaiModel.o
35:00.40 nsBig5Prober.o
35:00.49 nsCharSetProber.o
35:00.64 nsEUCJPProber.o
35:00.76 nsEUCKRProber.o
35:00.93 nsEUCTWProber.o
35:00.97 AccessibleWrap.o
35:00.97 Platform.o
35:01.12 nsEscCharsetProber.o
35:01.13 ARIAMap.o
35:01.13 ARIAStateMap.o
35:01.26 nsEscSM.o
35:01.44 nsGB2312Prober.o
35:01.55 nsHebrewProber.o
35:01.71 nsLatin1Prober.o
35:01.80 nsWebShellWindow.o
35:01.83 nsMBCSGroupProber.o
35:01.89 ARIAGridAccessible.o
35:01.89 Accessible.o
35:01.95 nsMBCSSM.o
35:02.15 nsSBCSGroupProber.o
35:02.31 nsSBCharSetProber.o
35:02.46 nsSJISProber.o
35:02.57 nsUTF8Prober.o
35:02.74 nsUniversalDetector.o
35:03.07 AccCollector.o
35:03.66 HTMLCanvasAccessible.o
35:03.66 HTMLElementAccessibles.o
35:04.52 nsWindowMediator.o
35:05.14 ApplicationAccessible.o
35:05.77 AccEvent.o
35:06.11 HTMLFormControlAccessible.o
35:06.69 AccGroupInfo.o
35:07.27 nsXULWindow.o
35:09.41 HTMLImageMapAccessible.o
35:09.62 AccIterator.o
35:12.20 Asserts.o
35:13.42 BaseAccessibles.o
35:13.72 HTMLLinkAccessible.o
35:14.45 HTMLListAccessible.o
35:15.33 DocManager.o
35:15.48 EventQueue.o
35:16.28 DocAccessible.o
35:17.25 HTMLSelectAccessible.o
35:17.29 xpcAccEvents.o
35:17.29 nsAccessibleRelation.o
35:18.06 xpcAccessibleHyperText.o
35:18.83 FormControlAccessible.o
35:19.08 Filters.o
35:20.35 HTMLTableAccessible.o
35:20.75 xpcAccessibleSelectable.o
35:22.08 FocusManager.o
35:23.67 xpcAccessibleTable.o
35:24.13 HyperTextAccessible.o
35:24.46 Logging.o
35:24.52 xpcAccessibleTableCell.o
35:25.63 xpcAccessibleTextRange.o
35:26.54 xpcAccessibleValue.o
35:26.77 ImageAccessible.o
35:27.65 NotificationController.o
35:28.85 XULAlertAccessible.o
35:28.85 XULColorPickerAccessible.o
35:29.72 XULComboboxAccessible.o
35:29.96 nsProfileDirServiceProvider.o
35:29.96 nsProfileLock.o
35:30.81 SelectionManager.o
35:30.89 XULElementAccessibles.o
35:31.05 OuterDocAccessible.o
35:32.42 StyleInfo.o
35:33.58 XULFormControlAccessible.o
35:34.32 RootAccessible.o
35:34.48 local_debug_info_symbolizer.o
35:34.48 platform-linux.o
35:35.55 TextAttrs.o
35:36.18 shared-libraries-linux.o
35:37.02 TableCellAccessible.o
35:37.25 EHABIStackWalk.o
35:37.42 XULListboxAccessible.o
35:38.31 TextRange.o
35:38.48 AutoObjectMapper.o
35:39.72 BreakpadSampler.o
35:40.43 JSStreamWriter.o
35:40.69 TextLeafAccessible.o
35:40.71 XULMenuAccessible.o
35:41.55 LulCommon.o
35:41.90 TextUpdater.o
35:42.34 LulDwarf.o
35:42.98 LulDwarfSummariser.o
35:44.09 XULSelectControlAccessible.o
35:44.25 LulElf.o
35:44.52 LulExidx.o
35:44.58 TreeWalker.o
35:44.71 nsAccUtils.o
35:45.63 LulMain.o
35:46.04 LulRWLock.o
35:47.30 XULSliderAccessible.o
35:47.42 ProfileEntry.o
35:47.51 nsAccessibilityService.o
35:47.56 ProfilerBacktrace.o
35:47.62 nsAccessiblePivot.o
35:49.15 ProfilerIOInterposeObserver.o
35:49.61 ProfilerMarkers.o
35:50.24 XULTabAccessible.o
35:50.47 SaveProfileTask.o
35:50.73 nsWindowDataSource.o
35:51.09 SyncProfile.o
35:51.68 XULTreeAccessible.o
35:51.92 TableTicker.o
35:52.42 ThreadResponsiveness.o
35:53.01 nsCoreUtils.o
35:53.13 XULTreeGridAccessible.o
35:55.03 UnwinderThread2.o
35:55.65 nsProfiler.o
35:56.27 nsEventShell.o
35:56.68 nsProfilerFactory.o
35:57.58 platform.o
35:58.04 nsTextEquivUtils.o
36:00.52 nsDirectoryViewer.o
36:00.77 nsModule.o
36:00.90 mozHunspell.o
36:00.91 mozHunspellDirProvider.o
36:01.02 RemoteSpellCheckEngineChild.o
36:01.45 RemoteSpellCheckEngineParent.o
36:01.53 mozEnglishWordUtils.o
36:01.53 mozGenericWordUtils.o
36:02.04 mozInlineSpellChecker.o
36:02.26 mozInlineSpellWordUtil.o
36:02.71 affentry.o
36:03.38 nsSecureBrowserUIImpl.o
36:03.38 PublicKeyPinningService.o
36:03.94 affixmgr.o
36:04.06 csutil.o
36:04.60 dictmgr.o
36:05.37 filemgr.o
36:05.74 hashmgr.o
36:05.76 nsBOOTModule.o
36:06.06 hunspell.o
36:06.34 nsEntropyCollector.o
36:06.36 mozPersonalDictionary.o
36:06.76 hunzip.o
36:06.96 md4.o
36:06.96 CryptoTask.o
36:07.02 nsSecurityHeaderParser.o
36:07.18 nsCertificatePrincipal.o
36:07.35 nsSecurityWarningDialogs.o
36:07.68 nsSiteSecurityService.o
36:07.82 nsCertOverrideService.o
36:08.09 nsCertPicker.o
36:08.33 phonet.o
36:08.80 replist.o
36:09.21 suggestmgr.o
36:09.59 OCSPCommon.o
36:09.59 TLSServer.o
36:09.60 nsCertVerificationThread.o
36:09.64 mozSpellChecker.o
36:10.27 nsClientAuthRemember.o
36:10.45 nsCrypto.o
36:10.68 nsDataSignatureVerifier.o
36:10.91 mozSpellCheckerFactory.o
36:10.99 mozSpellI18NManager.o
36:11.46 nsKeygenHandler.o
36:11.47 nsKeygenThread.o
36:12.44 BadCertServer.o
36:12.44 GenerateOCSPResponse.o
36:12.75 OCSPStaplingServer.o
36:13.28 nsKeyModule.o
36:13.80 nsNSSASN1Object.o
36:13.82 OCSPCacheTest.o
36:13.82 TLSIntoleranceTest.o
36:13.86 TestCertDB.o
36:14.04 nsNSSCallbacks.o
36:14.20 nsNSSCertCache.o
36:14.30 nsASN1Tree.o
36:14.30 nsFormSigningDialog.o
36:14.50 /opt/FirefoxSource/mozilla-release/security/manager/ssl/src/nsNSSASN1Object.cpp: In function 'nsresult buildASN1ObjectFromDER(unsigned char*, unsigned char*, nsIASN1Sequence*)':
36:14.50 Warning: -Wmaybe-uninitialized in /opt/FirefoxSource/mozilla-release/security/manager/ssl/src/nsNSSASN1Object.cpp: 'bytesUsed' may be used uninitialized in this function
36:14.50 /opt/FirefoxSource/mozilla-release/security/manager/ssl/src/nsNSSASN1Object.cpp:131:22: warning: 'bytesUsed' may be used uninitialized in this function [-Wmaybe-uninitialized]
36:14.50 nsNSSCertHelper.o
36:14.80 nsNSSDialogHelper.o
36:15.28 nsNSSDialogs.o
36:15.81 nsPKIModule.o
36:16.07 nsNSSCertificate.o
36:16.28 nsNSSCertificateFakeTransport.o
36:16.63 nsPKIParamBlock.o
36:17.10 nsAlertsService.o
36:17.10 nsXULAlerts.o
36:17.11 nsCommandLine.o
36:18.36 DiskSpaceWatcher.o
36:18.43 nsNSSCertTrust.o
36:18.59 SQLFunctions.o
36:18.59 ApplicationReputation.o
36:19.07 nsNSSCertValidity.o
36:19.28 csd.pb.o
36:19.30 nsNSSCleaner.o
36:19.78 nsNSSErrors.o
36:19.78 nsDownloadManager.o
36:19.90 nsNSSIOLayer.o
36:20.45 nsNSSModule.o
36:22.07 nsNSSShutDown.o
36:22.85 nsNTLMAuthModule.o
36:23.22 nsPK11TokenDB.o
36:23.24 nsPKCS11Slot.o
36:23.29 nsPKCS12Blob.o
36:23.85 nsProtectedAuthThread.o
36:24.01 nsPSMBackgroundThread.o
36:24.07 nsRandomGenerator.o
36:24.53 nsSDR.o
36:24.65 NSSErrorsService.o
36:24.89 FinalizationWitnessService.o
36:25.03 nsSSLSocketProvider.o
36:25.07 nsSSLStatus.o
36:25.35 nsStreamCipher.o
36:25.60 nsTLSSocketProvider.o
36:25.65 nsUsageArrayHelper.o
36:25.76 nsFindService.o
36:25.85 PSMRunnable.o
36:26.02 SharedSSLState.o
36:26.03 DownloadPlatform.o
36:26.18 SSLServerCertVerification.o
36:26.39 TransportSecurityInfo.o
36:26.49 nsCryptoHash.o
36:26.87 nsNSSCertificateDB.o
36:27.47 nsNSSComponent.o
36:27.75 nsNSSVersion.o
36:27.87 mp3sniff.o
36:27.87 nsMediaSniffer.o
36:27.97 nsMediaSnifferModule.o
36:28.37 PSMContentListener.o
36:28.44 NativeOSFileInternals.o
36:28.77 nsCertTree.o
36:29.28 nsParentalControlsServiceDefault.o
36:29.59 PerfMeasurement.o
36:29.63 extension_set.o
36:29.63 generated_message_util.o
36:29.97 reflect.o
36:30.43 StartupTimeline.o
36:30.43 nsAppStartup.o
36:30.61 nsBrowserStatusFilter.o
36:30.63 Telemetry.o
36:30.76 nsUserInfoUnix.o
36:31.08 nsTypeAheadFind.o
36:31.82 coded_stream.o
36:32.17 zero_copy_stream.o
36:32.69 lz4.o
36:32.87 ctypes.o
36:33.12 zero_copy_stream_impl_lite.o
36:33.47 message_lite.o
36:33.81 nsAutoCompleteController.o
36:33.81 nsAutoCompleteSimpleResult.o
36:34.17 repeated_field.o
36:34.81 common.o
36:35.22 once.o
36:35.26 nsFormFillController.o
36:35.70 nsUrlClassifierPrefixSet.o
36:35.70 nsUrlClassifierStreamUpdater.o
36:35.81 wire_format_lite.o
36:36.41 HashStore.o
36:36.45 ChunkSet.o
36:36.81 nsToolkitCompsModule.o
36:38.19 nsJSInspector.o
36:38.23 IdentityCryptoService.o
36:38.41 Classifier.o
36:39.15 AddonPathService.o
36:39.19 LookupCache.o
36:39.22 ProtocolParser.o
36:39.22 BadPlugin.o
36:39.22 GoodPlugin.o
36:39.40 nsProfileLock.o
36:39.41 nsToolkitProfileService.o
36:40.61 TestWebappRT.o
36:40.64 nsCheckSummedOutputStream.o
36:40.69 nsAndroidSystemProxySettings.o
36:40.69 nsUrlClassifierDBService.o
36:41.04 convert_UTF.o
36:41.04 breakpad_getcontext.o
36:41.13 nsUrlClassifierProxies.o
36:41.21 arm_ex_reader.o
36:41.24 arm_ex_to_module.o
36:41.94 nsUrlClassifierUtils.o
36:42.11 bytereader.o
36:42.63 /opt/FirefoxSource/mozilla-release/toolkit/system/androidproxy/nsAndroidSystemProxySettings.cpp: In member function 'virtual MozExternalRefCountType nsAndroidSystemProxySettings::Release()':
36:42.63 Warning: -Wdelete-non-virtual-dtor in /opt/FirefoxSource/mozilla-release/toolkit/system/androidproxy/nsAndroidSystemProxySettings.cpp: deleting object of polymorphic class type 'nsAndroidSystemProxySettings' which has non-virtual destructor might cause undefined behaviour
36:42.63 /opt/FirefoxSource/mozilla-release/toolkit/system/androidproxy/nsAndroidSystemProxySettings.cpp:32:409: warning: deleting object of polymorphic class type 'nsAndroidSystemProxySettings' which has non-virtual destructor might cause undefined behaviour [-Wdelete-non-virtual-dtor]
36:43.08 dwarf2diehandler.o
36:43.30 basic_code_modules.o
36:43.30 basic_source_line_resolver.o
36:43.51 file_id.o
36:43.51 elfutils.o
36:43.68 dwarf2reader.o
36:43.78 dwarf_cfi_to_module.o
36:43.80 guid_creator.o
36:43.90 linux_libc_support.o
36:44.06 memory_mapped_file.o
36:44.17 safe_readlink.o
36:44.28 call_stack.o
36:44.41 nsAutoConfig.o
36:44.42 nsConfigFactory.o
36:44.55 nsAppRunner.o
36:44.57 nsEmbedFunctions.o
36:45.64 nsJSConfigTriggers.o
36:46.21 dwarf_cu_to_module.o
36:46.32 nsReadConfig.o
36:46.56 cfi_frame_info.o
36:46.98 minidump.o
36:47.59 dwarf_line_to_module.o
36:48.89 nsSyncJPAKE.o
36:49.51 source_line_resolver_base.o
36:49.63 /opt/FirefoxSource/mozilla-release/toolkit/crashreporter/google-breakpad/src/common/dwarf_cu_to_module.cc: In member function 'std::string google_breakpad::DwarfCUToModule::GenericDIEHandler::ComputeQualifiedName()':
36:49.63 Warning: -Wmaybe-uninitialized in /opt/FirefoxSource/mozilla-release/toolkit/crashreporter/google-breakpad/src/common/dwarf_cu_to_module.cc: 'enclosing_name' may be used uninitialized in this function
36:49.63 /opt/FirefoxSource/mozilla-release/toolkit/crashreporter/google-breakpad/src/common/dwarf_cu_to_module.cc:386:68: warning: 'enclosing_name' may be used uninitialized in this function [-Wmaybe-uninitialized]
36:49.63 Warning: -Wmaybe-uninitialized in /opt/FirefoxSource/mozilla-release/toolkit/crashreporter/google-breakpad/src/common/dwarf_cu_to_module.cc: 'unqualified_name' may be used uninitialized in this function
36:49.63 /opt/FirefoxSource/mozilla-release/toolkit/crashreporter/google-breakpad/src/common/dwarf_cu_to_module.cc:386:68: warning: 'unqualified_name' may be used uninitialized in this function [-Wmaybe-uninitialized]
36:49.65 language.o
36:49.70 StartupCache.o
36:49.70 StartupCacheModule.o
36:49.87 /opt/FirefoxSource/mozilla-release/toolkit/xre/nsAppRunner.cpp: In member function 'int XREMain::XRE_mainStartup(bool*)':
36:49.87 Warning: -Wmaybe-uninitialized in /opt/FirefoxSource/mozilla-release/toolkit/xre/nsAppRunner.cpp: 'currentIsSelected' may be used uninitialized in this function
36:49.87 /opt/FirefoxSource/mozilla-release/toolkit/xre/nsAppRunner.cpp:2096:7: warning: 'currentIsSelected' may be used uninitialized in this function [-Wmaybe-uninitialized]
36:49.87 /opt/FirefoxSource/mozilla-release/toolkit/xre/nsAppRunner.cpp:2094:12: note: 'currentIsSelected' was declared here
36:49.87 CreateAppData.o
36:50.82 dump_symbols.o
36:50.99 StartupCacheUtils.o
36:51.34 elf_symbols_to_module.o
36:52.33 logging.o
36:53.03 md5.o
36:53.42 JSDebugger.o
36:53.95 module.o
36:54.10 pathname_stripper.o
36:54.12 EventTracer.o
36:54.15 ProfileReset.o
36:54.17 stack_frame_symbolizer.o
36:54.50 nsAndroidStartup.o
36:54.55 nsConsoleWriter.o
36:55.22 snappy-c.o
36:55.22 snappy-sinksource.o
36:55.55 snappy-stubs-internal.o
36:55.63 stackwalker.o
36:55.65 snappy.o
36:56.12 string_conversion.o
36:56.29 stackwalker_amd64.o
36:56.37 nsNativeAppSupportBase.o
36:56.54 unique_string.o
36:56.77 nsNativeAppSupportDefault.o
36:56.96 nsSigHandlers.o
36:57.01 nsBrowserModule.o
36:57.01 nsShellService.o
36:57.11 nsXREDirProvider.o
36:57.17 stackwalker_arm.o
36:57.44 nsAndroidHistory.o
36:58.14 stackwalker_ppc.o
36:58.88 StaticXULComponentsStart.o
36:59.09 /opt/FirefoxSource/mozilla-release/mobile/android/components/build/nsShellService.cpp: In member function 'virtual MozExternalRefCountType nsShellService::Release()':
36:59.09 Warning: -Wdelete-non-virtual-dtor in /opt/FirefoxSource/mozilla-release/mobile/android/components/build/nsShellService.cpp: deleting object of polymorphic class type 'nsShellService' which has non-virtual destructor might cause undefined behaviour
36:59.09 /opt/FirefoxSource/mozilla-release/mobile/android/components/build/nsShellService.cpp:13:381: warning: deleting object of polymorphic class type 'nsShellService' which has non-virtual destructor might cause undefined behaviour [-Wdelete-non-virtual-dtor]
36:59.10 ssltunnel.o
36:59.24 stackwalker_sparc.o
36:59.25 TestArrayUtils.o
36:59.25 TestAtomics.o
36:59.46 TestBinarySearch.o
36:59.85 stackwalker_x86.o
37:00.07 /opt/FirefoxSource/mozilla-release/mobile/android/components/build/nsAndroidHistory.cpp: In member function 'virtual MozExternalRefCountType nsAndroidHistory::Release()':
37:00.07 Warning: -Wdelete-non-virtual-dtor in /opt/FirefoxSource/mozilla-release/mobile/android/components/build/nsAndroidHistory.cpp: deleting object of polymorphic class type 'nsAndroidHistory' which has non-virtual destructor might cause undefined behaviour
37:00.07 /opt/FirefoxSource/mozilla-release/mobile/android/components/build/nsAndroidHistory.cpp:18:385: warning: deleting object of polymorphic class type 'nsAndroidHistory' which has non-virtual destructor might cause undefined behaviour [-Wdelete-non-virtual-dtor]
37:00.09 TestVolatileBuffer.o
37:00.43 tokenize.o
37:00.47 editline.o
37:00.47 sysunix.o
37:00.59 js.o
37:00.60 jsheaptools.o
37:01.52 TestBloomFilter.o
37:01.63 selfTest.o
37:01.63 testAddPropertyPropcache.o
37:01.87 TestCasting.o
37:02.01 TestCeilingFloor.o
37:02.14 TestCheckedInt.o
37:02.30 TestCountPopulation.o
37:03.03 gdb-tests.o
37:03.03 test-JSObject.o
37:03.52 test-JSString.o
37:03.80 testArgumentsObject.o
37:03.95 test-JSSymbol.o
37:05.40 test-Root.o
37:05.81 test-jsid.o
37:05.86 testArrayBuffer.o
37:06.68 test-jsval.o
37:07.14 test-prettyprinters.o
37:07.61 typedef-printers.o
37:08.06 pkixbind.o
37:08.06 pkixbuild.o
37:08.16 pkixcert.o
37:08.24 In file included from /opt/FirefoxSource/mozilla-release/js/src/shell/../jsweakmap.h:10:0,
37:08.24                  from /opt/FirefoxSource/mozilla-release/js/src/shell/../vm/ScopeObject.h:12,
37:08.24                  from /opt/FirefoxSource/mozilla-release/js/src/shell/../frontend/SharedContext.h:19,
37:08.24                  from /opt/FirefoxSource/mozilla-release/js/src/shell/../frontend/FullParseHandler.h:13,
37:08.24                  from /opt/FirefoxSource/mozilla-release/js/src/shell/../frontend/Parser.h:17,
37:08.24                  from /opt/FirefoxSource/mozilla-release/js/src/shell/js.cpp:58:
37:08.24 /opt/FirefoxSource/mozilla-release/js/src/shell/../jscompartment.h: In function 'bool EvalInFrame(JSContext*, unsigned int, jsval*)':
37:08.24 Warning: -Wmaybe-uninitialized in /opt/FirefoxSource/mozilla-release/js/src/jscompartment.h: 'ac.js::AutoCompartment::origin_' may be used uninitialized in this function
37:08.24 /opt/FirefoxSource/mozilla-release/js/src/shell/../jscompartment.h:157:31: warning: 'ac.js::AutoCompartment::origin_' may be used uninitialized in this function [-Wmaybe-uninitialized]
37:08.24 /opt/FirefoxSource/mozilla-release/js/src/shell/js.cpp:2775:37: note: 'ac.js::AutoCompartment::origin_' was declared here
37:08.24 In file included from /opt/FirefoxSource/mozilla-release/js/src/shell/../jscompartmentinlines.h:14:0,
37:08.24                  from /opt/FirefoxSource/mozilla-release/js/src/shell/js.cpp:73:
37:08.24 Warning: -Wmaybe-uninitialized in /opt/FirefoxSource/mozilla-release/js/src/jscntxtinlines.h: 'ac.js::AutoCompartment::cx_' may be used uninitialized in this function
37:08.24 /opt/FirefoxSource/mozilla-release/js/src/shell/../jscntxtinlines.h:413:29: warning: 'ac.js::AutoCompartment::cx_' may be used uninitialized in this function [-Wmaybe-uninitialized]
37:08.24 /opt/FirefoxSource/mozilla-release/js/src/shell/js.cpp:2775:37: note: 'ac.js::AutoCompartment::cx_' was declared here
37:08.24 In file included from /opt/FirefoxSource/mozilla-release/js/src/shell/../jsweakmap.h:10:0,
37:08.24                  from /opt/FirefoxSource/mozilla-release/js/src/shell/../vm/ScopeObject.h:12,
37:08.24                  from /opt/FirefoxSource/mozilla-release/js/src/shell/../frontend/SharedContext.h:19,
37:08.24                  from /opt/FirefoxSource/mozilla-release/js/src/shell/../frontend/FullParseHandler.h:13,
37:08.24                  from /opt/FirefoxSource/mozilla-release/js/src/shell/../frontend/Parser.h:17,
37:08.24                  from /opt/FirefoxSource/mozilla-release/js/src/shell/js.cpp:58:
37:08.25 /opt/FirefoxSource/mozilla-release/js/src/shell/../jscompartment.h: In function 'bool Evaluate(JSContext*, unsigned int, jsval*)':
37:08.25 Warning: -Wmaybe-uninitialized in /opt/FirefoxSource/mozilla-release/js/src/jscompartment.h: '*((void*)(& ancx)+24).js::AutoCompartment::origin_' may be used uninitialized in this function
37:08.25 /opt/FirefoxSource/mozilla-release/js/src/shell/../jscompartment.h:157:31: warning: '*((void*)(& ancx)+24).js::AutoCompartment::origin_' may be used uninitialized in this function [-Wmaybe-uninitialized]
37:08.25 /opt/FirefoxSource/mozilla-release/js/src/shell/js.cpp:1229:20: note: '*((void*)(& ancx)+24).js::AutoCompartment::origin_' was declared here
37:08.25 In file included from /opt/FirefoxSource/mozilla-release/js/src/shell/../jscompartmentinlines.h:14:0,
37:08.25                  from /opt/FirefoxSource/mozilla-release/js/src/shell/js.cpp:73:
37:08.25 Warning: -Wmaybe-uninitialized in /opt/FirefoxSource/mozilla-release/js/src/jscntxtinlines.h: '*((void*)(& ancx)+24).js::AutoCompartment::cx_' may be used uninitialized in this function
37:08.25 /opt/FirefoxSource/mozilla-release/js/src/shell/../jscntxtinlines.h:449:53: warning: '*((void*)(& ancx)+24).js::AutoCompartment::cx_' may be used uninitialized in this function [-Wmaybe-uninitialized]
37:08.25 /opt/FirefoxSource/mozilla-release/js/src/shell/js.cpp:1229:20: note: '*((void*)(& ancx)+24).js::AutoCompartment::cx_' was declared here
37:08.25 In file included from /opt/FirefoxSource/mozilla-release/js/src/shell/js.cpp:38:0:
37:08.25 Warning: -Wmaybe-uninitialized in /opt/FirefoxSource/mozilla-release/js/src/jsapi.h: '*((void*)(& ancx)+8).JSAutoRequest::mContext' may be used uninitialized in this function
37:08.25 /opt/FirefoxSource/mozilla-release/js/src/shell/../jsapi.h:1327:32: warning: '*((void*)(& ancx)+8).JSAutoRequest::mContext' may be used uninitialized in this function [-Wmaybe-uninitialized]
37:08.25 /opt/FirefoxSource/mozilla-release/js/src/shell/js.cpp:1229:20: note: '*((void*)(& ancx)+8).JSAutoRequest::mContext' was declared here
37:08.25 jsoptparse.o
37:08.48 pkixcheck.o
37:08.71 pkixder.o
37:09.07 In file included from /opt/FirefoxSource/mozilla-release/security/pkix/lib/pkixutil.h:28:0,
37:09.07                  from /opt/FirefoxSource/mozilla-release/security/pkix/lib/pkixcheck.h:29,
37:09.07                  from /opt/FirefoxSource/mozilla-release/security/pkix/lib/pkixcheck.cpp:29:
37:09.07 /opt/FirefoxSource/mozilla-release/security/pkix/lib/pkixder.h: In function 'mozilla::pkix::Result mozilla::pkix::DecodeBasicConstraints(mozilla::pkix::Input&, bool&, long int&)':
37:09.07 Warning: -Wmaybe-uninitialized in /opt/FirefoxSource/mozilla-release/security/pkix/lib/pkixder.h: 'parsedValue' may be used uninitialized in this function
37:09.07 /opt/FirefoxSource/mozilla-release/security/pkix/lib/pkixder.h:396:22: warning: 'parsedValue' may be used uninitialized in this function [-Wmaybe-uninitialized]
37:09.07 /opt/FirefoxSource/mozilla-release/security/pkix/lib/pkixder.h:391:11: note: 'parsedValue' was declared here
37:09.07 pkixnss.o
37:09.39 pkixocsp.o
37:10.13 /opt/FirefoxSource/mozilla-release/security/pkix/lib/pkixocsp.cpp: In function 'mozilla::pkix::Result mozilla::pkix::BasicResponse(mozilla::pkix::Input&, mozilla::pkix::Context&)':
37:10.13 Warning: -Wmaybe-uninitialized in /opt/FirefoxSource/mozilla-release/security/pkix/lib/pkixocsp.cpp: 'version' may be used uninitialized in this function
37:10.13 /opt/FirefoxSource/mozilla-release/security/pkix/lib/pkixocsp.cpp:470:3: warning: 'version' may be used uninitialized in this function [-Wmaybe-uninitialized]
37:10.13 /opt/FirefoxSource/mozilla-release/security/pkix/lib/pkixocsp.cpp:465:16: note: 'version' was declared here
37:10.15 AppData.o
37:10.15 FileUtils.o
37:10.52 nsArrayEnumerator.o
37:10.77 nsArrayUtils.o
37:11.04 nsCategoryCache.o
37:11.16 nsClassInfoImpl.o
37:11.70 nsCOMArray.o
37:11.87 nsComponentManagerUtils.o
37:12.36 testBindCallable.o
37:12.40 nsCOMPtr.o
37:12.62 nsCRTGlue.o
37:12.73 nsCycleCollectionParticipant.o
37:12.79 testBug604087.o
37:12.92 nsDeque.o
37:13.54 nsEnumeratorUtils.o
37:13.85 nsID.o
37:14.08 nsIInterfaceRequestorUtils.o
37:14.20 nsINIParser.o
37:14.35 nsISupportsImpl.o
37:14.78 nsMemory.o
37:14.90 nsQuickSort.o
37:14.96 testCallNonGenericMethodOnProxy.o
37:15.19 nsTArray.o
37:15.34 nsTHashtable.o
37:15.51 nsThreadUtils.o
37:15.61 nsTObserverArray.o
37:15.96 nsVersionComparator.o
37:16.11 nsVoidArray.o
37:16.21 nsWeakReference.o
37:16.61 pldhash.o
37:16.80 nsStringAPI.o
37:17.05 GenericModule.o
37:17.05 nsStringAPI.o
37:17.07 testChromeBuffer.o
37:17.07 nsXPCOMGlue.o
37:17.15 TestCountZeroes.o
37:17.26 TestEndian.o
37:17.37 TestEnumSet.o
37:17.39 AppData.o
37:18.16 BlockingResourceBase.o
37:18.28 testClassGetter.o
37:18.48 DeadlockDetector.o
37:18.50 TestFloatingPoint.o
37:18.59 FileUtils.o
37:18.74 GenericFactory.o
37:18.84 TestIntegerPrintfMacros.o
37:19.01 nsArrayEnumerator.o
37:19.18 nsArrayUtils.o
37:19.26 TestMacroArgs.o
37:19.47 nsCOMArray.o
37:19.61 nsCOMPtr.o
37:19.70 TestMacroForEach.o
37:19.75 TestPair.o
37:19.82 TestRollingMean.o
37:19.93 TestSHA1.o
37:20.14 nsCRTGlue.o
37:20.20 nsCategoryCache.o
37:20.26 TestTypedEnum.o
37:20.31 nsClassInfoImpl.o
37:20.35 TestTypeTraits.o
37:20.38 nsComponentManagerUtils.o
37:20.52 nsCycleCollectionParticipant.o
37:20.66 testCloneScript.o
37:20.74 nsDeque.o
37:20.84 TestUniquePtr.o
37:20.94 TestWeakPtr.o
37:21.30 nsEnumeratorUtils.o
37:21.55 nsID.o
37:21.75 TestPoisonArea.o
37:21.79 nsIInterfaceRequestorUtils.o
37:21.94 nsINIParser.o
37:22.06 testConservativeGC.o
37:22.09 nsISupportsImpl.o
37:22.51 nsMemory.o
37:22.63 nsProxyRelease.o
37:22.92 nsQuickSort.o
37:22.95 nsTArray.o
37:23.11 nsTHashtable.o
37:23.20 testContexts.o
37:23.29 nsTObserverArray.o
37:23.39 nsTextFormatter.o
37:23.55 nsThreadUtils.o
37:24.23 nsVersionComparator.o
37:24.65 nsVoidArray.o
37:24.76 nsWeakReference.o
37:25.13 pldhash.o
37:25.23 TestFileUtils.o
37:25.23 TestGCPostBarriers.o
37:25.28 testCustomIterator.o
37:25.31 unused.o
37:25.64 testDebugger.o
37:27.03 testDeepFreeze.o
37:27.73 testDefineGetterSetterNonEnumerable.o
37:29.10 xptcinvoke_arm.o
37:29.10 xptcstubs_arm.o
37:30.08 testDefineProperty.o
37:30.10 TestMinStringAPI.o
37:30.26 TestComponent.o
37:30.27 testEnclosingFunction.o
37:30.43 TestComponent.o
37:30.59 TestComponent.o
37:30.73 nsTestSample.o
37:30.74 testErrorCopying.o
37:30.91 testException.o
37:31.90 nsCollationUnix.o
37:31.90 nsDateTimeFormatUnix.o
37:32.33 nsPosixLocale.o
37:32.59 testExternalStrings.o
37:32.59 GreekCasing.o
37:32.59 IrishCasing.o
37:32.72 nsAndroidCharset.o
37:32.81 nsBidiUtils.o
37:32.82 StreamFunctions.o
37:32.82 ZipWriterModule.o
37:32.97 nsDeflateConverter.o
37:33.04 nsSpecialCasingData.o
37:33.25 nsUnicharUtils.o
37:33.27 nsUnicodeProperties.o
37:33.36 nsZipDataStream.o
37:33.36 testFindSCCs.o
37:33.66 nsZipHeader.o
37:34.43 nsZipWriter.o
37:34.56 testFreshGlobalEvalRedefinition.o
37:34.58 nsRDFResource.o
37:34.96 WriteArgument.o
37:35.06 nsIconChannel.o
37:35.24 testFuncCallback.o
37:36.54 nsIconModule.o
37:36.54 nsIconProtocolHandler.o
37:36.84 nsIconURI.o
37:37.18 testFunctionProperties.o
37:37.77 testGCAllocator.o
37:38.48 testGCExactRooting.o
37:38.66 testGCFinalizeCallback.o
37:38.76 TestCodeGenBinding.o
37:38.76 TestDictionaryBinding.o
37:40.02 testGCHeapPostBarriers.o
37:40.26 testGCOutOfMemory.o
37:40.33 testGCStoreBufferRemoval.o
37:41.93 ANPAudio.o
37:41.93 ANPBitmap.o
37:42.58 testHashTable.o
37:42.64 IndexedDBChild.o
37:42.64 IndexedDBParent.o
37:43.91 ANPEvent.o
37:44.11 ANPLog.o
37:45.93 testHashTableInit.o
37:46.25 ANPMatrix.o
37:46.61 ANPNativeWindow.o
37:46.94 ANPOpenGL.o
37:48.88 ANPSurface.o
37:51.32 ANPSystem.o
37:51.35 testIndexToString.o
37:51.61 ANPVideo.o
37:53.00 testIntString.o
37:53.83 ANPWindow.o
37:54.23 In file included from ../../../dist/include/mozilla/dom/indexedDB/IndexedDatabase.h:14:0,
37:54.23                  from /opt/FirefoxSource/mozilla-release/dom/indexedDB/ipc/IndexedDBParent.h:11,
37:54.23                  from /opt/FirefoxSource/mozilla-release/dom/indexedDB/ipc/IndexedDBParent.cpp:6:
37:54.23 ../../../dist/include/nsAutoPtr.h: In member function 'nsresult mozilla::dom::indexedDB::IndexedDBDatabaseParent::HandleRequestEvent(nsIDOMEvent*, const nsAString_internal&)':
37:54.23 Warning: -Wmaybe-uninitialized in /opt/FirefoxSource/mozilla-release/objdir-droid/dist/include/nsAutoPtr.h: 'database' may be used uninitialized in this function
37:54.23 ../../../dist/include/nsAutoPtr.h:926:5: warning: 'database' may be used uninitialized in this function [-Wmaybe-uninitialized]
37:54.23 /opt/FirefoxSource/mozilla-release/dom/indexedDB/ipc/IndexedDBParent.cpp:417:16: note: 'database' was declared here
37:55.80 TestExampleGenBinding.o
37:56.28 testIntTypesABI.o
37:56.41 AndroidLocationProvider.o
37:56.41 nsHapticFeedback.o
37:57.34 TestJSImplGenBinding.o
37:58.43 testIntern.o
38:00.01 testIsInsideNursery.o
38:01.90 TestAudioChannelService.o
38:01.93 testJSEvaluateScript.o
38:02.98 nptest.o
38:02.98 nptest_droid.o
38:03.33 testJitFoldsTo.o
38:05.33 nptest_utils.o
38:05.71 nptest_name.o
38:05.96 testJitMoveEmitterCycles.o
38:06.17 testJitRValueAlloc.o
38:06.21 TestJSImplInheritanceGenBinding.o
38:08.13 TestTypedefBinding.o
38:10.67 testLookup.o
38:11.65 testLooselyEqual.o
38:13.50 testMappedArrayBuffer.o
38:16.42 testNewObject.o
38:17.09 testNullRoot.o
38:20.47 testOOM.o
38:20.63 testObjectEmulatingUndefined.o
38:21.82 testOps.o
38:22.14 testOriginPrincipals.o
38:22.24 testParseJSON.o
38:24.07 testPersistentRooted.o
38:24.40 testProfileStrings.o
38:24.43 testPropCache.o
38:27.10 testRegExp.o
38:27.18 testResolveRecursion.o
38:28.64 testSameValue.o
38:29.13 testScriptInfo.o
38:29.42 testScriptObject.o
38:30.78 testSetProperty.o
38:31.73 testSetPropertyIgnoringNamedGetter.o
38:31.93 testSourcePolicy.o
38:33.58 testStringBuffer.o
38:34.28 testStructuredClone.o
38:35.41 testSymbol.o
38:35.47 nptest.o
38:35.47 nptest_droid.o
38:36.70 nptest_utils.o
38:37.13 MediaEncoder.o
38:37.13 OpusTrackEncoder.o
38:37.80 nptest_name.o
38:38.25 GMPChild.o
38:38.25 GMPParent.o
38:38.90 TrackEncoder.o
38:39.10 testToIntWidth.o
38:39.89 GMPPlatform.o
38:40.50 testTrap.o
38:42.34 testTypedArrays.o
38:42.52 GMPProcessChild.o
38:42.79 MediaSource.o
38:42.79 MediaSourceDecoder.o
38:43.43 GMPProcessParent.o
38:44.94 GMPService.o
38:45.18 testUTF8.o
38:46.01 GMPSharedMemManager.o
38:46.64 SourceBuffer.o
38:48.31 GMPVideoDecoderChild.o
38:49.50 GMPVideoDecoderParent.o
38:49.86 testUncaughtError.o
38:50.90 GMPVideoEncodedFrameImpl.o
38:51.04 SourceBufferList.o
38:51.25 GMPVideoEncoderChild.o
38:52.19 testWeakMap.o
38:52.50 testXDR.o
38:52.57 GMPVideoEncoderParent.o
38:53.89 SourceBufferResource.o
38:53.94 tests.o
38:54.05 GMPVideoHost.o
38:54.77 GMPVideoPlaneImpl.o
38:55.85 OggCodecState.o
38:55.85 OggDecoder.o
38:55.97 GMPVideoi420FrameImpl.o
38:56.66 AnalyserNode.o
38:56.66 AudioBuffer.o
38:58.45 RawDecoder.o
38:58.45 RawReader.o
38:59.78 AudioBufferSourceNode.o
39:00.64 OggReader.o
39:02.07 AudioContext.o
39:02.38 AudioDestinationNode.o
39:02.69 WaveDecoder.o
39:02.69 WaveReader.o
39:04.24 OggWriter.o
39:05.26 AudioListener.o
39:07.33 AudioNode.o
39:08.58 WebMBufferedParser.o
39:08.58 WebMDecoder.o
39:09.00 OpusParser.o
39:09.33 WebMReader.o
39:09.92 AudioParam.o
39:10.58 AndroidMediaDecoder.o
39:10.58 AndroidMediaPluginHost.o
39:11.07 AndroidMediaReader.o
39:12.12 AndroidMediaResourceServer.o
39:12.94 AudioProcessingEvent.o
39:14.97 MediaEngineDefault.o
39:14.97 PeerIdentity.o
39:15.47 BiquadFilterNode.o
39:15.57 SpeechSynthesis.o
39:15.57 SpeechSynthesisUtterance.o
39:15.75 ChannelMergerNode.o
39:17.89 ChannelSplitterNode.o
39:18.92 SpeechGrammar.o
39:18.92 SpeechGrammarList.o
39:18.95 SpeechRecognition.o
39:19.48 ConvolverNode.o
39:19.49 SpeechRecognitionAlternative.o
39:20.01 SpeechSynthesisVoice.o
39:20.45 DelayBuffer.o
39:22.07 SpeechSynthesisChild.o
39:22.32 DelayNode.o
39:23.62 SpeechSynthesisParent.o
39:24.16 SpeechRecognitionResult.o
39:24.40 SpeechRecognitionResultList.o
39:25.02 DynamicsCompressorNode.o
39:26.62 nsSpeechTask.o
39:26.78 CDMProxy.o
39:26.78 EMELog.o
39:27.03 SpeechStreamListener.o
39:27.99 FFTBlock.o
39:28.95 MediaKeyError.o
39:29.14 MediaKeyMessageEvent.o
39:29.47 nsSynthVoiceRegistry.o
39:29.70 endpointer.o
39:30.11 MediaKeyNeededEvent.o
39:30.95 GainNode.o
39:31.50 MediaKeySession.o
39:32.36 energy_endpointer.o
39:32.96 energy_endpointer_params.o
39:33.40 MediaKeys.o
39:33.43 FakeSpeechRecognitionService.o
39:33.55 MediaBufferDecoder.o
39:36.33 MediaElementAudioSourceNode.o
39:37.05 TestAudioCompactor.o
39:37.05 TestTrackEncoder.o
39:37.26 MediaStreamAudioDestinationNode.o
39:39.23 /opt/FirefoxSource/mozilla-release/content/media/webaudio/MediaBufferDecoder.cpp: In member function 'void mozilla::WebAudioDecodeJob::OnFailure(mozilla::WebAudioDecodeJob::ErrorCode)':
39:39.23 Warning: -Wmaybe-uninitialized in /opt/FirefoxSource/mozilla-release/content/media/webaudio/MediaBufferDecoder.cpp: 'errorMessage' may be used uninitialized in this function
39:39.23 /opt/FirefoxSource/mozilla-release/content/media/webaudio/MediaBufferDecoder.cpp:583:48: warning: 'errorMessage' may be used uninitialized in this function [-Wmaybe-uninitialized]
39:39.25 TestAudioMixer.o
39:39.61 TestVideoSegment.o
39:39.74 MediaStreamAudioSourceNode.o
39:39.76 OfflineAudioCompletionEvent.o
39:40.23 TestTXMgr.o
39:42.47 OscillatorNode.o
39:42.71 PannerNode.o
39:42.91 PeriodicWave.o
39:44.34 ScriptProcessorNode.o
39:44.50 host_ListCSSProperties.o
39:44.87 nsTreeBodyFrame.o
39:44.87 nsTreeBoxObject.o
39:45.94 ThreeDPoint.o
39:46.23 WaveShaperNode.o
39:46.61 WebAudioUtils.o
39:49.13 nsGrid.o
39:49.13 nsGridCell.o
39:49.36 nsGridLayout2.o
39:49.66 JSStreamWriterTest.o
39:49.66 LulTest.o
39:51.45 ThreadProfileTest.o
39:51.47 nsGridRow.o
39:52.75 /opt/FirefoxSource/mozilla-release/layout/xul/tree/nsTreeBodyFrame.cpp: In member function 'void nsTreeBodyFrame::PaintCell(int32_t, nsTreeColumn*, const nsRect&, nsPresContext*, nsRenderingContext&, const nsRect&, nscoord&, nsPoint)':
39:52.75 Warning: -Wmaybe-uninitialized in /opt/FirefoxSource/mozilla-release/layout/xul/tree/nsTreeBodyFrame.cpp: 'color' may be used uninitialized in this function
39:52.75 /opt/FirefoxSource/mozilla-release/layout/xul/tree/nsTreeBodyFrame.cpp:3209:40: warning: 'color' may be used uninitialized in this function [-Wmaybe-uninitialized]
39:52.76 nsTreeColFrame.o
39:53.06 nsGridRowGroupFrame.o
39:53.25 jsctypes-test-errno.o
39:53.25 jsctypes-test-finalizer.o
39:53.38 jsctypes-test.o
39:53.60 nsGridRowGroupLayout.o
39:54.33 TestStartupCache.o
39:55.03 nsGridRowLayout.o
39:55.28 StaticXULComponentsEnd.o
39:55.44 nsTreeColumns.o
39:55.86 nsGridRowLeafFrame.o
39:56.08 In file included from /opt/FirefoxSource/mozilla-release/layout/xul/tree/../nsBox.h:10:0,
39:56.08                  from /opt/FirefoxSource/mozilla-release/layout/xul/tree/../../generic/nsFrame.h:14,
39:56.08                  from /opt/FirefoxSource/mozilla-release/layout/xul/tree/../../generic/nsLeafFrame.h:12,
39:56.08                  from /opt/FirefoxSource/mozilla-release/layout/xul/tree/../nsLeafBoxFrame.h:9,
39:56.08                  from /opt/FirefoxSource/mozilla-release/layout/xul/tree/nsTreeBodyFrame.h:11,
39:56.08                  from /opt/FirefoxSource/mozilla-release/layout/xul/tree/nsTreeBoxObject.cpp:15:
39:56.08 /opt/FirefoxSource/mozilla-release/layout/xul/tree/../../generic/nsIFrame.h: In member function 'nsTreeBodyFrame* nsTreeBoxObject::GetTreeBody(bool)':
39:56.08 Warning: -Wmaybe-uninitialized in /opt/FirefoxSource/mozilla-release/layout/generic/nsIFrame.h: 'frame' may be used uninitialized in this function
39:56.08 /opt/FirefoxSource/mozilla-release/layout/xul/tree/../../generic/nsIFrame.h:487:43: warning: 'frame' may be used uninitialized in this function [-Wmaybe-uninitialized]
39:56.08 /opt/FirefoxSource/mozilla-release/layout/xul/tree/nsTreeBoxObject.cpp:87:13: note: 'frame' was declared here
39:56.08 nsTreeContentView.o
39:57.28 nsGridRowLeafLayout.o
39:58.80 nsTreeImageListener.o
39:59.51 nsTreeSelection.o
39:59.88 nsTreeStyleCache.o
40:00.22 nsTreeUtils.o
40:02.58 nssgtest.o
40:02.59 pkixbuild_tests.o
40:02.60 pkixtestutil.o
40:03.04 pkixcert_extension_tests.o
40:03.22 Biquad.o
40:03.22 DirectConvolver.o
40:03.45 DynamicsCompressor.o
40:03.76 DynamicsCompressorKernel.o
40:03.90 FFTConvolver.o
40:04.22 TestAudioEventTimeline.o
40:04.48 HRTFDatabase.o
40:05.02 pkixcert_signature_algorithm_tests.o
40:05.93 HRTFDatabaseLoader.o
40:06.40 pkixcheck_CheckKeyUsage_tests.o
40:06.78 pkixcheck_CheckValidity_tests.o
40:07.04 HRTFElevation.o
40:08.64 HRTFKernel.o
40:08.76 pkixder_input_tests.o
40:08.84 pkixder_pki_types_tests.o
40:09.81 HRTFPanner.o
40:10.47 pkixder_universal_types_tests.o
40:11.81 PeriodicWave.o
40:12.44 Reverb.o
40:13.35 pkixocsp_CreateEncodedOCSPRequest_tests.o
40:13.83 ReverbAccumulationBuffer.o
40:14.60 ReverbConvolver.o
40:15.19 pkixocsp_VerifyEncodedOCSPResponse.o
40:16.75 ReverbConvolverStage.o
40:17.10 ReverbInputBuffer.o
40:17.45 ZeroPole.o
40:24.16 libstlport_static.a
40:25.24 annotationProcessors.jar
40:27.01 Note: /opt/FirefoxSource/mozilla-release/build/annotationProcessors/utils/GeneratableElementIterator.java uses unchecked or unsafe operations.
40:27.01 Note: Recompile with -Xlint:unchecked for details.
40:27.58 libmfbt.a.desc
40:27.69 TestArrayUtils
40:27.70 TestAtomics
40:27.70 TestBinarySearch
40:27.70 TestBloomFilter
40:27.70 TestCasting
40:28.15 TestCeilingFloor
40:28.15 TestCheckedInt
40:28.15 TestCountPopulation
40:28.15 TestCountZeroes
40:28.27 TestEndian
40:28.27 TestEnumSet
40:28.28 TestFloatingPoint
40:28.29 TestIntegerPrintfMacros
40:28.38 TestMacroArgs
40:28.38 TestMacroForEach
40:28.39 TestPair
40:28.41 TestRollingMean
40:28.49 TestSHA1
40:28.49 TestTypedEnum
40:28.50 TestTypeTraits
40:28.52 TestUniquePtr
40:28.60 TestWeakPtr
40:28.60 TestPoisonArea
40:28.93 libother-licenses_android.a.desc
40:29.01 libjemalloc.a.desc
40:29.08 libmemory.a.desc
40:29.17 liblinker.a.desc
40:29.18 szip
40:29.44 libmozglue_android.a.desc
40:29.52 libmozglue.so
40:31.41 TestZip
40:31.56 libmozalloc.so
40:32.24 libmozsqlite3.a.desc
40:32.35 libmedia_libjpeg.a.desc
40:32.45 libmedia_libtremor_lib.a.desc
40:32.62 libmedia_libopus.a.desc
40:32.79 libmedia_libnestegg_src.a.desc
40:32.99 libmedia_libvpx.a.desc
40:33.23 libmozpng.a.desc
40:33.32 libmedia_kiss_fft.a.desc
40:33.40 libcubeb.a.desc
40:33.50 libmedia_libogg.a.desc
40:33.58 libmedia_libtheora_lib.a.desc
40:33.66 libspeex.a.desc
40:33.81 libmedia_libstagefright.a.desc
40:33.92 libmedia_libsoundtouch_src.a.desc
40:34.11 /opt/FirefoxSource/mozilla-release/security/build/nss.def: WARNING: no preprocessor directives found
40:34.15 /opt/FirefoxSource/mozilla-release/security/build/nspr-dummy.def: WARNING: no preprocessor directives found
40:34.30 sechash.c: In function 'HASH_ResultLen':
40:34.30 sechash.c:263:5: warning: comparison of unsigned expression < 0 is always false [-Wtype-limits]
40:34.30 sechash.c: In function 'HASH_HashBuf':
40:34.30 sechash.c:288:5: warning: comparison of unsigned expression < 0 is always false [-Wtype-limits]
40:34.30 sechash.c: In function 'HASH_Create':
40:34.30 sechash.c:310:5: warning: comparison of unsigned expression < 0 is always false [-Wtype-limits]
40:34.34 quickder.c: In function 'DecodeItem':
40:34.34 quickder.c:611:12: warning: variable 'optional' set but not used [-Wunused-but-set-variable]
40:34.63 derenc.c: In function 'der_encode':
40:34.63 derenc.c:282:22: warning: variable 'optional' set but not used [-Wunused-but-set-variable]
40:35.31 nssb64e.c: In function 'NSSBase64_EncodeItem_Util':
40:35.31 nssb64e.c:684:15: warning: 'out_len' may be used uninitialized in this function [-Wmaybe-uninitialized]
40:35.54 ocsp.c: In function 'ocsp_RemoveCacheItem':
40:35.54 ocsp.c:562:12: warning: variable 'couldRemoveFromHashTable' set but not used [-Wunused-but-set-variable]
40:35.60 certhigh.c: In function 'CERT_MatchNickname':
40:35.60 certhigh.c:28:9: warning: variable 'len' set but not used [-Wunused-but-set-variable]
40:35.83 pk11akey.c: In function 'pk11_get_Decoded_ECPoint':
40:35.83 pk11akey.c:406:26: warning: comparison between signed and unsigned integer expressions [-Wsign-compare]
40:35.83 pk11akey.c:420:63: warning: comparison between signed and unsigned integer expressions [-Wsign-compare]
40:36.37 certvfypkix.c: In function 'setRevocationMethod':
40:36.37 certvfypkix.c:1422:17: warning: comparison between signed and unsigned integer expressions [-Wsign-compare]
40:36.63 pk11cert.c: In function 'pk11_fastCert':
40:36.63 pk11cert.c:231:14: warning: variable 'status' set but not used [-Wunused-but-set-variable]
40:36.63 pk11cert.c: In function 'PK11_MakeCertFromHandle':
40:36.63 pk11cert.c:297:12: warning: variable 'swapNickname' set but not used [-Wunused-but-set-variable]
40:36.63 pk11cert.c:296:12: warning: variable 'isFortezzaRootCA' set but not used [-Wunused-but-set-variable]
40:36.63 pk11cert.c: In function 'PK11_TraverseCertsForNicknameInSlot':
40:36.63 pk11cert.c:2012:28: warning: variable 'pk11cb' set but not used [-Wunused-but-set-variable]
40:36.63 pk11cert.c: In function 'PK11_FindCertFromDERCertItem':
40:36.63 pk11cert.c:2156:21: warning: unused variable 'td' [-Wunused-variable]
40:36.82 alg1485.c: In function 'cert_AVAOidTagToMaxLen':
40:36.82 alg1485.c:162:57: warning: signed and unsigned type in conditional expression [-Wsign-compare]
40:36.82 alg1485.c: In function 'AppendAVA':
40:36.82 alg1485.c:963:40: warning: signed and unsigned type in conditional expression [-Wsign-compare]
40:37.01 certificate.c: In function 'nssCertificateList_DoCallback':
40:37.01 certificate.c:898:14: warning: variable 'nssrv' set but not used [-Wunused-but-set-variable]
40:37.11 secoid.c: In function 'SECOID_Init':
40:37.11 secoid.c:1922:19: warning: variable 'c' set but not used [-Wunused-but-set-variable]
40:37.58 certdb.c: In function 'cert_VerifySubjectAltName':
40:37.58 certdb.c:1428:18: warning: variable 'hnLen' set but not used [-Wunused-but-set-variable]
40:37.58 certdb.c: In function 'CERT_ImportCerts':
40:37.58 certdb.c:2440:15: warning: variable 'rv' set but not used [-Wunused-but-set-variable]
40:37.58 certdb.c: In function 'CERT_UnlockCertRefCount':
40:37.58 certdb.c:2890:14: warning: variable 'prstat' set but not used [-Wunused-but-set-variable]
40:37.58 certdb.c: In function 'CERT_UnlockCertTrust':
40:37.58 certdb.c:2970:14: warning: variable 'prstat' set but not used [-Wunused-but-set-variable]
40:37.77 trustdomain.c: In function 'NSSTrustDomain_TraverseCertificates':
40:37.77 trustdomain.c:998:14: warning: variable 'status' set but not used [-Wunused-but-set-variable]
40:37.86 utilmod.c: In function 'nssutil_DeleteSecmodDBEntry.isra.1':
40:37.86 utilmod.c:545:12: warning: 'lib_len' may be used uninitialized in this function [-Wmaybe-uninitialized]
40:38.09 tdcache.c: In function 'add_cert_to_cache':
40:38.09 tdcache.c:773:9: warning: variable 'handle' set but not used [-Wunused-but-set-variable]
40:38.09 tdcache.c: In function 'nssTrustDomain_RemoveCertFromCacheLOCKED':
40:38.09 tdcache.c:272:16: warning: 'nickname' may be used uninitialized in this function [-Wmaybe-uninitialized]
40:38.09 tdcache.c:332:14: note: 'nickname' was declared here
40:38.23 utilpars.c: In function 'nssutil_mkSlotFlags':
40:38.23 utilpars.c:679:17: warning: comparison between signed and unsigned integer expressions [-Wsign-compare]
40:38.23 utilpars.c: In function 'nssutil_mkCipherFlags':
40:38.23 utilpars.c:891:17: warning: comparison between signed and unsigned integer expressions [-Wsign-compare]
40:38.23 utilpars.c:910:17: warning: comparison between signed and unsigned integer expressions [-Wsign-compare]
40:38.58 crl.c: In function 'crl_storeCRL':
40:38.58 crl.c:630:15: warning: variable 'rv' set but not used [-Wunused-but-set-variable]
40:38.58 crl.c: In function 'cert_CheckCertRevocationStatus':
40:38.58 crl.c:2688:27: warning: unused variable 'rv2' [-Wunused-variable]
40:38.58 crl.c: In function 'cert_CacheCRLByGeneralName':
40:38.58 crl.c:3045:32: warning: variable 'rv2' set but not used [-Wunused-but-set-variable]
40:38.65 In file included from pk11load.c:26:0:
40:38.65 debug_module.c: In function 'log_handle':
40:38.65 debug_module.c:339:28: warning: comparison between signed and unsigned integer expressions [-Wsign-compare]
40:38.65 debug_module.c:343:28: warning: comparison between signed and unsigned integer expressions [-Wsign-compare]
40:38.65 pk11load.c: In function 'SECMOD_UnloadModule':
40:38.65 pk11load.c:592:28: warning: unused variable 'status' [-Wunused-variable]
40:38.66 pkibase.c: In function 'nssPKIObjectCollection_Traverse':
40:38.66 pkibase.c:906:14: warning: variable 'status' set but not used [-Wunused-but-set-variable]
40:38.66 pkibase.c: In function 'nssCertificateCollection_Create':
40:38.66 pkibase.c:1060:14: warning: variable 'status' set but not used [-Wunused-but-set-variable]
40:38.66 pkibase.c: In function 'nssCRLCollection_Create':
40:38.66 pkibase.c:1167:14: warning: variable 'status' set but not used [-Wunused-but-set-variable]
40:39.12 pki3hack.c: In function 'DeleteCertTrustMatchingSlot':
40:39.12 pki3hack.c:1275:27: warning: comparison between signed and unsigned integer expressions [-Wsign-compare]
40:39.12 pki3hack.c: In function 'STAN_DeleteCertTrustMatchingSlot':
40:39.12 pki3hack.c:1333:19: warning: comparison between signed and unsigned integer expressions [-Wsign-compare]
40:39.26 pk11merge.c: In function 'pk11_matchAcrossTokens':
40:39.26 pk11merge.c:100:32: warning: comparison between signed and unsigned integer expressions [-Wsign-compare]
40:39.32 devtoken.c: In function 'nssToken_TraverseCertificates':
40:39.32 devtoken.c:1469:14: warning: variable 'status' set but not used [-Wunused-but-set-variable]
40:39.86 ckhelper.c: In function 'nssCKObject_GetAttributes':
40:39.86 ckhelper.c:139:36: warning: comparison between signed and unsigned integer expressions [-Wsign-compare]
40:39.86 ckhelper.c: In function 'nssCryptokiTrust_GetAttributes':
40:39.86 ckhelper.c:442:36: warning: comparison between signed and unsigned integer expressions [-Wsign-compare]
40:40.14 list.c: In function 'nssList_Add':
40:40.14 list.c:220:14: warning: variable 'nssrv' set but not used [-Wunused-but-set-variable]
40:40.23 pk11obj.c: In function 'PK11_MatchItem':
40:40.23 pk11obj.c:1799:72: warning: comparison between signed and unsigned integer expressions [-Wsign-compare]
40:40.23 pk11obj.c:1784:22: warning: variable 'parent' set but not used [-Wunused-but-set-variable]
40:40.39 pk11pars.c: In function 'secmod_ParseModuleSpecForTokens':
40:40.39 pk11pars.c:364:47: warning: suggest braces around empty body in an 'else' statement [-Wempty-body]
40:40.39 pk11pars.c:366:47: warning: suggest braces around empty body in an 'else' statement [-Wempty-body]
40:40.39 pk11pars.c:375:6: warning: suggest braces around empty body in an 'else' statement [-Wempty-body]
40:40.39 pk11pars.c:384:7: warning: suggest braces around empty body in an 'else' statement [-Wempty-body]
40:40.39 pk11pars.c:393:7: warning: suggest braces around empty body in an 'else' statement [-Wempty-body]
40:40.39 pk11pars.c:402:7: warning: suggest braces around empty body in an 'else' statement [-Wempty-body]
40:40.39 pk11pars.c: In function 'secmod_MkAppendTokensList':
40:40.39 pk11pars.c:767:13: warning: comparison between signed and unsigned integer expressions [-Wsign-compare]
40:40.39 pk11pars.c:804:13: warning: comparison between signed and unsigned integer expressions [-Wsign-compare]
40:40.94 pk11pk12.c: In function 'PK11_ImportPrivateKeyInfoAndReturnKey':
40:40.94 pk11pk12.c:425:17: warning: variable 'keyType' set but not used [-Wunused-but-set-variable]
40:41.04 pk11pqg.c: In function 'PK11_PQG_ParamGenSeedLen':
40:41.04 pk11pqg.c:230:56: warning: signed and unsigned type in conditional expression [-Wsign-compare]
40:41.04 pk11pqg.c: In function 'PK11_PQG_ParamGen':
40:41.04 pk11pqg.c:241:56: warning: signed and unsigned type in conditional expression [-Wsign-compare]
40:41.04 pk11pqg.c: In function 'PK11_PQG_VerifyParams':
40:41.04 pk11pqg.c:295:19: warning: comparison between signed and unsigned integer expressions [-Wsign-compare]
40:41.76 pk11util.c: In function 'SECMOD_UpdateSlotList':
40:41.76 pk11util.c:931:15: warning: comparison between signed and unsigned integer expressions [-Wsign-compare]
40:41.79 pkix_revocationchecker.c: In function 'PKIX_RevocationChecker_Check':
40:41.79 pkix_revocationchecker.c:347:25: warning: comparison between signed and unsigned integer expressions [-Wsign-compare]
40:41.83 pk11skey.c: In function 'pk11_TokenKeyGenWithFlagsAndKeyType':
40:41.83 pk11skey.c:926:17: warning: comparison between signed and unsigned integer expressions [-Wsign-compare]
40:41.83 pk11skey.c: In function 'pk11_HandUnwrap':
40:41.83 pk11skey.c:2296:40: warning: signed and unsigned type in conditional expression [-Wsign-compare]
40:42.02 pk11slot.c: In function 'PK11_InitToken':
40:42.02 pk11slot.c:1108:11: warning: variable 'tmp' set but not used [-Wunused-but-set-variable]
40:42.02 pk11slot.c: In function 'PK11_InitSlot':
40:42.02 pk11slot.c:1352:11: warning: variable 'tmp' set but not used [-Wunused-but-set-variable]
40:42.02 pk11slot.c: In function 'PK11_GetBestSlotMultipleWithAttributes':
40:42.02 pk11slot.c:2076:17: warning: comparison between signed and unsigned integer expressions [-Wsign-compare]
40:42.02 pk11slot.c:2094:18: warning: comparison between signed and unsigned integer expressions [-Wsign-compare]
40:42.02 pk11slot.c: In function 'PK11_ResetToken':
40:42.02 pk11slot.c:2317:22: warning: comparison between signed and unsigned integer expressions [-Wsign-compare]
40:42.02 pk11slot.c:2322:22: warning: comparison between signed and unsigned integer expressions [-Wsign-compare]
40:43.42 pkix_tools.c: In function 'pkix_i2hex':
40:43.42 pkix_tools.c:482:9: warning: comparison is always true due to limited range of data type [-Wtype-limits]
40:45.01 pkix_errpaths.c: In function 'PKIX_DoReturn':
40:45.01 pkix_errpaths.c:58:2: warning: suggest braces around empty body in an 'if' statement [-Wempty-body]
40:45.53 pkix_pl_cert.c: In function 'PKIX_PL_Cert_Create':
40:45.54 pkix_pl_cert.c:1518:22: warning: variable 'copyDER' set but not used [-Wunused-but-set-variable]
40:45.56 pkix_build.c: In function 'pkix_Build_SelectCertsFromTrustAnchors':
40:45.56 pkix_build.c:1541:38: warning: comparison between signed and unsigned integer expressions [-Wsign-compare]
40:45.80 pkix_pl_lifecycle.c: In function 'pkix_pl_lifecycle_ObjectLeakCheck':
40:45.80 pkix_pl_lifecycle.c:87:55: warning: comparison between signed and unsigned integer expressions [-Wsign-compare]
40:45.80 pkix_pl_lifecycle.c: In function 'PKIX_PL_Shutdown':
40:45.80 pkix_pl_lifecycle.c:248:21: warning: variable 'numLeakedObjects' set but not used [-Wunused-but-set-variable]
40:46.13 nssinit.c: In function 'NSS_VersionCheck':
40:46.13 nssinit.c:1250:19: warning: variable 'c' set but not used [-Wunused-but-set-variable]
40:46.87 pkix_pl_object.c: In function 'pkix_pl_Object_GetHeader':
40:46.87 pkix_pl_object.c:115:34: warning: comparison between signed and unsigned integer expressions [-Wsign-compare]
40:46.91 pkix_pl_crl.c: In function 'pkix_pl_CRL_ToString':
40:46.91 pkix_pl_crl.c:455:58: warning: 'crlVersion' may be used uninitialized in this function [-Wmaybe-uninitialized]
40:46.91 pkix_pl_crl.c:354:21: note: 'crlVersion' was declared here
40:47.01 pkix_pl_httpdefaultclient.c: In function 'pkix_pl_HttpDefaultClient_HdrCheckComplete':
40:47.01 pkix_pl_httpdefaultclient.c:268:32: warning: comparison between signed and unsigned integer expressions [-Wsign-compare]
40:47.01 pkix_pl_httpdefaultclient.c:285:41: warning: comparison between signed and unsigned integer expressions [-Wsign-compare]
40:47.01 pkix_pl_httpdefaultclient.c:293:40: warning: comparison between signed and unsigned integer expressions [-Wsign-compare]
40:47.01 pkix_pl_httpdefaultclient.c: In function 'pkix_pl_HttpDefaultClient_RecvBody':
40:47.01 pkix_pl_httpdefaultclient.c:925:39: warning: comparison between signed and unsigned integer expressions [-Wsign-compare]
40:47.01 pkix_pl_httpdefaultclient.c:940:31: warning: comparison between signed and unsigned integer expressions [-Wsign-compare]
40:47.01 pkix_pl_httpdefaultclient.c:945:31: warning: comparison between signed and unsigned integer expressions [-Wsign-compare]
40:47.01 pkix_pl_httpdefaultclient.c:951:38: warning: comparison between signed and unsigned integer expressions [-Wsign-compare]
40:47.01 pkix_pl_httpdefaultclient.c:995:39: warning: comparison between signed and unsigned integer expressions [-Wsign-compare]
40:47.01 pkix_pl_httpdefaultclient.c:1005:43: warning: comparison between signed and unsigned integer expressions [-Wsign-compare]
40:47.01 pkix_pl_httpdefaultclient.c: In function 'pkix_pl_HttpDefaultClient_KeepAliveSession':
40:47.01 pkix_pl_httpdefaultclient.c:1135:36: warning: variable 'client' set but not used [-Wunused-but-set-variable]
40:47.01 pkix_pl_httpdefaultclient.c: In function 'pkix_pl_HttpDefaultClient_TrySendAndReceive':
40:47.01 pkix_pl_httpdefaultclient.c:1429:63: warning: comparison between signed and unsigned integer expressions [-Wsign-compare]
40:47.01 pkix_pl_httpdefaultclient.c: In function 'pkix_pl_HttpDefaultClient_Cancel':
40:47.01 pkix_pl_httpdefaultclient.c:1487:36: warning: variable 'client' set but not used [-Wunused-but-set-variable]
40:47.07 dtlscon.c: In function 'ssl3_DisableNonDTLSSuites':
40:47.07 dtlscon.c:107:19: warning: unused variable 'rv' [-Wunused-variable]
40:47.07 dtlscon.c: In function 'dtls_HandleHandshake':
40:47.07 dtlscon.c:399:37: warning: comparison between signed and unsigned integer expressions [-Wsign-compare]
40:47.07 dtlscon.c:428:48: warning: comparison between signed and unsigned integer expressions [-Wsign-compare]
40:47.07 dtlscon.c: In function 'dtls_TransmitMessageFlight':
40:47.07 dtlscon.c:679:60: warning: comparison between signed and unsigned integer expressions [-Wsign-compare]
40:47.07 dtlscon.c:679:120: warning: signed and unsigned type in conditional expression [-Wsign-compare]
40:47.07 dtlscon.c:717:26: warning: comparison between signed and unsigned integer expressions [-Wsign-compare]
40:47.07 dtlscon.c: In function 'dtls_SetMTU':
40:47.07 dtlscon.c:952:19: warning: comparison between signed and unsigned integer expressions [-Wsign-compare]
40:48.21 ssl3gthr.c: In function 'ssl3_GatherData':
40:48.21 ssl3gthr.c:75:9: warning: comparison between signed and unsigned integer expressions [-Wsign-compare]
40:48.23 pkix_pl_ldaprequest.c: In function 'pkix_pl_LdapRequest_Destroy':
40:48.23 pkix_pl_ldaprequest.c:266:30: warning: variable 'ldapRq' set but not used [-Wunused-but-set-variable]
40:48.94 pkix_pl_ldapdefaultclient.c: In function 'pkix_pl_LdapDefaultClient_VerifyBindResponse':
40:48.94 pkix_pl_ldapdefaultclient.c:371:21: warning: '*((void *)&msg+16).resultCode.data' may be used uninitialized in this function [-Wmaybe-uninitialized]
40:48.94 pkix_pl_ldapdefaultclient.c:354:21: note: '*((void *)&msg+16).resultCode.data' was declared here
40:49.46 pkix_pl_publickey.c: In function 'pkix_pl_PublicKey_Hashcode':
40:49.46 pkix_pl_publickey.c:214:21: warning: variable 'fullHash' set but not used [-Wunused-but-set-variable]
40:49.51 pkix_pl_pk11certstore.c: In function 'NameCacheHasFetchedCrlInfo':
40:49.51 pkix_pl_pk11certstore.c:382:22: warning: variable 'cert' set but not used [-Wunused-but-set-variable]
40:49.51 pkix_pl_pk11certstore.c: In function 'RemovePartitionedDpsFromList':
40:49.51 pkix_pl_pk11certstore.c:701:20: warning: comparison between signed and unsigned integer expressions [-Wsign-compare]
40:49.51 pkix_pl_pk11certstore.c: In function 'DownloadCrl':
40:49.51 pkix_pl_pk11certstore.c:782:16: warning: variable 'savedError' set but not used [-Wunused-but-set-variable]
40:49.72 ssl3con.c: In function 'ssl3_CompressMACEncryptRecord':
40:49.72 ssl3con.c:2559:12: warning: comparison between signed and unsigned integer expressions [-Wsign-compare]
40:49.72 ssl3con.c: In function 'ssl3_FlushHandshakeMessages':
40:49.72 ssl3con.c:3122:19: warning: comparison between signed and unsigned integer expressions [-Wsign-compare]
40:49.72 ssl3con.c: In function 'ssl3_HandleClientHello':
40:49.72 ssl3con.c:7782:23: warning: comparison between signed and unsigned integer expressions [-Wsign-compare]
40:49.72 ssl3con.c:8286:28: warning: comparison between signed and unsigned integer expressions [-Wsign-compare]
40:49.72 ssl3con.c: In function 'ssl3_HandleRSAClientKeyExchange':
40:49.72 ssl3con.c:9211:13: warning: variable 'pmsItem' set but not used [-Wunused-but-set-variable]
40:49.72 ssl3con.c:9207:12: warning: variable 'isTLS' set but not used [-Wunused-but-set-variable]
40:49.72 ssl3con.c: In function 'ssl3_HandleCertificateStatus':
40:49.72 ssl3con.c:9779:13: warning: comparison between signed and unsigned integer expressions [-Wsign-compare]
40:49.72 ssl3con.c: In function 'ssl3_HandleHandshakeMessage':
40:49.72 ssl3con.c:6951:22: warning: 'preferSha1' may be used uninitialized in this function [-Wmaybe-uninitialized]
40:49.72 ssl3con.c:6917:12: note: 'preferSha1' was declared here
40:49.72 ssl3con.c: In function 'ssl3_HandleRecord':
40:49.72 ssl3con.c:11589:21: warning: 'dtls_seq_num' may be used uninitialized in this function [-Wmaybe-uninitialized]
40:49.72 ssl3con.c:11309:14: note: 'dtls_seq_num' was declared here
40:49.75 pkix_pl_x500name.c:37:1: warning: 'pkix_pl_X500Name_ToString_Helper' defined but not used [-Wunused-function]
40:49.91 sslauth.c: In function 'SSL_AuthCertificate':
40:49.91 sslauth.c:267:18: warning: unused variable 'error' [-Wunused-variable]
40:50.02 certread.c: In function 'CERT_DecodeCertPackage':
40:50.02 certread.c:419:16: warning: comparison between signed and unsigned integer expressions [-Wsign-compare]
40:50.02 certread.c:447:13: warning: comparison between signed and unsigned integer expressions [-Wsign-compare]
40:50.64 p12e.c: In function 'sec_PKCS12CreateSafeBag':
40:50.64 p12e.c:698:12: warning: variable 'setName' set but not used [-Wunused-but-set-variable]
40:50.64 p12e.c: In function 'sec_pkcs12_encoder_start_context':
40:50.64 p12e.c:1535:12: warning: variable 'rv' set but not used [-Wunused-but-set-variable]
40:50.72 sslcon.c: In function 'ssl2_SendClear':
40:50.72 sslcon.c:865:17: warning: comparison between signed and unsigned integer expressions [-Wsign-compare]
40:50.72 sslcon.c:894:19: warning: comparison between signed and unsigned integer expressions [-Wsign-compare]
40:50.72 sslcon.c: In function 'ssl2_SendStream':
40:50.72 sslcon.c:944:13: warning: comparison between signed and unsigned integer expressions [-Wsign-compare]
40:50.72 sslcon.c:991:19: warning: comparison between signed and unsigned integer expressions [-Wsign-compare]
40:50.72 sslcon.c: In function 'ssl2_SendBlock':
40:50.72 sslcon.c:1058:13: warning: comparison between signed and unsigned integer expressions [-Wsign-compare]
40:50.72 sslcon.c: In function 'ssl2_ServerSetupSessionCypher':
40:50.72 sslcon.c:1624:15: warning: comparison between signed and unsigned integer expressions [-Wsign-compare]
40:50.72 sslcon.c:1648:20: warning: comparison between signed and unsigned integer expressions [-Wsign-compare]
40:50.72 sslcon.c: In function 'ssl2_HandleMessage':
40:50.72 sslcon.c:2498:9: warning: variable 'rv2' set but not used [-Wunused-but-set-variable]
40:50.72 sslcon.c: In function 'ssl2_HandleServerHelloMessage':
40:50.72 sslcon.c:2802:51: warning: comparison between signed and unsigned integer expressions [-Wsign-compare]
40:50.72 sslcon.c:2813:16: warning: comparison between signed and unsigned integer expressions [-Wsign-compare]
40:50.72 sslcon.c:2815:23: warning: comparison between signed and unsigned integer expressions [-Wsign-compare]
40:50.73 sslcon.c:2815:65: warning: signed and unsigned type in conditional expression [-Wsign-compare]
40:50.73 sslcon.c: In function 'NSSSSL_VersionCheck':
40:50.73 sslcon.c:3687:19: warning: variable 'c' set but not used [-Wunused-but-set-variable]
40:50.82 cmscipher.c: In function 'NSS_CMSCipherContext_Decrypt':
40:50.82 cmscipher.c:525:28: warning: comparison between signed and unsigned integer expressions [-Wsign-compare]
40:50.88 p7decode.c: In function 'sec_pkcs7_verify_signature':
40:50.88 p7decode.c:1293:21: warning: variable 'crls' set but not used [-Wunused-but-set-variable]
40:51.15 p7encode.c: In function 'sec_pkcs7_encoder_start_encrypt':
40:51.15 p7encode.c:62:18: warning: variable 'wincx' set but not used [-Wunused-but-set-variable]
40:51.41 p7local.c: In function 'sec_PKCS7Decrypt':
40:51.41 p7local.c:556:28: warning: comparison between signed and unsigned integer expressions [-Wsign-compare]
40:51.65 cmsencode.c: In function 'nss_cms_encoder_notify':
40:51.65 cmsencode.c:125:18: warning: variable 'poolp' set but not used [-Wunused-but-set-variable]
40:51.65 cmsencode.c: In function 'nss_cms_before_data':
40:51.65 cmsencode.c:204:18: warning: variable 'poolp' set but not used [-Wunused-but-set-variable]
40:51.86 ssl3ext.c: In function 'arrayContainsExtension':
40:51.86 ssl3ext.c:310:19: warning: comparison between signed and unsigned integer expressions [-Wsign-compare]
40:51.86 ssl3ext.c: In function 'ssl3_HandleServerNameXtn':
40:51.86 ssl3ext.c:417:43: warning: comparison between signed and unsigned integer expressions [-Wsign-compare]
40:51.86 ssl3ext.c:425:17: warning: variable 'type' set but not used [-Wunused-but-set-variable]
40:51.86 ssl3ext.c:457:22: warning: comparison between signed and unsigned integer expressions [-Wsign-compare]
40:51.86 ssl3ext.c:458:31: warning: comparison between signed and unsigned integer expressions [-Wsign-compare]
40:51.86 ssl3ext.c: In function 'ssl3_SendSessionTicketXtn':
40:51.86 ssl3ext.c:538:28: warning: comparison between signed and unsigned integer expressions [-Wsign-compare]
40:51.86 ssl3ext.c:561:25: warning: comparison between signed and unsigned integer expressions [-Wsign-compare]
40:51.86 ssl3ext.c: In function 'ssl3_ServerHandleAppProtoXtn':
40:51.86 ssl3ext.c:681:15: warning: comparison between signed and unsigned integer expressions [-Wsign-compare]
40:51.86 ssl3ext.c: In function 'ssl3_ClientSendNextProtoNegoXtn':
40:51.86 ssl3ext.c:782:28: warning: comparison between signed and unsigned integer expressions [-Wsign-compare]
40:51.86 ssl3ext.c:792:25: warning: comparison between signed and unsigned integer expressions [-Wsign-compare]
40:51.86 ssl3ext.c: In function 'ssl3_ClientSendAppProtoXtn':
40:51.86 ssl3ext.c:817:28: warning: comparison between signed and unsigned integer expressions [-Wsign-compare]
40:51.86 ssl3ext.c:857:25: warning: comparison between signed and unsigned integer expressions [-Wsign-compare]
40:51.86 ssl3ext.c: In function 'ssl3_ServerSendAppProtoXtn':
40:51.86 ssl3ext.c:886:28: warning: comparison between signed and unsigned integer expressions [-Wsign-compare]
40:51.86 ssl3ext.c:905:25: warning: comparison between signed and unsigned integer expressions [-Wsign-compare]
40:51.86 ssl3ext.c: In function 'ssl3_ServerSendStatusRequestXtn':
40:51.86 ssl3ext.c:952:28: warning: comparison between signed and unsigned integer expressions [-Wsign-compare]
40:51.86 ssl3ext.c: In function 'ssl3_ClientSendStatusRequestXtn':
40:51.86 ssl3ext.c:985:28: warning: comparison between signed and unsigned integer expressions [-Wsign-compare]
40:51.86 ssl3ext.c:1013:25: warning: comparison between signed and unsigned integer expressions [-Wsign-compare]
40:51.86 ssl3ext.c: In function 'ssl3_SendNewSessionTicket':
40:51.86 ssl3ext.c:1249:19: warning: comparison between signed and unsigned integer expressions [-Wsign-compare]
40:51.86 ssl3ext.c: In function 'ssl3_ServerHandleSessionTicketXtn':
40:51.86 ssl3ext.c:1587:23: warning: comparison between signed and unsigned integer expressions [-Wsign-compare]
40:51.86 ssl3ext.c: In function 'ssl3_SendRenegotiationInfoXtn':
40:51.86 ssl3ext.c:1981:28: warning: comparison between signed and unsigned integer expressions [-Wsign-compare]
40:51.86 ssl3ext.c: In function 'ssl3_ClientSendSigAlgsXtn':
40:51.86 ssl3ext.c:2355:28: warning: comparison between signed and unsigned integer expressions [-Wsign-compare]
40:51.86 ssl3ext.c:2369:25: warning: comparison between signed and unsigned integer expressions [-Wsign-compare]
40:51.86 ssl3ext.c: In function 'ssl3_ClientSendDraftVersionXtn':
40:51.86 ssl3ext.c:2445:28: warning: comparison between signed and unsigned integer expressions [-Wsign-compare]
40:51.86 ssl3ext.c:2458:25: warning: comparison between signed and unsigned integer expressions [-Wsign-compare]
40:52.12 basicutil.c: In function 'SECU_PrintPRandOSError':
40:52.12 basicutil.c:628:30: warning: comparison between signed and unsigned integer expressions [-Wsign-compare]
40:52.12 basicutil.c:632:30: warning: comparison between signed and unsigned integer expressions [-Wsign-compare]
40:52.12 basicutil.c: In function 'SECU_SECItemHexStringToBinary':
40:52.12 basicutil.c:705:16: warning: comparison between signed and unsigned integer expressions [-Wsign-compare]
40:52.12 basicutil.c:716:16: warning: comparison between signed and unsigned integer expressions [-Wsign-compare]
40:52.12 basicutil.c: In function 'SECU_PrintAsHex':
40:52.12 basicutil.c:286:13: warning: 'column' may be used uninitialized in this function [-Wmaybe-uninitialized]
40:52.20 crmfpop.c: In function 'CRMF_CertReqMsgSetRAVerifiedPOP':
40:52.20 crmfpop.c:36:14: warning: variable 'dummy' set but not used [-Wunused-but-set-variable]
40:52.20 crmfpop.c: In function 'crmf_generic_encoder_callback':
40:52.20 crmfpop.c:119:38: warning: comparison between signed and unsigned integer expressions [-Wsign-compare]
40:52.20 crmfpop.c: In function 'crmf_encode_popoprivkey':
40:52.20 crmfpop.c:349:33: warning: comparison between signed and unsigned integer expressions [-Wsign-compare]
40:52.29 cmsrecinfo.c: In function 'NSS_CMSRecipientInfo_UnwrapBulkKey':
40:52.29 cmsrecinfo.c:529:21: warning: variable 'encalg' set but not used [-Wunused-but-set-variable]
40:52.69 sslsecur.c: In function 'SSL_ConfigSecureServerWithCertChain':
40:52.69 sslsecur.c:847:5: warning: comparison of unsigned expression < 0 is always false [-Wtype-limits]
40:52.69 sslsecur.c: In function 'ssl_SecureRecv':
40:52.69 sslsecur.c:1180:22: warning: variable 'sec' set but not used [-Wunused-but-set-variable]
40:52.85 crmfcont.c: In function 'CRMF_CreateEncryptedKeyWithEncryptedValue':
40:52.86 crmfcont.c:860:25: warning: variable 'dummy' set but not used [-Wunused-but-set-variable]
40:53.28 secutil.c: In function 'SECU_ChangePW2':
40:53.28 secutil.c:333:15: warning: variable 'rv' set but not used [-Wunused-but-set-variable]
40:53.28 secutil.c: In function 'SECU_PrintDumpDerIssuerAndSerial':
40:53.28 secutil.c:1551:19: warning: comparison between signed and unsigned integer expressions [-Wsign-compare]
40:53.28 secutil.c: In function 'secu_PrintPKCS7Signed':
40:53.28 secutil.c:2703:11: warning: passing argument 5 of 'SECU_PrintSignedData' from incompatible pointer type [enabled by default]
40:53.28 In file included from secutil.c:19:0:
40:53.28 secutil.h:260:12: note: expected 'SECU_PPFunc' but argument is of type 'int (*)(struct FILE *, const struct SECItem *, const char *, int)'
40:53.28 secutil.c: In function 'secu_PrintPKCS7SignedAndEnveloped':
40:53.28 secutil.c:2822:11: warning: passing argument 5 of 'SECU_PrintSignedData' from incompatible pointer type [enabled by default]
40:53.28 In file included from secutil.c:19:0:
40:53.28 secutil.h:260:12: note: expected 'SECU_PPFunc' but argument is of type 'int (*)(struct FILE *, const struct SECItem *, const char *, int)'
40:53.28 secutil.c: In function 'SEC_PrintCertificateAndTrust':
40:53.28 secutil.c:3152:10: warning: passing argument 5 of 'SECU_PrintSignedData' from incompatible pointer type [enabled by default]
40:53.28 secutil.c:3125:5: note: expected 'SECU_PPFunc' but argument is of type 'int (*)(struct FILE *, const struct SECItem *, const char *, int)'
40:53.28 secutil.c: In function 'SECU_StoreCRL':
40:53.28 secutil.c:3324:62: warning: comparison between signed and unsigned integer expressions [-Wsign-compare]
40:53.43 cmmfchal.c: In function 'cmmf_create_witness_and_challenge':
40:53.43 cmmfchal.c:33:22: warning: variable 'id' set but not used [-Wunused-but-set-variable]
40:53.63 derprint.c: In function 'prettyPrintLength':
40:53.63 derprint.c:454:20: warning: comparison between signed and unsigned integer expressions [-Wsign-compare]
40:53.72 smimeutil.c: In function 'NSSSMIME_VersionCheck':
40:53.72 smimeutil.c:770:19: warning: variable 'c' set but not used [-Wunused-but-set-variable]
40:53.72 smimeutil.c: In function 'NSS_SMIMEUtil_FindBulkAlgForRecipients':
40:53.72 smimeutil.c:446:9: warning: 'key_type' may be used uninitialized in this function [-Wmaybe-uninitialized]
40:53.72 smimeutil.c:425:14: note: 'key_type' was declared here
40:54.06 sslsock.c: In function 'ssl_WriteV':
40:54.06 sslsock.c:2524:30: warning: comparison between signed and unsigned integer expressions [-Wsign-compare]
40:54.06 sslsock.c:2537:68: warning: comparison between signed and unsigned integer expressions [-Wsign-compare]
40:54.06 sslsock.c:2556:28: warning: comparison between signed and unsigned integer expressions [-Wsign-compare]
40:54.06 sslsock.c:2556:59: warning: signed and unsigned type in conditional expression [-Wsign-compare]
40:54.06 sslsock.c:2559:23: warning: comparison between signed and unsigned integer expressions [-Wsign-compare]
40:54.06 sslsock.c:2565:56: warning: comparison between signed and unsigned integer expressions [-Wsign-compare]
40:54.32 sslinfo.c: In function 'SSL_DisableDefaultExportCipherSuites':
40:54.32 sslinfo.c:247:15: warning: variable 'rv' set but not used [-Wunused-but-set-variable]
40:54.32 sslinfo.c: In function 'SSL_DisableExportCipherSuites':
40:54.32 sslinfo.c:268:15: warning: variable 'rv' set but not used [-Wunused-but-set-variable]
40:54.49 jarsign.c: In function 'jar_create_pk7':
40:54.49 jarsign.c:174:11: warning: variable 'errstring' set but not used [-Wunused-but-set-variable]
40:54.55 jar.c: In function 'JAR_find_next':
40:54.55 jar.c:423:30: warning: comparison between signed and unsigned integer expressions [-Wsign-compare]
40:54.55 jar.c: In function 'jar_find_first_cert':
40:54.55 jar.c:462:24: warning: comparison between signed and unsigned integer expressions [-Wsign-compare]
40:54.65 ssl3ecc.c: In function 'ssl3_DisableECCSuites':
40:54.65 ssl3ecc.c:969:19: warning: unused variable 'rv' [-Wunused-variable]
40:54.65 ssl3ecc.c: In function 'ssl3_SendSupportedCurvesXtn':
40:54.65 ssl3ecc.c:1130:28: warning: comparison between signed and unsigned integer expressions [-Wsign-compare]
40:54.65 ssl3ecc.c: In function 'ssl3_HandleSupportedCurvesXtn':
40:54.65 ssl3ecc.c:1238:35: warning: comparison between signed and unsigned integer expressions [-Wsign-compare]
40:54.67 libnss3.so
40:54.78 jarfile.c: In function 'jar_physical_inflate':
40:54.78 jarfile.c:341:32: warning: comparison between signed and unsigned integer expressions [-Wsign-compare]
40:54.78 jarfile.c:356:38: warning: comparison between signed and unsigned integer expressions [-Wsign-compare]
40:54.78 jarfile.c: In function 'jar_extract_mf':
40:54.78 jarfile.c:578:14: warning: comparison between signed and unsigned integer expressions [-Wsign-compare]
40:54.78 jarfile.c: In function 'jar_listzip':
40:54.78 jarfile.c:702:47: warning: comparison between signed and unsigned integer expressions [-Wsign-compare]
40:54.78 jarfile.c:768:43: warning: comparison between signed and unsigned integer expressions [-Wsign-compare]
40:54.78 jarfile.c: In function 'jar_listtar':
40:54.78 jarfile.c:830:45: warning: comparison between signed and unsigned integer expressions [-Wsign-compare]
40:54.78 jarfile.c:824:12: warning: variable 'when' set but not used [-Wunused-but-set-variable]
40:54.79 jarfile.c:823:14: warning: variable 'mode' set but not used [-Wunused-but-set-variable]
40:55.94 shlibsign.c: In function 'writeItem':
40:55.94 shlibsign.c:150:22: warning: comparison between signed and unsigned integer expressions [-Wsign-compare]
40:55.94 shlibsign.c: In function 'main':
40:55.94 shlibsign.c:908:40: warning: comparison between signed and unsigned integer expressions [-Wsign-compare]
40:55.95 cd mangle; /usr/bin/make libs
40:56.60 loader.c: In function 'freebl_LoadDSO':
40:56.60 loader.c:135:14: warning: variable 'status' set but not used [-Wunused-but-set-variable]
40:56.60 loader.c: In function 'BL_Unload':
40:56.60 loader.c:904:20: warning: unused variable 'status' [-Wunused-variable]
40:56.61 pk12util.c: In function 'p12u_InitContext':
40:56.61 pk12util.c:104:12: warning: variable 'fileExist' set but not used [-Wunused-but-set-variable]
40:56.61 pk12util.c: In function 'P12U_ListPKCS12File':
40:56.61 pk12util.c:762:30: warning: passing argument 5 of 'SECU_PrintSignedData' from incompatible pointer type [enabled by default]
40:56.61 In file included from pk12util.c:11:0:
40:56.61 /opt/FirefoxSource/mozilla-release/objdir-droid/dist/private/nss/secutil.h:260:12: note: expected 'SECU_PPFunc' but argument is of type 'int (*)(struct FILE *, const struct SECItem *, const char *, int)'
40:56.64 mkdir: kann Verzeichnis „/opt/FirefoxSource/mozilla-release/objdir-droid/security/nss/lib/freebl“ nicht anlegen: Die Datei existiert bereits
40:56.80 ldvector.c: In function 'FREEBL_GetVector':
40:56.80 ldvector.c:301:19: warning: variable 'c' set but not used [-Wunused-but-set-variable]
40:56.86 keystuff.c: In function 'UpdateRNG':
40:56.86 keystuff.c:96:18: warning: comparison between signed and unsigned integer expressions [-Wsign-compare]
40:56.86 keystuff.c: In function 'CERTUTIL_GeneratePrivateKey':
40:56.86 keystuff.c:497:15: warning: variable 'algtag' set but not used [-Wunused-but-set-variable]
40:57.62 token.c: In function 'nssCKFWToken_GetUTCTime':
40:57.62 token.c:1261:27: warning: variable 'z' set but not used [-Wunused-but-set-variable]
40:57.75 pk11.c: In function 'ListModule':
40:57.75 pk11.c:612:16: warning: comparison between signed and unsigned integer expressions [-Wsign-compare]
40:57.93 ytab.c: In function 'Pk11Install_yyparse':
40:57.94 ytab.c:219:5: warning: suggest parentheses around assignment used as truth value [-Wparentheses]
40:58.21 rawhash.c: In function 'HASH_GetRawHashObject':
40:58.21 rawhash.c:156:5: warning: comparison of unsigned expression < 0 is always false [-Wtype-limits]
40:58.54 cd builtins; /usr/bin/make libs
40:58.61 lex.Pk11Install_yy.cpp:1060:13: warning: 'Pkcs11Install_yyunput' defined but not used [-Wunused-function]
40:58.61 lex.Pk11Install_yy.cpp:1106:12: warning: 'input' defined but not used [-Wunused-function]
40:58.82 bfind.c: In function 'builtins_attrmatch':
40:58.82 bfind.c:122:11: warning: comparison between signed and unsigned integer expressions [-Wsign-compare]
40:58.91 binst.c: In function 'builtins_mdInstance_GetLibraryVersion':
40:58.91 binst.c:70:17: warning: variable 'c' set but not used [-Wunused-but-set-variable]
40:59.01 sha512.c: In function 'SHA512_Compress':
40:59.01 sha512.c:933:14: warning: unused variable 't1' [-Wunused-variable]
40:59.01 sha512.c:955:18: warning: unused variable 't2' [-Wunused-variable]
40:59.01 sha512.c:955:14: warning: unused variable 't1' [-Wunused-variable]
40:59.01 sha512.c: In function 'SHA512_End':
40:59.01 sha512.c:1229:14: warning: unused variable 't1' [-Wunused-variable]
40:59.01 sha512.c: In function 'SHA512_EndRaw':
40:59.01 sha512.c:1274:14: warning: unused variable 't1' [-Wunused-variable]
40:59.24 cts.c: In function 'CTS_DecryptUpdate':
40:59.24 cts.c:226:23: warning: comparison between signed and unsigned integer expressions [-Wsign-compare]
40:59.43 gcm.c: In function 'gcm_getX':
40:59.43 gcm.c:223:13: warning: comparison between signed and unsigned integer expressions [-Wsign-compare]
40:59.79 dh.c: In function 'DH_Derive':
40:59.79 dh.c:271:13: warning: comparison between signed and unsigned integer expressions [-Wsign-compare]
40:59.84 ecdecode.c: In function 'gf_populate_params':
40:59.84 ecdecode.c:120:5: warning: comparison of unsigned expression < 0 is always false [-Wtype-limits]
40:59.99 ec.c: In function 'ec_points_mul':
40:59.99 ec.c:89:17: warning: comparison between signed and unsigned integer expressions [-Wsign-compare]
40:59.99 ec.c: In function 'EC_ValidatePublicKey':
40:59.99 ec.c:450:33: warning: comparison between signed and unsigned integer expressions [-Wsign-compare]
41:00.07 dsa.c: In function 'DSA_VerifyDigest':
41:00.07 dsa.c:518:25: warning: comparison between signed and unsigned integer expressions [-Wsign-compare]
41:00.07 dsa.c:530:27: warning: comparison between signed and unsigned integer expressions [-Wsign-compare]
41:00.37 pqg.c: In function 'makePrimefromPrimesShaweTaylor':
41:00.37 pqg.c:617:34: warning: comparison between signed and unsigned integer expressions [-Wsign-compare]
41:00.37 pqg.c:687:28: warning: comparison between signed and unsigned integer expressions [-Wsign-compare]
41:00.37 pqg.c: In function 'makePrimefromSeedShaweTaylor':
41:00.37 pqg.c:849:28: warning: comparison between signed and unsigned integer expressions [-Wsign-compare]
41:00.37 pqg.c: In function 'pqg_ParamGen':
41:00.37 pqg.c:1232:18: warning: variable 'b' set but not used [-Wunused-but-set-variable]
41:00.37 pqg.c: In function 'PQG_VerifyParams':
41:00.37 pqg.c:1614:50: warning: comparison between signed and unsigned integer expressions [-Wsign-compare]
41:00.37 pqg.c:1672:25: warning: comparison between signed and unsigned integer expressions [-Wsign-compare]
41:00.37 pqg.c:1708:18: warning: comparison between signed and unsigned integer expressions [-Wsign-compare]
41:00.37 pqg.c:1709:25: warning: comparison between signed and unsigned integer expressions [-Wsign-compare]
41:00.37 pqg.c:1710:33: warning: comparison between signed and unsigned integer expressions [-Wsign-compare]
41:00.37 pqg.c:1733:29: warning: comparison between signed and unsigned integer expressions [-Wsign-compare]
41:00.37 pqg.c:1775:27: warning: 'type' may be used uninitialized in this function [-Wmaybe-uninitialized]
41:00.37 pqg.c:1595:16: note: 'type' was declared here
41:00.37 pqg.c:1777:5: warning: 'hashtype' may be used uninitialized in this function [-Wmaybe-uninitialized]
41:00.37 pqg.c:1594:19: note: 'hashtype' was declared here
41:00.45 shvfy.c: In function 'readItem':
41:00.45 shvfy.c:267:19: warning: comparison between signed and unsigned integer expressions [-Wsign-compare]
41:00.47 rsa.c: In function 'RSA_NewKey':
41:00.47 rsa.c:251:29: warning: comparison between signed and unsigned integer expressions [-Wsign-compare]
41:00.47 rsa.c: In function 'rsa_get_primes_from_exponents':
41:00.47 rsa.c:482:52: warning: comparison between signed and unsigned integer expressions [-Wsign-compare]
41:00.67 mpi/mpprime.c: In function 'mpp_make_prime':
41:00.67 mpi/mpprime.c:445:47: warning: comparison between signed and unsigned integer expressions [-Wsign-compare]
41:00.82 mpi/mplogic.c: In function 'mpl_num_set':
41:00.82 mpi/mplogic.c:230:20: warning: comparison between signed and unsigned integer expressions [-Wsign-compare]
41:00.82 mpi/mplogic.c: In function 'mpl_num_clear':
41:00.82 mpi/mplogic.c:260:20: warning: comparison between signed and unsigned integer expressions [-Wsign-compare]
41:01.54 ecl/ecp_521.c: In function 'ec_GFp_nistp521_mod':
41:01.54 ecl/ecp_521.c:42:73: warning: comparison between signed and unsigned integer expressions [-Wsign-compare]
41:01.54 ecl/ecp_521.c:50:18: warning: comparison between signed and unsigned integer expressions [-Wsign-compare]
41:01.75 mpi/mpi.c: In function 'mp_expt':
41:01.75 mpi/mpi.c:1114:20: warning: comparison between signed and unsigned integer expressions [-Wsign-compare]
41:01.75 mpi/mpi.c:1118:22: warning: comparison between signed and unsigned integer expressions [-Wsign-compare]
41:01.75 mpi/mpi.c: In function 's_mp_exptmod':
41:01.75 mpi/mpi.c:1497:20: warning: comparison between signed and unsigned integer expressions [-Wsign-compare]
41:01.75 mpi/mpi.c:1501:22: warning: comparison between signed and unsigned integer expressions [-Wsign-compare]
41:01.75 mpi/mpi.c: In function 'mp_trailing_zeros':
41:01.75 mpi/mpi.c:2012:45: warning: comparison between signed and unsigned integer expressions [-Wsign-compare]
41:01.75 mpi/mpi.c: In function 's_mp_fixup_reciprocal':
41:01.75 mpi/mpi.c:2164:19: warning: comparison between signed and unsigned integer expressions [-Wsign-compare]
41:01.75 mpi/mpi.c:2164:51: warning: signed and unsigned type in conditional expression [-Wsign-compare]
41:01.76 mpi/mpi.c:2166:11: warning: comparison between signed and unsigned integer expressions [-Wsign-compare]
41:01.76 mpi/mpi.c: In function 's_mp_lshd':
41:01.76 mpi/mpi.c:2938:18: warning: comparison between signed and unsigned integer expressions [-Wsign-compare]
41:01.76 mpi/mpi.c: In function 's_mp_mul_2':
41:01.76 mpi/mpi.c:3063:12: warning: comparison between signed and unsigned integer expressions [-Wsign-compare]
41:01.76 mpi/mpi.c: In function 's_mp_todigit':
41:01.76 mpi/mpi.c:4600:10: warning: comparison between signed and unsigned integer expressions [-Wsign-compare]
41:01.76 mpi/mpi.c: In function 'mp_to_unsigned_octets':
41:01.76 mpi/mpi.c:4720:29: warning: comparison between signed and unsigned integer expressions [-Wsign-compare]
41:01.76 mpi/mpi.c: In function 'mp_to_signed_octets':
41:01.76 mpi/mpi.c:4752:29: warning: comparison between signed and unsigned integer expressions [-Wsign-compare]
41:01.76 mpi/mpi.c:4766:20: warning: comparison between signed and unsigned integer expressions [-Wsign-compare]
41:01.76 mpi/mpi.c:4767:18: warning: comparison between signed and unsigned integer expressions [-Wsign-compare]
41:01.76 mpi/mpi.c: In function 'mp_to_fixlen_octets':
41:01.76 mpi/mpi.c:4792:29: warning: comparison between signed and unsigned integer expressions [-Wsign-compare]
41:01.76 mpi/mpi.c:4795:16: warning: comparison between signed and unsigned integer expressions [-Wsign-compare]
41:02.22 lgglue.c: In function 'sftkdb_resolvePath':
41:02.22 lgglue.c:44:24: warning: comparison between signed and unsigned integer expressions [-Wsign-compare]
41:02.58 lowpbe.c: In function 'nsspkcs5_PKCS12PBE':
41:02.58 lowpbe.c:519:22: warning: comparison between signed and unsigned integer expressions [-Wsign-compare]
41:03.09 pkcs11u.c: In function 'sftk_DeleteObject':
41:03.09 pkcs11u.c:1177:22: warning: unused variable 'to' [-Wunused-variable]
41:03.09 pkcs11u.c: In function 'sftk_NewTokenObject':
41:03.09 pkcs11u.c:1902:22: warning: variable 'tokObject' set but not used [-Wunused-but-set-variable]
41:03.14 sdb.c: In function 'sdb_FindObjectsInit':
41:03.14 sdb.c:702:28: warning: comparison between signed and unsigned integer expressions [-Wsign-compare]
41:03.14 sdb.c:727:32: warning: comparison between signed and unsigned integer expressions [-Wsign-compare]
41:03.14 sdb.c: In function 'sdb_GetAttributeValueNoLock':
41:03.14 sdb.c:848:17: warning: comparison between signed and unsigned integer expressions [-Wsign-compare]
41:03.14 sdb.c:900:34: warning: comparison between signed and unsigned integer expressions [-Wsign-compare]
41:03.14 sdb.c: In function 'sdb_SetAttributeValue':
41:03.14 sdb.c:978:27: warning: comparison between signed and unsigned integer expressions [-Wsign-compare]
41:03.14 sdb.c:1007:17: warning: comparison between signed and unsigned integer expressions [-Wsign-compare]
41:03.14 sdb.c: In function 'sdb_CreateObject':
41:03.14 sdb.c:1138:42: warning: comparison between signed and unsigned integer expressions [-Wsign-compare]
41:03.14 sdb.c:1168:17: warning: comparison between signed and unsigned integer expressions [-Wsign-compare]
41:03.27 sftkhmac.c: In function 'sftk_HMACConstantTime_Update':
41:03.27 sftkhmac.c:149:15: warning: unused variable 'rv' [-Wunused-variable]
41:03.27 sftkhmac.c: In function 'sftk_SSLv3MACConstantTime_Update':
41:03.27 sftkhmac.c:163:15: warning: unused variable 'rv' [-Wunused-variable]
41:03.44 pkcs11.c: In function 'sftk_GetPubKey':
41:03.44 pkcs11.c:1756:35: warning: comparison between signed and unsigned integer expressions [-Wsign-compare]
41:03.44 pkcs11.c:1764:35: warning: comparison between signed and unsigned integer expressions [-Wsign-compare]
41:03.44 pkcs11.c:1774:27: warning: comparison between signed and unsigned integer expressions [-Wsign-compare]
41:03.44 pkcs11.c: In function 'NSC_GetInfo':
41:03.44 pkcs11.c:3144:19: warning: variable 'c' set but not used [-Wunused-but-set-variable]
41:03.44 pkcs11.c: In function 'NSC_GetAttributeValue':
41:03.44 pkcs11.c:4314:58: warning: comparison between signed and unsigned integer expressions [-Wsign-compare]
41:03.44 pkcs11.c: In function 'sftk_emailhack':
41:03.44 pkcs11.c:4527:17: warning: comparison between signed and unsigned integer expressions [-Wsign-compare]
41:03.44 pkcs11.c: In function 'NSC_FindObjects':
41:03.44 pkcs11.c:4743:54: warning: signed and unsigned type in conditional expression [-Wsign-compare]
41:03.44 pkcs11.c: In function 'NSC_CreateObject':
41:03.44 pkcs11.c:4085:21: warning: 'moduleIndex' may be used uninitialized in this function [-Wmaybe-uninitialized]
41:03.44 pkcs11.c:4005:19: note: 'moduleIndex' was declared here
41:03.75 sftkdb.c: In function 'sftkdb_fixupTemplateOut':
41:03.75 sftkdb.c:328:22: warning: variable 'data' set but not used [-Wunused-but-set-variable]
41:03.75 sftkdb.c:345:69: warning: comparison between signed and unsigned integer expressions [-Wsign-compare]
41:03.75 sftkdb.c: In function 'sftk_signTemplate':
41:03.75 sftkdb.c:520:17: warning: comparison between signed and unsigned integer expressions [-Wsign-compare]
41:03.75 sftkdb.c: In function 'sftkdb_CreateObject':
41:03.75 sftkdb.c:576:12: warning: variable 'inTransaction' set but not used [-Wunused-but-set-variable]
41:03.75 sftkdb.c: In function 'sftk_ExtractTemplate':
41:03.75 sftkdb.c:619:17: warning: comparison between signed and unsigned integer expressions [-Wsign-compare]
41:03.75 sftkdb.c:632:17: warning: comparison between signed and unsigned integer expressions [-Wsign-compare]
41:03.75 sftkdb.c: In function 'sftkdb_resolveConflicts':
41:03.75 sftkdb.c:1045:13: warning: comparison between signed and unsigned integer expressions [-Wsign-compare]
41:03.75 sftkdb.c: In function 'sftkdb_FindObjects':
41:03.75 sftkdb.c:1261:14: warning: comparison between signed and unsigned integer expressions [-Wsign-compare]
41:03.75 sftkdb.c: In function 'sftkdb_GetObjectTemplate':
41:03.75 sftkdb.c:1613:14: warning: comparison between signed and unsigned integer expressions [-Wsign-compare]
41:03.75 sftkdb.c:1631:63: warning: comparison between signed and unsigned integer expressions [-Wsign-compare]
41:03.75 sftkdb.c: In function 'sftkdb_handleIDAndName':
41:03.75 sftkdb.c:2014:11: warning: variable 'crv' set but not used [-Wunused-but-set-variable]
41:03.75 sftkdb.c: In function 'sftkdb_mergeObject':
41:03.76 sftkdb.c:2196:17: warning: comparison between signed and unsigned integer expressions [-Wsign-compare]
41:03.76 sftkdb.c: In function 'sftkdb_Update':
41:03.76 sftkdb.c:2301:38: warning: comparison between signed and unsigned integer expressions [-Wsign-compare]
41:03.76 sftkpwd.c: In function 'sftk_updateMacs':
41:03.76 sftkpwd.c:908:17: warning: comparison between signed and unsigned integer expressions [-Wsign-compare]
41:03.76 sftkpwd.c:909:31: warning: comparison between signed and unsigned integer expressions [-Wsign-compare]
41:03.76 sftkpwd.c:930:17: warning: comparison between signed and unsigned integer expressions [-Wsign-compare]
41:03.76 sftkpwd.c:935:31: warning: comparison between signed and unsigned integer expressions [-Wsign-compare]
41:03.76 sftkpwd.c:868:11: warning: variable 'crv2' set but not used [-Wunused-but-set-variable]
41:03.76 sftkpwd.c:867:11: warning: variable 'crv' set but not used [-Wunused-but-set-variable]
41:03.76 sftkpwd.c: In function 'sftk_updateEncrypted':
41:03.76 sftkpwd.c:986:17: warning: comparison between signed and unsigned integer expressions [-Wsign-compare]
41:03.76 sftkpwd.c:993:31: warning: comparison between signed and unsigned integer expressions [-Wsign-compare]
41:03.76 sftkpwd.c: In function 'sftkdb_convertObjects':
41:03.76 sftkpwd.c:1125:38: warning: comparison between signed and unsigned integer expressions [-Wsign-compare]
41:04.29 pkcs11c.c: In function 'NSC_GenerateKeyPair':
41:04.29 pkcs11c.c:4340:9: warning: variable 'private_value_bits' set but not used [-Wunused-but-set-variable]
41:04.29 pkcs11c.c: In function 'sftk_PackagePrivateKey':
41:04.29 pkcs11c.c:4862:14: warning: variable 'fordebug' set but not used [-Wunused-but-set-variable]
41:04.29 pkcs11c.c: In function 'NSC_DeriveKey':
41:04.29 pkcs11c.c:6764:18: warning: comparison between signed and unsigned integer expressions [-Wsign-compare]
41:04.29 pkcs11c.c:6769:18: warning: comparison between signed and unsigned integer expressions [-Wsign-compare]
41:04.29 pkcs11c.c:6850:20: warning: comparison between signed and unsigned integer expressions [-Wsign-compare]
41:04.29 pkcs11c.c: In function 'NSC_GenerateKeyPair':
41:04.29 pkcs11c.c:4260:6: warning: 'subPrimeLen' may be used uninitialized in this function [-Wmaybe-uninitialized]
41:04.29 pkcs11c.c:4042:14: note: 'subPrimeLen' was declared here
41:04.29 pkcs11c.c:4212:23: warning: 'modulusLen' may be used uninitialized in this function [-Wmaybe-uninitialized]
41:04.29 pkcs11c.c:4041:14: note: 'modulusLen' was declared here
41:04.29 pkcs11c.c: In function 'NSC_GenerateKey':
41:04.29 pkcs11c.c:3968:13: warning: 'hashType' may be used uninitialized in this function [-Wmaybe-uninitialized]
41:04.75 libjs_static.a
41:19.25 libjs_static.a.desc
41:19.82 libeditline.a.desc
41:19.90 js
41:24.00 jsapi-tests
41:29.10 gdb-tests
41:33.52 libcertverifier.a.desc
41:33.61 libmozillapkix.a.desc
41:33.73 libmozillapkix_gtest.a.desc
41:33.84 libpkixtestutil.a.desc
41:33.92 libsecurity_apps.a.desc
41:34.09 libxpt.a
41:34.19 libxpt.a.desc
41:34.34 libxpcom_string.a.desc
41:34.47 libxpcomglue_s.a
41:34.77 libxpcomglue_s.a.desc
41:34.92 libxpcomglue.a
41:34.98 libxpcomglue.a.desc
41:35.13 libxpcomglue_s_nomozalloc.a
41:35.19 libxpcomglue_s_nomozalloc.a.desc
41:35.31 libxpcom_glue_gtest.a.desc
41:35.44 libxpcom_base.a.desc
41:35.66 libxpcom_ds.a.desc
41:35.87 libxpcom_io.a.desc
41:36.06 libxpcom_components.a.desc
41:36.22 libxpcom_threads.a.desc
41:36.41 libxpcom_reflect_xptinfo.a.desc
41:36.56 libxpcom_reflect_xptcall.a.desc
41:36.70 libxpcom_reflect_xptcall_md_unix.a.desc
41:37.21 libchrome_src.a.desc
41:37.41 libxpcom_core.a.desc
41:37.69 libmodules_libpref_src.a.desc
41:37.75 /opt/FirefoxSource/mozilla-release/netwerk/base/public/security-prefs.js: WARNING: no preprocessor directives found
41:37.92 libintl_hyphenation_src.a.desc
41:38.11 libintl_locale_src.a.desc
41:38.20 libintl_locale_src_unix.a.desc
41:38.65 libintl_lwbrk_src.a.desc
41:38.82 libintl_strres_src.a.desc
41:39.02 libunicharutil_external_s.a
41:39.21 libunicharutil_external_s.a.desc
41:39.29 libintl_unicharutil_util_internal.a
41:39.34 libintl_unicharutil_util_internal.a.desc
41:39.42 libintl_unicharutil_src.a.desc
41:39.82 libintl_uconv_src.a.desc
41:40.09 libi18n.a.desc
41:40.43 libnetwerk_base_src.a.desc
41:40.67 libnetwerk_cookie.a.desc
41:40.85 libnetwerk_dns.a.desc
41:41.02 libnetwerk_socket.a.desc
41:41.17 libnetwerk_mime.a.desc
41:41.41 libnetwerk_streamconv_src.a.desc
41:41.51 libnetwerk_streamconv_converters.a.desc
41:41.63 libnetwerk_cache.a.desc
41:41.84 libnetwerk_cache2.a.desc
41:42.02 libnetwerk_protocol_about.a.desc
41:42.18 libnetwerk_protocol_app.a.desc
41:42.25 libnetwerk_protocol_data.a.desc
41:42.36 libnetwerk_protocol_device.a.desc
41:42.45 libnetwerk_protocol_file.a.desc
41:42.61 libnetwerk_protocol_ftp.a.desc
41:42.88 libnetwerk_protocol_http.a.desc
41:43.19 libnetwerk_protocol_res.a.desc
41:43.33 libnetwerk_protocol_viewsource.a.desc
41:43.49 libnetwerk_protocol_websocket.a.desc
41:43.67 libnetwerk_protocol_wyciwyg.a.desc
41:43.85 libnetwerk_system_android.a.desc
41:43.94 libnetwerk_ipc.a.desc
41:44.26 libnecko.a.desc
41:44.36 libextensions_auth.a.desc
41:44.80 libipc_chromium.a.desc
41:45.11 libipc_glue.a.desc
41:45.36 libipc_ipdl.a.desc
41:45.56 libipc_testshell.a.desc
41:45.68 libjs_ipc.a.desc
41:45.89 libhal.a.desc
41:46.25 libjs_xpconnect_wrappers.a.desc
41:46.37 libjs_xpconnect_loader.a.desc
41:46.70 libxpconnect_s.a.desc
41:46.94 libintl_chardet_src.a.desc
41:47.01 libyuv_neon.a.desc
41:47.17 libyuv.a.desc
41:47.30 libjar.a.desc
41:47.56 libmodules_libjar_zipwriter_src.a.desc
41:47.81 libstorage_src.a.desc
41:47.94 libstoragecomps.a.desc
41:48.04 libextensions_cookie.a.desc
41:48.19 libextensions_permissions.a.desc
41:48.49 librdf_base_src.a.desc
41:48.61 librdfutil_external_s.a
41:48.67 librdfutil_external_s.a.desc
41:48.75 librdf_util_src_internal.a.desc
41:48.84 librdf_datasource_src.a.desc
41:48.93 librdf.a.desc
41:49.04 libutils.so
41:49.21 libstagefright.so
41:49.36 libvideoeditorplayer.so
41:49.50 libutils.so
41:49.64 libstagefright.so
41:49.77 libstagefright_color_conversion.so
41:49.91 libstagefright.so
41:50.07 libstagefright.so
41:50.22 libomxplugin.so
41:50.39 libomxplugingb.so
41:50.52 libomxplugingb235.so
41:50.66 libomxpluginfroyo.so
41:50.80 libstagefright.so
41:50.97 libomxpluginhc.so
41:51.11 libomxpluginkk.so
41:51.64 libgtest.a.desc
41:51.73 liburiloader_base.a.desc
41:52.02 liburiloader_exthandler.a.desc
41:52.21 WriteArgument
41:52.37 liburiloader_prefetch.a.desc
41:52.57 libcaps.a.desc
41:52.72 libparser_expat_lib.a.desc
41:52.91 libparser_xml_src.a.desc
41:53.16 libhtmlpars.a.desc
41:53.57 libparser_html.a.desc
41:54.01 libgfx_cairo_cairo_src.a.desc
41:54.21 libgfx_cairo_libpixman_src.a.desc
41:54.47 libgfx_2d.a.desc
41:54.61 libgfx_ycbcr.a.desc
41:54.90 libgfx_angle.a.desc
41:55.12 libgfx_src.a.desc
41:55.31 libgfx_qcms.a.desc
41:55.60 libgfx_gl.a.desc
41:56.02 libgfx_layers.a.desc
41:56.51 libgfx_graphite2_src.a.desc
41:56.64 libgfx_harfbuzz_src.a.desc
41:56.76 libgfx_ots_src.a.desc
41:56.98 libthebes.a.desc
41:57.21 libgfx_ipc.a.desc
41:57.71 libgfx_skia.a.desc
41:58.37 libgfxtest.a.desc
41:58.68 libimage_src.a.desc
41:58.86 libimage_decoders.a.desc
41:58.96 libimage_decoders_icon_android.a.desc
41:59.04 libimgicon.a.desc
41:59.18 libimage_encoders_ico.a.desc
41:59.28 libimage_encoders_png.a.desc
41:59.36 libimage_encoders_jpeg.a.desc
41:59.43 libimage_encoders_bmp.a.desc
41:59.52 libimglib2.a.desc
42:02.37 libdom_animation.a.desc
42:02.47 libdom_apps_src.a.desc
42:02.76 libdom_base.a.desc
42:03.30 libdom_activities_src.a.desc
42:03.42 libdom_archivereader.a.desc
42:03.75 libdom_bindings.a.desc
42:04.15 libdombindings_test_s.a.desc
42:04.27 libdom_battery.a.desc
42:04.37 libdom_browser-element.a.desc
42:04.60 libdom_crypto.a.desc
42:04.83 libdom_alarm.a.desc
42:05.00 libdom_datastore.a.desc
42:05.20 libdom_devicestorage.a.desc
42:05.29 libdom_encoding.a.desc
42:05.50 libdom_events.a.desc
42:05.83 libdom_filehandle.a.desc
42:05.95 libdom_filesystem.a.desc
42:06.08 libdom_asmjscache.a.desc
42:06.17 libdom_media.a.desc
42:06.55 libdom_power.a.desc
42:06.82 libdom_quota.a.desc
42:07.27 libdom_mobilemessage_src.a.desc
42:07.55 libdom_src_jsurl.a.desc
42:07.64 libdom_src_storage.a.desc
42:07.74 libdom_src_offline.a.desc
42:07.82 libdom_src_json.a.desc
42:07.90 libdom_src_geolocation.a.desc
42:07.99 libdom_src_notification.a.desc
42:08.12 libdom_time.a.desc
42:08.57 libdom_network_src.a.desc
42:08.89 libdom_plugins_base.a.desc
42:09.11 libdom_plugins_base_android.a.desc
42:09.29 libdom_plugins_ipc.a.desc
42:09.54 libdom_indexedDB.a.desc
42:09.74 libdom_indexedDB_ipc.a.desc
42:09.91 /opt/FirefoxSource/mozilla-release/dom/indexedDB/test/extensions/bootstrap.js: WARNING: no preprocessor directives found
42:09.99 libdom_system.a.desc
42:10.16 libdom_system_android.a.desc
42:10.33 libdom_ipc.a.desc
42:10.83 libdom_workers.a.desc
42:11.05 /opt/FirefoxSource/mozilla-release/dom/workers/test/extensions/bootstrap/worker.js: WARNING: no preprocessor directives found
42:11.05 /opt/FirefoxSource/mozilla-release/dom/workers/test/extensions/bootstrap/bootstrap.js: WARNING: no preprocessor directives found
42:11.13 /opt/FirefoxSource/mozilla-release/dom/workers/test/extensions/traditional/worker.js: WARNING: no preprocessor directives found
42:11.29 libdom_camera.a.desc
42:11.43 libdom_audiochannel.a.desc
42:11.59 libdom_promise.a.desc
42:11.72 libdom_smil.a.desc
42:11.88 libdom_telephony.a.desc
42:12.26 libdom_xbl.a.desc
42:12.78 libdom_xslt_base.a.desc
42:12.90 libdom_xslt_xml.a.desc
42:13.08 libdom_xslt_xpath.a.desc
42:13.40 libdom_xslt_xslt.a.desc
42:13.81 libdom_resourcestats.a.desc
42:14.26 libdom_gamepad.a.desc
42:14.52 libnptest.so
42:14.73 libnpsecondtest.so
42:14.89 libnptestjava.so
42:15.08   adding: install.rdf (deflated 52%)
42:15.13   adding: plugins/libnptest.so (deflated 60%)
42:15.17   adding: plugins/libnpsecondtest.so (deflated 60%)
42:15.25 libview_src.a.desc
42:15.51 libwidget_shared.a.desc
42:15.71 libxpwidgets_s.a.desc
42:16.02 libwidget_android.a.desc
42:16.79 libcontent_base_src.a.desc
42:17.72 libcontent_canvas_src.a.desc
42:18.68 libcontent_html_content_src.a.desc
42:19.49 libcontent_html_document_src.a.desc
42:19.65 libcontent_mathml_content_src.a.desc
42:19.89 libcontent_media.a.desc
42:20.22 libcontent_media_encoder.a.desc
42:20.37 libmozgmp.a.desc
42:20.63 libcontent_media_mediasource.a.desc
42:20.78 libcontent_media_ogg.a.desc
42:20.99 libcontent_media_webaudio.a.desc
42:21.26 libcontent_media_webaudio_blink.a.desc
42:21.57 libcontent_media_raw.a.desc
42:21.67 libcontent_media_wave.a.desc
42:21.77 libcontent_media_webm.a.desc
42:21.87 libcontent_media_android.a.desc
42:21.97 libcontent_media_webrtc.a.desc
42:22.13 libcontent_media_webspeech_synth.a.desc
42:22.32 libcontent_media_webspeech_recognition.a.desc
42:22.50 libcontent_media_eme.a.desc
42:22.60 libmedia_gtest.a.desc
42:22.69 libcontent_svg_document_src.a.desc
42:23.18 libcontent_svg_content_src.a.desc
42:23.85 libcontent_xml_content_src.a.desc
42:24.07 libcontent_xml_document_src.a.desc
42:24.32 libcontent_xul_document_src.a.desc
42:24.54 libcontent_xul_content_src.a.desc
42:24.78 libcontent_xul_templates_src.a.desc
42:25.04 libeditor_txtsvc.a.desc
42:25.23 libeditor_libeditor_base.a.desc
42:25.40 libeditor_libeditor_text.a.desc
42:25.55 libeditor_libeditor_html.a.desc
42:25.69 libeditor_txmgr.a.desc
42:25.86 libeditor_composer.a.desc
42:26.13 liblayout_style.a.desc
42:26.78 liblayout_base.a.desc
42:27.25 liblayout_generic.a.desc
42:27.71 liblayout_forms.a.desc
42:27.93 liblayout_tables.a.desc
42:28.16 liblayout_svg.a.desc
42:28.51 liblayout_xul.a.desc
42:28.87 liblayout_xul_tree.a.desc
42:29.06 liblayout_xul_grid.a.desc
42:29.18 liblayout_ipc.a.desc
42:29.41 liblayout_mathml.a.desc
42:29.68 liblayout_inspector.a.desc
42:30.03 liblayout_printing.a.desc
42:30.21 libgklayout.a.desc
42:30.43 libgkmedias.a.desc
42:30.61 libdocshell_base.a.desc
42:30.90 libdocshell_shistory_src.a.desc
42:30.99 libdocshell_build.a.desc
42:31.41 libembedding_components_windowwatcher_src.a.desc
42:31.50 libembedding_components_appstartup_src.a.desc
42:31.69 libembedding_components_find_src.a.desc
42:31.90 libembedding_components_webbrowserpersist_src.a.desc
42:32.08 libembedding_components_commandhandler_src.a.desc
42:32.18 libembedding_components_printingui_src_unixshared.a.desc
42:32.26 libembedcomponents.a.desc
42:32.36 libembedding_browser_webBrowser.a.desc
42:32.51 libwebbrwsr.a.desc
42:32.82 libxpfe_appshell_src.a.desc
42:32.93 libother-licenses_skia-npapi.a.desc
42:33.03 libextensions_universalchardet_src_base.a.desc
42:33.13 libuniversalchardet.a.desc
42:33.21 libaccessible_other.a.desc
42:33.36 libaccessible_base.a.desc
42:33.58 libaccessible_generic.a.desc
42:33.74 libaccessible_html.a.desc
42:34.14 libaccessible_xpcom.a.desc
42:34.27 libaccessible_xul.a.desc
42:34.51 libprofdirserviceprovidersa_s.a.desc
42:34.63 libtools_profiler.a.desc
42:34.83 libsps_test.a.desc
42:34.92 libxpfe_components_windowds.a.desc
42:35.05 libxpfe_components_directory.a.desc
42:35.18 libappcomps.a.desc
42:35.47 libextensions_spellcheck_hunspell_src.a.desc
42:35.61 libspellchecker.a.desc
42:35.85 libsecurity_manager_boot_src.a.desc
42:36.04 libsecurity_manager_ssl_src.a.desc
42:36.38 libtlsserver.a.desc
42:36.46 BadCertServer
42:36.46 GenerateOCSPResponse
42:36.46 OCSPStaplingServer
42:36.60 libssltest.a.desc
42:37.24 libsecurity_manager_pki_src.a.desc
42:37.69 libtoolkit_components_alerts.a.desc
42:38.02 libtoolkit_components_commandlines.a.desc
42:38.57 libtoolkit_components_diskspacewatcher.a.desc
42:38.71 libtoolkit_components_downloads.a.desc
42:39.11 libtoolkit_components_finalizationwitness.a.desc
42:39.42 libtoolkit_components_find.a.desc
42:39.65 libtoolkit_components_jsdownloads_src.a.desc
42:39.87 libtoolkit_components_mediasniffer.a.desc
42:40.01 libtoolkit_components_osfile.a.desc
42:40.20 libtoolkit_components_parentalcontrols.a.desc
42:40.56 libtoolkit_components_perf.a.desc
42:41.04 libtoolkit_components_protobuf.a.desc
42:41.12 libtoolkit_components_reflect.a.desc
42:41.25 libtoolkit_components_startup.a.desc
42:41.43 libtoolkit_components_statusfilter.a.desc
42:41.51 libtoolkit_components_telemetry.a.desc
42:41.96 libtoolkit_components_typeaheadfind.a.desc
42:42.57 libtoolkit_components_workerlz4.a.desc
42:42.64 libtoolkit_components_ctypes.a.desc
42:42.72 libjsctypes-test.so
42:43.07 libtoolkit_components_autocomplete.a.desc
42:43.20 libtoolkit_components_satchel.a.desc
42:43.60 libtoolkit_components_url-classifier.a.desc
42:43.80 libtoolkitcomps.a.desc
42:44.65 libtoolkit_devtools_server.a.desc
42:45.70 libtoolkit_identity.a.desc
42:46.50 libtoolkit_mozapps_extensions.a.desc
42:48.24 BadPlugin
42:48.24 GoodPlugin
42:48.49 libtoolkit_profile.a.desc
42:49.47 TestWebappRT
42:49.58 libtoolkit_system_androidproxy.a.desc
42:49.69 libbreakpad_common_s.a.desc
42:49.86 libtoolkit_crashreporter_google-breakpad_src_processor.a.desc
42:49.95 libbreakpad_linux_common_s.a.desc
42:50.36 libxulapp_s.a.desc
42:50.66 libextensions_pref_autoconfig_src.a.desc
42:50.95 libservices_crypto_component.a.desc
42:51.26 libstartupcache.a.desc
42:51.40 libjs_ductwork_debugger.a.desc
42:51.53 libother-licenses_snappy.a.desc
42:51.62 libbrowsercomps.a.desc
42:51.76 libxul.a.desc
42:52.10 libStaticXULComponentsEnd.a.desc
42:52.17 libxul.so
46:26.73 /opt/FirefoxSource/mozilla-release/tools/quitter/chrome.manifest: WARNING: no preprocessor directives found
46:28.46 ssltunnel
46:30.39 /opt/FirefoxSource/mozilla-release/mobile/android/thirdparty/jap/branding/locales/en-US/brand.properties: WARNING: no useful preprocessor directives found
46:31.50 /opt/FirefoxSource/mozilla-release/mobile/locales/en-US/overrides/netError.dtd: WARNING: no preprocessor directives found
46:31.51 /opt/FirefoxSource/mozilla-release/mobile/locales/en-US/overrides/appstrings.properties: WARNING: no useful preprocessor directives found
46:31.51 /opt/FirefoxSource/mozilla-release/mobile/locales/en-US/overrides/passwordmgr.properties: WARNING: no useful preprocessor directives found
46:32.68 /opt/FirefoxSource/mozilla-release/mobile/android/base/WebappManifestFragment.xml.frag.in: WARNING: no preprocessor directives found
46:33.53 gecko-mozglue.jar
46:33.56 squareup-picasso.jar
46:33.73 sync-thirdparty.jar
46:33.83 websockets.jar
46:34.42 Reading 0 suggested sites: []
46:34.42 /opt/FirefoxSource/mozilla-release/objdir-droid/mobile/android/base/res/raw/suggestedsites.json updated
46:37.31 generated/org/mozilla/gecko/mozglue/GeckoLoader.java:284: warning: [deprecation] CPU_ABI in Build has been deprecated
46:37.31         final String abi = android.os.Build.CPU_ABI;
46:37.31                                            ^
46:37.33 generated/org/mozilla/gecko/mozglue/GeckoLoader.java:346: warning: [deprecation] CPU_ABI in Build has been deprecated
46:37.33         message.append(": ABI: " + MOZ_APP_ABI + ", " + android.os.Build.CPU_ABI);
46:37.33                                                                         ^
46:37.55 2 warnings
46:37.88 geckoview_resources.zip
46:37.89 gecko-util.jar
46:38.47 Note: /opt/FirefoxSource/mozilla-release/mobile/android/thirdparty/com/squareup/picasso/Utils.java uses or overrides a deprecated API.
46:38.47 Note: Recompile with -Xlint:deprecation for details.
46:38.76     (skipping file '.mkdir.done' due to ANDROID_AAPT_IGNORE pattern '.*')
46:38.76     (skipping file '.mkdir.done' due to ANDROID_AAPT_IGNORE pattern '.*')
46:38.78     (skipping file 'fxaccount_custom_server_view.xml.orig' due to ANDROID_AAPT_IGNORE pattern '*.orig')
46:39.18 /opt/FirefoxSource/mozilla-release/mobile/android/base/resources/drawable-mdpi/folder_up.png: libpng warning: iCCP: Not recognizing known sRGB profile that has been edited
46:39.18 /opt/FirefoxSource/mozilla-release/mobile/android/base/resources/drawable-hdpi/folder_up.png: libpng warning: iCCP: Not recognizing known sRGB profile that has been edited
46:39.18 /opt/FirefoxSource/mozilla-release/mobile/android/base/resources/drawable-xhdpi/folder_up.png: libpng warning: iCCP: Not recognizing known sRGB profile that has been edited
46:39.57 /opt/FirefoxSource/mozilla-release/mobile/android/base/resources/drawable-mdpi/switch_button_icon.png: libpng warning: iCCP: Not recognizing known sRGB profile that has been edited
46:39.57 /opt/FirefoxSource/mozilla-release/mobile/android/base/resources/drawable-hdpi/switch_button_icon.png: libpng warning: iCCP: Not recognizing known sRGB profile that has been edited
46:39.57 /opt/FirefoxSource/mozilla-release/mobile/android/base/resources/drawable-xhdpi/switch_button_icon.png: libpng warning: iCCP: Not recognizing known sRGB profile that has been edited
46:39.60 /opt/FirefoxSource/mozilla-release/mobile/android/base/resources/drawable-mdpi/undo_button_icon.png: libpng warning: iCCP: Not recognizing known sRGB profile that has been edited
46:39.61 /opt/FirefoxSource/mozilla-release/mobile/android/base/resources/drawable-hdpi/undo_button_icon.png: libpng warning: iCCP: Not recognizing known sRGB profile that has been edited
46:39.61 /opt/FirefoxSource/mozilla-release/mobile/android/base/resources/drawable-xhdpi/undo_button_icon.png: libpng warning: iCCP: Not recognizing known sRGB profile that has been edited
46:40.17 gecko-R.jar
46:40.84 Note: Some input files use or override a deprecated API.
46:40.84 Note: Recompile with -Xlint:deprecation for details.
46:42.62 Note: Some input files use or override a deprecated API.
46:42.62 Note: Recompile with -Xlint:deprecation for details.
46:42.62 Note: Some input files use unchecked or unsafe operations.
46:42.62 Note: Recompile with -Xlint:unchecked for details.
46:42.89 gecko-browser.jar
46:48.15 /opt/FirefoxSource/mozilla-release/mobile/android/base/AnonFoxBrowserApp.java:92: error: cannot access Logger
46:48.16                     controller.init(new AndroidLog(), conf);
46:48.16                               ^
46:48.16   class file for org.apache.log4j.Logger not found
46:50.30 /opt/FirefoxSource/mozilla-release/mobile/android/thirdparty/jap/src/anon/android/EDBDatabaseAndroid.java:81: warning: [rawtypes] found raw type: Vector
46:50.30 		public Vector getAllTypes() throws EDBException
46:50.30 		       ^
46:50.30   missing type arguments for generic class Vector<E>
46:50.30   where E is a type-variable:
46:50.30     E extends Object declared in class Vector
46:50.30 /opt/FirefoxSource/mozilla-release/mobile/android/thirdparty/jap/src/anon/android/EDBDatabaseAndroid.java:87: warning: [rawtypes] found raw type: Vector
46:50.30 						Vector vec = new Vector();
46:50.30 						^
46:50.30   missing type arguments for generic class Vector<E>
46:50.30   where E is a type-variable:
46:50.30     E extends Object declared in class Vector
46:50.30 /opt/FirefoxSource/mozilla-release/mobile/android/thirdparty/jap/src/anon/android/EDBDatabaseAndroid.java:87: warning: [rawtypes] found raw type: Vector
46:50.30 						Vector vec = new Vector();
46:50.30 						                 ^
46:50.30   missing type arguments for generic class Vector<E>
46:50.30   where E is a type-variable:
46:50.30     E extends Object declared in class Vector
46:50.30 /opt/FirefoxSource/mozilla-release/mobile/android/thirdparty/jap/src/anon/android/EDBDatabaseAndroid.java:95: warning: [unchecked] unchecked call to addElement(E) as a member of the raw type Vector
46:50.30 										vec.addElement(generateTypeFromTableName(cursor.getString(0)));
46:50.30 										              ^
46:50.30   where E is a type-variable:
46:50.30     E extends Object declared in class Vector
46:50.30 /opt/FirefoxSource/mozilla-release/mobile/android/thirdparty/jap/src/anon/android/EDBDatabaseAndroid.java:119: warning: [rawtypes] found raw type: Vector
46:50.31 		public Vector getAllValuesOfType(String type) throws EDBException
46:50.31 		       ^
46:50.31   missing type arguments for generic class Vector<E>
46:50.31   where E is a type-variable:
46:50.31     E extends Object declared in class Vector
46:50.31 /opt/FirefoxSource/mozilla-release/mobile/android/thirdparty/jap/src/anon/android/EDBDatabaseAndroid.java:125: warning: [rawtypes] found raw type: Vector
46:50.31 					Vector vec = new Vector();
46:50.31 					^
46:50.31   missing type arguments for generic class Vector<E>
46:50.31   where E is a type-variable:
46:50.31     E extends Object declared in class Vector
46:50.31 /opt/FirefoxSource/mozilla-release/mobile/android/thirdparty/jap/src/anon/android/EDBDatabaseAndroid.java:125: warning: [rawtypes] found raw type: Vector
46:50.31 					Vector vec = new Vector();
46:50.31 					                 ^
46:50.31   missing type arguments for generic class Vector<E>
46:50.31   where E is a type-variable:
46:50.31     E extends Object declared in class Vector
46:50.31 /opt/FirefoxSource/mozilla-release/mobile/android/thirdparty/jap/src/anon/android/EDBDatabaseAndroid.java:133: warning: [unchecked] unchecked call to addElement(E) as a member of the raw type Vector
46:50.31 									vec.addElement(cursor.getString(0));
46:50.31 									              ^
46:50.31   where E is a type-variable:
46:50.31     E extends Object declared in class Vector
46:50.70 Note: Some input files use or override a deprecated API.
46:50.71 Note: Recompile with -Xlint:deprecation for details.
46:50.71 1 error
46:50.71 8 warnings
46:50.74 make[5]: *** [gecko-browser.jar] Fehler 1
46:50.74 make[4]: *** [mobile/android/base/libs] Fehler 2
46:50.74 make[3]: *** [libs] Fehler 2
46:50.74 make[2]: *** [default] Fehler 2
46:50.75 make[1]: *** [realbuild] Fehler 2
46:50.75 make: *** [build] Fehler 2
46:50.78 452 compiler warnings present.
Build step 'Shell ausführen' marked build as failure
[PostBuildScript] - Execution post build scripts.
[PostBuildScript] Build is not success : do not execute script
Finished: FAILURE