Console Output

Skipping 668 KB.. Full Log
26:43.99 /opt/FirefoxSource/mozilla-release/content/base/src/nsContentIterator.cpp:1298:41: warning: 'node' may be used uninitialized in this function [-Wmaybe-uninitialized]
26:43.99 nsContentPolicy.o
26:46.67 WebGLExtensionElementIndexUint.o
26:47.16 nsContentSink.o
26:47.35 HTMLMenuItemElement.o
26:48.49 MediaTaskQueue.o
26:48.79 nsCopySupport.o
26:50.25 HTMLMetaElement.o
26:50.44 WebGLExtensionFragDepth.o
26:50.51 MediaTrack.o
26:51.29 MediaTrackList.o
26:52.64 nsCrossSiteListenerProxy.o
26:53.24 RtspMediaResource.o
26:53.27 HTMLMeterElement.o
26:53.75 WebGLExtensionInstancedArrays.o
26:56.12 HTMLModElement.o
26:56.40 nsDOMAttributeMap.o
26:57.49 WebGLExtensionLoseContext.o
26:57.51 SharedThreadPool.o
26:58.97 nsDOMBlobBuilder.o
26:59.07 HTMLObjectElement.o
27:01.01 WebGLExtensionSRGB.o
27:01.36 nsDOMCaretPosition.o
27:01.59 StreamBuffer.o
27:01.67 HTMLOptGroupElement.o
27:02.46 TextTrack.o
27:02.99 TextTrackCue.o
27:03.53 nsDOMFile.o
27:04.48 WebGLExtensionStandardDerivatives.o
27:05.91 nsDOMFileReader.o
27:06.69 HTMLOptionElement.o
27:07.19 TextTrackCueList.o
27:08.13 WebGLExtensionTextureFilterAnisotropic.o
27:09.39 nsDOMMutationObserver.o
27:11.39 HTMLOptionsCollection.o
27:11.42 WebGLExtensionTextureFloat.o
27:11.42 TextTrackList.o
27:12.09 nsDOMSerializer.o
27:14.98 WebGLExtensionTextureFloatLinear.o
27:15.06 TextTrackRegion.o
27:15.72 HTMLOutputElement.o
27:16.23 nsDOMSettableTokenList.o
27:18.02 nsDOMTokenList.o
27:18.23 WebGLExtensionTextureHalfFloat.o
27:18.65 VideoFrameContainer.o
27:20.10 nsDataDocumentContentPolicy.o
27:20.22 HTMLParagraphElement.o
27:20.63 VideoPlaybackQuality.o
27:21.64 WebGLExtensionTextureHalfFloatLinear.o
27:22.35 nsDocumentEncoder.o
27:23.29 HTMLPictureElement.o
27:24.27 nsElementFrameLoaderOwner.o
27:25.05 WebGLExtensionVertexArray.o
27:25.91 VideoSegment.o
27:26.24 HTMLPreElement.o
27:28.11 WebGLFramebuffer.o
27:29.02 HTMLProgressElement.o
27:29.38 VideoStreamTrack.o
27:29.87 nsFormData.o
27:30.94 VideoTrack.o
27:31.96 WebGLFramebufferAttachable.o
27:32.11 HTMLPropertiesCollection.o
27:32.34 nsFrameLoader.o
27:33.06 VideoTrackList.o
27:34.80 HTMLScriptElement.o
27:35.12 nsFrameMessageManager.o
27:36.65 WebGLObjectModel.o
27:36.75 VideoUtils.o
27:37.97 HTMLSelectElement.o
27:38.56 WebVTTListener.o
27:39.90 WebGLProgram.o
27:41.62 HTMLShadowElement.o
27:43.37 WebGLQuery.o
27:44.34 /opt/FirefoxSource/mozilla-release/content/media/WebVTTListener.cpp: In member function 'virtual nsresult mozilla::dom::WebVTTListener::OnCue(JS::Handle<JS::Value>, JSContext*)':
27:44.34 Warning: -Wmaybe-uninitialized in /opt/FirefoxSource/mozilla-release/content/media/WebVTTListener.cpp: 'cue' may be used uninitialized in this function
27:44.34 /opt/FirefoxSource/mozilla-release/content/media/WebVTTListener.cpp:173:33: warning: 'cue' may be used uninitialized in this function [-Wmaybe-uninitialized]
27:44.34 HTMLSharedElement.o
27:45.36 nsGenConImageContent.o
27:47.82 WebGLRenderbuffer.o
27:48.08 WebGLShader.o
27:48.73 HTMLSharedListElement.o
27:51.71 WebGLShaderPrecisionFormat.o
27:51.83 In file included from ../../../dist/include/nsDataHashtable.h:11:0,
27:51.83                  from /opt/FirefoxSource/mozilla-release/content/base/src/nsFrameMessageManager.h:21,
27:51.83                  from /opt/FirefoxSource/mozilla-release/content/base/src/nsFrameMessageManager.cpp:8:
27:51.83 ../../../dist/include/nsBaseHashtable.h: In member function 'void nsFrameScriptExecutor::TryCacheLoadAndCompileScript(const nsAString_internal&, bool, bool, JS::MutableHandle<JSScript*>)':
27:51.83 Warning: -Wmaybe-uninitialized in /opt/FirefoxSource/mozilla-release/objdir-droid/dist/include/nsBaseHashtable.h: 'holder' may be used uninitialized in this function
27:51.83 ../../../dist/include/nsBaseHashtable.h:138:5: warning: 'holder' may be used uninitialized in this function [-Wmaybe-uninitialized]
27:51.83 /opt/FirefoxSource/mozilla-release/content/base/src/nsFrameMessageManager.cpp:1550:44: note: 'holder' was declared here
27:51.84 nsGenericDOMDataNode.o
27:51.84 WebGLTexelConversions.o
27:51.95 HTMLSharedObjectElement.o
27:54.35 nsGkAtoms.o
27:54.90 HTMLSourceElement.o
27:55.23 HTMLSpanElement.o
27:55.59 WebGLTexture.o
27:58.57 nsHTMLContentSerializer.o
27:58.83 SVGDocument.o
27:59.53 nsHostObjectProtocolHandler.o
27:59.88 HTMLStyleElement.o
28:02.34 nsHostObjectURI.o
28:02.78 HTMLTableCaptionElement.o
28:02.81 DOMSVGAnimatedLengthList.o
28:02.81 DOMSVGAnimatedNumberList.o
28:04.71 WebGLUniformLocation.o
28:04.91 DOMSVGLength.o
28:06.02 HTMLTableCellElement.o
28:06.09 nsINode.o
28:06.73 nsInProcessTabChildGlobal.o
28:07.05 DOMSVGLengthList.o
28:09.01 HTMLTableColElement.o
28:09.66 WebGLVertexArray.o
28:09.81 DOMSVGNumber.o
28:12.35 HTMLTableElement.o
28:12.41 DOMSVGNumberList.o
28:13.10 WebGLVertexArrayFake.o
28:14.68 DOMSVGPathSeg.o
28:15.28 HTMLTableRowElement.o
28:15.56 nsLineBreaker.o
28:17.02 WebGLVertexArrayGL.o
28:17.09 DOMSVGPathSegList.o
28:19.48 nsMappedAttributeElement.o
28:19.91 HTMLTableSectionElement.o
28:20.57 DOMSVGPoint.o
28:21.56 nsMappedAttributes.o
28:23.23 DOMSVGPointList.o
28:23.57 nsMixedContentBlocker.o
28:23.59 HTMLTemplateElement.o
28:24.61 HTMLTextAreaElement.o
28:25.87 DOMSVGStringList.o
28:25.93 nsNameSpaceManager.o
28:27.15 nsNoDataProtocolContentPolicy.o
28:27.42 HTMLTimeElement.o
28:28.08 DOMSVGTransformList.o
28:28.49 nsNodeUtils.o
28:29.37 nsPlainTextSerializer.o
28:29.39 nsPropertyTable.o
28:30.35 SVGAElement.o
28:32.20 nsRange.o
28:32.46 HTMLTitleElement.o
28:32.60 nsReferencedElement.o
28:32.79 SVGAltGlyphElement.o
28:35.19 HTMLTrackElement.o
28:35.53 nsScriptElement.o
28:35.54 SVGAngle.o
28:37.77 nsScriptLoader.o
28:38.08 HTMLUnknownElement.o
28:38.48 SVGAnimateElement.o
28:39.88 nsStubDocumentObserver.o
28:39.98 CDATASection.o
28:39.98 ProcessingInstruction.o
28:40.49 SVGAnimateMotionElement.o
28:42.03 XMLStylesheetProcessingInstruction.o
28:43.18 SVGAnimateTransformElement.o
28:43.90 nsStubMutationObserver.o
28:44.07 nsStyleLinkElement.o
28:44.20 nsStyledElement.o
28:44.25 nsXMLElement.o
28:44.47 HTMLVideoElement.o
28:45.92 SVGAnimatedAngle.o
28:48.07 nsSyncLoadService.o
28:48.51 SVGAnimatedBoolean.o
28:48.57 MediaError.o
28:49.05 XMLDocument.o
28:49.06 nsXMLContentSink.o
28:50.51 SVGAnimatedEnumeration.o
28:51.20 nsTextFragment.o
28:52.46 SVGAnimatedInteger.o
28:53.32 RadioNodeList.o
28:53.34 nsTextNode.o
28:53.87 nsTraversal.o
28:53.89 nsXMLFragmentContentSink.o
28:54.53 SVGAnimatedLength.o
28:56.14 nsTreeSanitizer.o
28:56.52 SVGAnimatedLengthList.o
28:56.97 TextTrackManager.o
28:58.11 nsViewportInfo.o
28:58.83 SVGAnimatedNumber.o
28:59.02 nsXMLPrettyPrinter.o
28:59.96 TimeRanges.o
29:00.98 nsXHTMLContentSerializer.o
29:01.07 SVGAnimatedNumberList.o
29:01.55 nsXMLContentSerializer.o
29:03.21 SVGAnimatedPathSegList.o
29:03.98 UndoManager.o
29:04.00 nsXMLHttpRequest.o
29:05.29 SVGAnimatedPointList.o
29:06.06 nsXMLNameSpaceMap.o
29:07.36 SVGAnimatedPreserveAspectRatio.o
29:07.72 ValidityState.o
29:08.23 SVGAnimatedRect.o
29:09.62 XULDocument.o
29:09.62 nsXULCommandDispatcher.o
29:10.92 SVGAnimatedString.o
29:11.58 nsDOMStringMap.o
29:12.23 nsFormSubmission.o
29:12.52 SVGAnimatedTransformList.o
29:13.12 nsGenericHTMLElement.o
29:14.58 SVGAnimationElement.o
29:14.99 SVGAttrValueWrapper.o
29:16.42 nsGenericHTMLFrameElement.o
29:16.83 nsXULContextMenuBuilder.o
29:16.83 nsXULElement.o
29:18.31 SVGCircleElement.o
29:19.02 nsXULPopupListener.o
29:19.19 nsXULContentSink.o
29:20.77 SVGClipPathElement.o
29:21.54 nsXULControllers.o
29:23.50 SVGContentUtils.o
29:25.63 nsXULPrototypeCache.o
29:25.65 nsHTMLDNSPrefetch.o
29:26.16 SVGDefsElement.o
29:26.40 nsXULPrototypeDocument.o
29:29.59 nsIConstraintValidation.o
29:30.46 nsRadioVisitor.o
29:30.84 SVGDescElement.o
29:32.48 nsContentSupportMap.o
29:32.48 nsContentTestNode.o
29:33.04 nsTextEditorState.o
29:33.31 SVGElementFactory.o
29:34.22 nsInstantiationNode.o
29:34.83 SVGEllipseElement.o
29:34.96 nsRDFBinding.o
29:35.69 nsRDFConInstanceTestNode.o
29:36.02 nsRDFConMemberTestNode.o
29:36.36 nsRDFPropertyTestNode.o
29:36.79 nsRDFQuery.o
29:36.88 SVGFEBlendElement.o
29:37.25 nsResourceSet.o
29:37.66 nsRuleNetwork.o
29:37.84 nsTemplateMatch.o
29:37.85 nsTemplateRule.o
29:38.72 nsTreeRows.o
29:38.78 nsXMLBinding.o
29:39.64 SVGFEColorMatrixElement.o
29:40.04 nsXULContentBuilder.o
29:40.20 SVGFEComponentTransferElement.o
29:41.49 SVGFECompositeElement.o
29:41.91 nsXULContentUtils.o
29:43.06 nsFilteredContentIterator.o
29:43.06 nsTextServicesDocument.o
29:43.75 ChangeAttributeTxn.o
29:43.75 ChangeCSSInlineStyleTxn.o
29:44.25 CreateElementTxn.o
29:44.83 SVGFEConvolveMatrixElement.o
29:45.11 DeleteNodeTxn.o
29:45.58 nsXULSortService.o
29:47.17 DeleteRangeTxn.o
29:47.73 nsXULTemplateBuilder.o
29:48.12 SVGFEDiffuseLightingElement.o
29:49.04 DeleteTextTxn.o
29:49.08 nsXULTemplateQueryProcessorRDF.o
29:50.02 /opt/FirefoxSource/mozilla-release/editor/txtsvc/nsTextServicesDocument.cpp: In member function 'nsresult nsTextServicesDocument::GetUncollapsedSelection(nsITextServicesDocument::TSDBlockSelectionStatus*, int32_t*, int32_t*)':
29:50.02 Warning: -Wmaybe-uninitialized in /opt/FirefoxSource/mozilla-release/editor/txtsvc/nsTextServicesDocument.cpp: 'e2s1' may be used uninitialized in this function
29:50.02 /opt/FirefoxSource/mozilla-release/editor/txtsvc/nsTextServicesDocument.cpp:2826:3: warning: 'e2s1' may be used uninitialized in this function [-Wmaybe-uninitialized]
29:50.02 Warning: -Wmaybe-uninitialized in /opt/FirefoxSource/mozilla-release/editor/txtsvc/nsTextServicesDocument.cpp: 'e1s2' may be used uninitialized in this function
29:50.02 /opt/FirefoxSource/mozilla-release/editor/txtsvc/nsTextServicesDocument.cpp:2826:3: warning: 'e1s2' may be used uninitialized in this function [-Wmaybe-uninitialized]
29:50.02 SVGFEDisplacementMapElement.o
29:52.12 EditAggregateTxn.o
29:52.43 nsInternetCiter.o
29:52.43 nsPlaintextDataTransfer.o
29:52.88 nsPlaintextEditor.o
29:53.76 SVGFEDistantLightElement.o
29:54.24 nsXULTemplateQueryProcessorStorage.o
29:54.92 EditTxn.o
29:55.49 IMETextTxn.o
29:55.73 nsTextEditRules.o
29:55.76 InsertElementTxn.o
29:57.39 nsXULTemplateQueryProcessorXML.o
29:57.82 SVGFEDropShadowElement.o
29:58.56 InsertTextTxn.o
29:59.38 nsXULTemplateResultRDF.o
29:59.99 nsTextEditRulesBidi.o
30:00.57 JoinElementTxn.o
30:01.03 PlaceholderTxn.o
30:01.46 SVGFEFloodElement.o
30:02.65 nsXULTemplateResultSetRDF.o
30:03.00 SetDocTitleTxn.o
30:03.30 nsXULTemplateResultStorage.o
30:03.89 nsXULTemplateResultXML.o
30:04.21 nsTextEditUtils.o
30:04.49 nsXULTreeBuilder.o
30:05.47 SVGFEGaussianBlurElement.o
30:06.07 SplitElementTxn.o
30:08.00 nsEditor.o
30:08.88 nsEditorCommands.o
30:09.27 SVGFEImageElement.o
30:09.99 TextEditorTest.o
30:09.99 TypeInState.o
30:10.04 nsEditProperty.o
30:10.11 nsEditorController.o
30:12.18 nsHTMLAbsPosition.o
30:12.19 nsTransactionItem.o
30:12.19 nsTransactionList.o
30:12.47 nsHTMLAnonymousUtils.o
30:12.92 nsTransactionManager.o
30:13.16 SVGFEMergeElement.o
30:15.31 nsTransactionManagerFactory.o
30:15.79 nsEditorEventListener.o
30:15.87 nsHTMLCSSUtils.o
30:16.04 nsEditorUtils.o
30:16.22 nsTransactionStack.o
30:17.27 nsHTMLDataTransfer.o
30:17.65 SVGFEMergeNodeElement.o
30:18.90 nsHTMLEditRules.o
30:20.59 nsHTMLEditUtils.o
30:20.68 SVGFEMorphologyElement.o
30:20.77 nsSelectionState.o
30:23.53 SVGFEOffsetElement.o
30:23.76 nsStyleSheetTxns.o
30:24.49 SVGFEPointLightElement.o
30:27.29 nsHTMLEditor.o
30:28.29 SVGFESpecularLightingElement.o
30:28.87 nsComposeTxtSrvFilter.o
30:28.87 nsComposerCommands.o
30:29.43 SVGFESpotLightElement.o
30:29.75 nsComposerCommandsUpdater.o
30:29.86 nsHTMLEditorEventListener.o
30:31.29 nsComposerController.o
30:31.96 nsCSSRuleProcessor.o
30:31.96 nsFontFaceLoader.o
30:32.12 nsComposerDocumentCommands.o
30:32.54 nsComposerRegistration.o
30:33.31 SVGFETileElement.o
30:34.44 nsEditingSession.o
30:34.99 nsEditorSpellCheck.o
30:36.84 /opt/FirefoxSource/mozilla-release/layout/style/nsCSSRuleProcessor.cpp: In member function 'nsRestyleHint nsCSSRuleProcessor::HasStateDependentStyle(ElementDependentRuleProcessorData*, mozilla::dom::Element*, nsCSSPseudoElements::Type, mozilla::EventStates)':
30:36.84 Warning: -Wmaybe-uninitialized in /opt/FirefoxSource/mozilla-release/layout/style/nsCSSRuleProcessor.cpp: 'selectorForPseudo' may be used uninitialized in this function
30:36.84 /opt/FirefoxSource/mozilla-release/layout/style/nsCSSRuleProcessor.cpp:2682:52: warning: 'selectorForPseudo' may be used uninitialized in this function [-Wmaybe-uninitialized]
30:36.84 /opt/FirefoxSource/mozilla-release/layout/style/nsCSSRuleProcessor.cpp:2643:22: note: 'selectorForPseudo' was declared here
30:36.86 AnimationCommon.o
30:36.93 SVGFETurbulenceElement.o
30:38.09 nsHTMLEditorStyle.o
30:40.10 SVGFilterElement.o
30:40.16 nsHTMLInlineTableEditor.o
30:40.67 nsDocumentViewer.o
30:40.67 nsPresArena.o
30:41.37 CSS.o
30:44.03 SVGForeignObjectElement.o
30:44.62 nsHTMLObjectResizer.o
30:46.45 CSSRuleList.o
30:46.68 nsHTMLURIRefObject.o
30:47.28 SVGFragmentIdentifier.o
30:49.04 CSSStyleSheet.o
30:49.59 nsTableEditor.o
30:49.60 CSSVariableDeclarations.o
30:50.02 nsWSRunObject.o
30:50.17 nsPresShell.o
30:50.72 nsRefreshDriver.o
30:51.63 SVGGElement.o
30:54.33 SVGGradientElement.o
30:55.06 /opt/FirefoxSource/mozilla-release/layout/style/CSSStyleSheet.cpp: In member function 'bool nsMediaExpression::Matches(nsPresContext*, const nsCSSValue&) const':
30:55.06 Warning: -Wmaybe-uninitialized in /opt/FirefoxSource/mozilla-release/layout/style/CSSStyleSheet.cpp: 'cmp' may be used uninitialized in this function
30:55.06 /opt/FirefoxSource/mozilla-release/layout/style/CSSStyleSheet.cpp:277:21: warning: 'cmp' may be used uninitialized in this function [-Wmaybe-uninitialized]
30:55.07 CSSVariableResolver.o
30:56.32 CSSVariableValues.o
30:56.66 SVGGraphicsElement.o
30:57.12 CounterStyleManager.o
30:57.63 Declaration.o
30:59.60 SVGIFrameElement.o
31:00.78 SVGImageElement.o
31:01.00 ErrorReporter.o
31:02.06 ActiveLayerTracker.o
31:02.96 ImageLoader.o
31:04.22 SVGIntegerPairSMILType.o
31:05.12 Loader.o
31:06.68 SVGLength.o
31:06.83 SVGLengthList.o
31:07.77 DisplayItemClip.o
31:07.81 nsLineLayout.o
31:07.81 nsObjectFrame.o
31:09.17 MediaQueryList.o
31:09.53 SVGLengthListSMILType.o
31:11.75 DisplayListClipState.o
31:11.99 SVGLineElement.o
31:12.81 FrameChildList.o
31:14.40 SVGMPathElement.o
31:14.42 FrameLayerBuilder.o
31:14.71 StyleAnimationValue.o
31:17.28 StyleRule.o
31:17.75 SVGMarkerElement.o
31:17.76 FramePropertyTable.o
31:18.81 MathMLTextRunFactory.o
31:20.98 SVGMaskElement.o
31:21.06 ScrollbarActivity.o
31:22.21 /opt/FirefoxSource/mozilla-release/layout/style/StyleAnimationValue.cpp: In function 'void ExtractBorderColor(nsStyleContext*, const void*, mozilla::css::Side, mozilla::StyleAnimationValue&)':
31:22.21 Warning: -Wmaybe-uninitialized in /opt/FirefoxSource/mozilla-release/layout/style/StyleAnimationValue.cpp: 'color' may be used uninitialized in this function
31:22.21 /opt/FirefoxSource/mozilla-release/layout/style/StyleAnimationValue.cpp:3702:25: warning: 'color' may be used uninitialized in this function [-Wmaybe-uninitialized]
31:22.21 /opt/FirefoxSource/mozilla-release/layout/style/StyleAnimationValue.cpp:2726:11: note: 'color' was declared here
31:22.21 /opt/FirefoxSource/mozilla-release/layout/style/StyleAnimationValue.cpp: In static member function 'static bool mozilla::StyleAnimationValue::ExtractComputedValue(nsCSSProperty, nsStyleContext*, mozilla::StyleAnimationValue&)':
31:22.21 Warning: -Wmaybe-uninitialized in /opt/FirefoxSource/mozilla-release/layout/style/StyleAnimationValue.cpp: 'color' may be used uninitialized in this function
31:22.21 /opt/FirefoxSource/mozilla-release/layout/style/StyleAnimationValue.cpp:3702:25: warning: 'color' may be used uninitialized in this function [-Wmaybe-uninitialized]
31:22.21 /opt/FirefoxSource/mozilla-release/layout/style/StyleAnimationValue.cpp:2959:19: note: 'color' was declared here
31:22.22 nsAnimationManager.o
31:23.88 /opt/FirefoxSource/mozilla-release/layout/generic/MathMLTextRunFactory.cpp: In member function 'virtual void MathMLTextRunFactory::RebuildTextRun(nsTransformedTextRun*, gfxContext*)':
31:23.88 Warning: -Wmaybe-uninitialized in /opt/FirefoxSource/mozilla-release/layout/generic/MathMLTextRunFactory.cpp: 'mathVar' may be used uninitialized in this function
31:23.88 /opt/FirefoxSource/mozilla-release/layout/generic/MathMLTextRunFactory.cpp:692:10: warning: 'mathVar' may be used uninitialized in this function [-Wmaybe-uninitialized]
31:23.88 /opt/FirefoxSource/mozilla-release/layout/generic/MathMLTextRunFactory.cpp:590:11: note: 'mathVar' was declared here
31:23.88 StickyScrollContainer.o
31:24.15 SVGMatrix.o
31:24.59 GeometryUtils.o
31:25.09 MaskLayerImageCache.o
31:25.41 nsCSSAnonBoxes.o
31:26.58 TextOverflow.o
31:26.76 SVGMetadataElement.o
31:29.02 SVGMotionSMILAnimationFunction.o
31:29.23 PaintTracker.o
31:30.04 nsAbsoluteContainingBlock.o
31:30.09 nsCSSDataBlock.o
31:30.42 nsCSSKeywords.o
31:30.83 PositionedEventTargeting.o
31:30.93 RestyleManager.o
31:31.54 SVGMotionSMILAttr.o
31:33.33 nsCSSParser.o
31:33.60 nsCSSProps.o
31:34.51 SVGMotionSMILPathUtils.o
31:35.06 nsBRFrame.o
31:35.07 RestyleTracker.o
31:36.92 SVGMotionSMILType.o
31:38.28 nsBlockFrame.o
31:38.31 SVGNumberList.o
31:39.62 SVGNumberListSMILType.o
31:41.58 /opt/FirefoxSource/mozilla-release/layout/base/RestyleManager.cpp: In member function 'void mozilla::ElementRestyler::RestyleChildren(nsRestyleHint)':
31:41.58 Warning: -Wmaybe-uninitialized in /opt/FirefoxSource/mozilla-release/layout/base/RestyleManager.cpp: 'lastContinuation' may be used uninitialized in this function
31:41.58 /opt/FirefoxSource/mozilla-release/layout/base/RestyleManager.cpp:2622:41: warning: 'lastContinuation' may be used uninitialized in this function [-Wmaybe-uninitialized]
31:41.58 /opt/FirefoxSource/mozilla-release/layout/base/RestyleManager.cpp:2605:13: note: 'lastContinuation' was declared here
31:41.59 SelectionCarets.o
31:41.59 nsBlockReflowContext.o
31:42.15 SVGNumberPairSMILType.o
31:43.32 /opt/FirefoxSource/mozilla-release/layout/style/nsCSSParser.cpp: In member function 'bool {anonymous}::CSSParserImpl::ParseGridLine(nsCSSValue&)':
31:43.32 Warning: -Wmaybe-uninitialized in /opt/FirefoxSource/mozilla-release/layout/style/nsCSSParser.cpp: 'integer' may be used uninitialized in this function
31:43.32 /opt/FirefoxSource/mozilla-release/layout/style/nsCSSParser.cpp:8583:56: warning: 'integer' may be used uninitialized in this function [-Wmaybe-uninitialized]
31:43.32 /opt/FirefoxSource/mozilla-release/layout/style/nsCSSParser.cpp:8525:11: note: 'integer' was declared here
31:43.33 nsCSSPseudoClasses.o
31:44.30 SVGOrientSMILType.o
31:44.45 SVGPathData.o
31:44.75 StackArena.o
31:45.95 nsCSSPseudoElements.o
31:46.33 nsCSSRules.o
31:46.63 nsCSSScanner.o
31:47.11 SVGPathElement.o
31:49.08 /opt/FirefoxSource/mozilla-release/layout/generic/nsBlockFrame.cpp: In member function 'void nsBlockFrame::AddFrames(nsFrameList&, nsIFrame*)':
31:49.08 Warning: -Wmaybe-uninitialized in /opt/FirefoxSource/mozilla-release/layout/generic/nsBlockFrame.cpp: 'overflowLines' may be used uninitialized in this function
31:49.08 /opt/FirefoxSource/mozilla-release/layout/generic/nsBlockFrame.cpp:4959:72: warning: 'overflowLines' may be used uninitialized in this function [-Wmaybe-uninitialized]
31:49.09 nsBlockReflowState.o
31:50.21 TouchCaret.o
31:50.39 nsBidi.o
31:50.64 SVGPathSegListSMILType.o
31:51.60 nsCSSValue.o
31:52.35 nsBulletFrame.o
31:52.36 nsComputedDOMStyle.o
31:55.13 nsBidiPresUtils.o
31:55.18 SVGPathSegUtils.o
31:55.80 nsCSSColorUtils.o
31:55.86 nsCanvasFrame.o
31:56.19 nsDOMCSSAttrDeclaration.o
31:57.64 SVGPatternElement.o
31:58.87 SVGPointList.o
32:00.58 nsColumnSetFrame.o
32:01.31 nsCSSFrameConstructor.o
32:01.50 nsCSSRendering.o
32:01.86 SVGPointListSMILType.o
32:02.90 /opt/FirefoxSource/mozilla-release/layout/style/nsComputedDOMStyle.cpp: In member function 'mozilla::dom::CSSValue* nsComputedDOMStyle::DoGetOutlineWidth()':
32:02.90 Warning: -Wmaybe-uninitialized in /opt/FirefoxSource/mozilla-release/layout/style/nsComputedDOMStyle.cpp: 'width' may be used uninitialized in this function
32:02.90 /opt/FirefoxSource/mozilla-release/layout/style/nsComputedDOMStyle.cpp:2696:26: warning: 'width' may be used uninitialized in this function [-Wmaybe-uninitialized]
32:02.90 /opt/FirefoxSource/mozilla-release/layout/style/nsComputedDOMStyle.cpp: In member function 'mozilla::dom::CSSValue* nsComputedDOMStyle::DoGetTextDecorationColor()':
32:02.90 Warning: -Wmaybe-uninitialized in /opt/FirefoxSource/mozilla-release/layout/style/nsComputedDOMStyle.cpp: 'color' may be used uninitialized in this function
32:02.90 /opt/FirefoxSource/mozilla-release/layout/style/nsComputedDOMStyle.cpp:3121:29: warning: 'color' may be used uninitialized in this function [-Wmaybe-uninitialized]
32:02.90 /opt/FirefoxSource/mozilla-release/layout/style/nsComputedDOMStyle.cpp: In member function 'mozilla::dom::CSSValue* nsComputedDOMStyle::GetBorderColorFor(mozilla::css::Side)':
32:02.91 Warning: -Wmaybe-uninitialized in /opt/FirefoxSource/mozilla-release/layout/style/nsComputedDOMStyle.cpp: 'color' may be used uninitialized in this function
32:02.91 /opt/FirefoxSource/mozilla-release/layout/style/nsComputedDOMStyle.cpp:4426:29: warning: 'color' may be used uninitialized in this function [-Wmaybe-uninitialized]
32:02.92 nsDOMCSSDeclaration.o
32:04.45 SVGPolygonElement.o
32:05.33 nsContainerFrame.o
32:06.19 nsDOMCSSRGBColor.o
32:06.65 SVGPolylineElement.o
32:08.97 nsDOMCSSRect.o
32:09.29 nsFirstLetterFrame.o
32:09.58 SVGPreserveAspectRatio.o
32:09.67 nsDOMCSSValueList.o
32:10.32 nsHTMLCSSStyleSheet.o
32:11.09 nsHTMLStyleSheet.o
32:12.18 SVGRect.o
32:12.48 nsCSSRenderingBorders.o
32:13.72 nsLayoutStylesheetCache.o
32:14.15 nsFlexContainerFrame.o
32:14.45 SVGRectElement.o
32:16.87 SVGSVGElement.o
32:17.30 nsMediaFeatures.o
32:17.40 nsFloatManager.o
32:19.71 /opt/FirefoxSource/mozilla-release/layout/base/nsCSSRendering.cpp: In function 'bool _ZL14IsOpaqueBorderRK13nsStyleBorder.part.39(const nsStyleBorder&)':
32:19.71 Warning: -Wmaybe-uninitialized in /opt/FirefoxSource/mozilla-release/layout/base/nsCSSRendering.cpp: 'color' may be used uninitialized in this function
32:19.71 /opt/FirefoxSource/mozilla-release/layout/base/nsCSSRendering.cpp:1667:50: warning: 'color' may be used uninitialized in this function [-Wmaybe-uninitialized]
32:19.71 /opt/FirefoxSource/mozilla-release/layout/base/nsCSSRendering.cpp:1658:11: note: 'color' was declared here
32:19.71 /opt/FirefoxSource/mozilla-release/layout/base/nsCSSRendering.cpp: In static member function 'static void nsCSSRendering::PaintOutline(nsPresContext*, nsRenderingContext&, nsIFrame*, const nsRect&, const nsRect&, nsStyleContext*)':
32:19.71 Warning: -Wmaybe-uninitialized in /opt/FirefoxSource/mozilla-release/layout/base/nsCSSRendering.cpp: 'width' may be used uninitialized in this function
32:19.71 /opt/FirefoxSource/mozilla-release/layout/base/nsCSSRendering.cpp:852:65: warning: 'width' may be used uninitialized in this function [-Wmaybe-uninitialized]
32:19.71 /opt/FirefoxSource/mozilla-release/layout/base/nsCSSRendering.cpp: In static member function 'static void nsCSSRendering::PaintGradient(nsPresContext*, nsRenderingContext&, nsStyleGradient*, const nsRect&, const nsRect&, const nsRect&, const CSSIntRect&, const nsSize&)':
32:19.71 Warning: -Wmaybe-uninitialized in /opt/FirefoxSource/mozilla-release/layout/base/nsCSSRendering.cpp: 'position' may be used uninitialized in this function
32:19.71 /opt/FirefoxSource/mozilla-release/layout/base/nsCSSRendering.cpp:353:40: warning: 'position' may be used uninitialized in this function [-Wmaybe-uninitialized]
32:19.71 /opt/FirefoxSource/mozilla-release/layout/base/nsCSSRendering.cpp:2287:12: note: 'position' was declared here
32:19.71 /opt/FirefoxSource/mozilla-release/layout/base/nsCSSRendering.cpp: In static member function 'static void nsCSSRendering::PaintBackgroundWithSC(nsPresContext*, nsRenderingContext&, nsIFrame*, const nsRect&, const nsRect&, nsStyleContext*, const nsStyleBorder&, uint32_t, nsRect*, int32_t)':
32:19.71 Warning: -Wmaybe-uninitialized in /opt/FirefoxSource/mozilla-release/layout/base/nsCSSRendering.cpp: 'isSolidBorder' may be used uninitialized in this function
32:19.71 /opt/FirefoxSource/mozilla-release/layout/base/nsCSSRendering.cpp:2805:9: warning: 'isSolidBorder' may be used uninitialized in this function [-Wmaybe-uninitialized]
32:19.71 /opt/FirefoxSource/mozilla-release/layout/base/nsCSSRendering.cpp:2718:8: note: 'isSolidBorder' was declared here
32:19.71 Warning: -Wmaybe-uninitialized in /opt/FirefoxSource/mozilla-release/layout/base/nsCSSRendering.cpp: 'currentBackgroundClip' may be used uninitialized in this function
32:19.71 /opt/FirefoxSource/mozilla-release/layout/base/nsCSSRendering.cpp:2809:9: warning: 'currentBackgroundClip' may be used uninitialized in this function [-Wmaybe-uninitialized]
32:19.71 /opt/FirefoxSource/mozilla-release/layout/base/nsCSSRendering.cpp:2717:11: note: 'currentBackgroundClip' was declared here
32:19.72 nsCaret.o
32:19.93 SVGScriptElement.o
32:20.09 nsNthIndexCache.o
32:21.98 /opt/FirefoxSource/mozilla-release/layout/generic/nsFlexContainerFrame.cpp: In member function 'void nsFlexContainerFrame::DoFlexLayout(nsPresContext*, nsHTMLReflowMetrics&, const nsHTMLReflowState&, nsReflowStatus&, nscoord, nscoord, nsTArray<nsFlexContainerFrame::StrutInfo>&, const nsFlexContainerFrame::FlexboxAxisTracker&)':
32:21.98 Warning: -Wmaybe-uninitialized in /opt/FirefoxSource/mozilla-release/layout/generic/nsFlexContainerFrame.cpp: 'flexContainerAscent' may be used uninitialized in this function
32:21.98 /opt/FirefoxSource/mozilla-release/layout/generic/nsFlexContainerFrame.cpp:3392:3: warning: 'flexContainerAscent' may be used uninitialized in this function [-Wmaybe-uninitialized]
32:21.98 /opt/FirefoxSource/mozilla-release/layout/generic/nsFlexContainerFrame.cpp:3214:11: note: 'flexContainerAscent' was declared here
32:21.98 nsFontInflationData.o
32:22.42 nsROCSSPrimitiveValue.o
32:22.76 nsCounterManager.o
32:24.50 nsRuleData.o
32:24.61 nsFrame.o
32:25.14 SVGSetElement.o
32:26.19 nsRuleNode.o
32:27.12 nsStyleContext.o
32:27.58 nsDisplayList.o
32:27.93 nsFrameList.o
32:28.04 SVGStopElement.o
32:30.59 SVGStringList.o
32:30.88 In file included from ../../dist/include/nsAString.h:23:0,
32:30.88                  from ../../dist/include/nsSubstring.h:10,
32:30.88                  from ../../dist/include/nsString.h:12,
32:30.88                  from ../../dist/include/nsStringGlue.h:18,
32:30.88                  from ../../dist/include/nsHashKeys.h:18,
32:30.88                  from /opt/FirefoxSource/mozilla-release/layout/base/nsIPresShell.h:28,
32:30.88                  from /opt/FirefoxSource/mozilla-release/layout/base/nsPresContext.h:16,
32:30.88                  from /opt/FirefoxSource/mozilla-release/layout/base/../style/nsRuleNode.h:14,
32:30.88                  from /opt/FirefoxSource/mozilla-release/layout/base/../style/nsStyleContext.h:11,
32:30.88                  from /opt/FirefoxSource/mozilla-release/layout/base/../generic/nsIFrame.h:25,
32:30.88                  from /opt/FirefoxSource/mozilla-release/layout/base/nsGenConList.h:11,
32:30.88                  from /opt/FirefoxSource/mozilla-release/layout/base/nsCounterManager.h:13,
32:30.88                  from /opt/FirefoxSource/mozilla-release/layout/base/nsCounterManager.cpp:9:
32:30.88 ../../dist/include/nsTSubstring.h: In member function 'void nsCounterUseNode::GetText(nsString&)':
32:30.88 Warning: -Wmaybe-uninitialized in /opt/FirefoxSource/mozilla-release/objdir-droid/dist/include/nsTSubstring.h: 'separator' may be used uninitialized in this function
32:30.88 ../../dist/include/nsTSubstring.h:526:40: warning: 'separator' may be used uninitialized in this function [-Wmaybe-uninitialized]
32:30.88 /opt/FirefoxSource/mozilla-release/layout/base/nsCounterManager.cpp:94:21: note: 'separator' was declared here
32:30.89 nsDisplayListInvalidation.o
32:32.95 SVGStyleElement.o
32:34.43 SVGSwitchElement.o
32:37.68 SVGSymbolElement.o
32:38.20 /opt/FirefoxSource/mozilla-release/layout/style/nsRuleNode.cpp: In static member function 'static nscoord nsRuleNode::CalcFontPointSize(int32_t, int32_t, nsPresContext*, nsFontSizeType)':
32:38.20 Warning: -Wmaybe-uninitialized in /opt/FirefoxSource/mozilla-release/layout/style/nsRuleNode.cpp: 'column' may be used uninitialized in this function
32:38.20 /opt/FirefoxSource/mozilla-release/layout/style/nsRuleNode.cpp:2884:55: warning: 'column' may be used uninitialized in this function [-Wmaybe-uninitialized]
32:38.20 /opt/FirefoxSource/mozilla-release/layout/style/nsRuleNode.cpp:2862:12: note: 'column' was declared here
32:38.20 /opt/FirefoxSource/mozilla-release/layout/style/nsRuleNode.cpp: In static member function 'static bool nsRuleNode::HasAuthorSpecifiedRules(nsStyleContext*, uint32_t, bool)':
32:38.20 Warning: -Wmaybe-uninitialized in /opt/FirefoxSource/mozilla-release/layout/style/nsRuleNode.cpp: 'textShadowOffset' may be used uninitialized in this function
32:38.20 /opt/FirefoxSource/mozilla-release/layout/style/nsRuleNode.cpp:9096:65: warning: 'textShadowOffset' may be used uninitialized in this function [-Wmaybe-uninitialized]
32:38.20 Warning: -Wmaybe-uninitialized in /opt/FirefoxSource/mozilla-release/layout/style/nsRuleNode.cpp: 'paddingOffset' may be used uninitialized in this function
32:38.20 /opt/FirefoxSource/mozilla-release/layout/style/nsRuleNode.cpp:9092:65: warning: 'paddingOffset' may be used uninitialized in this function [-Wmaybe-uninitialized]
32:38.20 Warning: -Wmaybe-uninitialized in /opt/FirefoxSource/mozilla-release/layout/style/nsRuleNode.cpp: 'borderOffset' may be used uninitialized in this function
32:38.20 /opt/FirefoxSource/mozilla-release/layout/style/nsRuleNode.cpp:9088:63: warning: 'borderOffset' may be used uninitialized in this function [-Wmaybe-uninitialized]
32:38.21 nsStyleCoord.o
32:40.22 /opt/FirefoxSource/mozilla-release/layout/generic/nsFrame.cpp: In static member function 'static int32_t nsFrame::GetLineNumber(nsIFrame*, bool, nsIFrame**)':
32:40.22 Warning: -Wmaybe-uninitialized in /opt/FirefoxSource/mozilla-release/layout/generic/nsFrame.cpp: 'thisBlock' may be used uninitialized in this function
32:40.22 /opt/FirefoxSource/mozilla-release/layout/generic/nsFrame.cpp:6747:42: warning: 'thisBlock' may be used uninitialized in this function [-Wmaybe-uninitialized]
32:40.22 /opt/FirefoxSource/mozilla-release/layout/generic/nsFrame.cpp: In member function 'nsresult nsIFrame::PeekOffsetParagraph(nsPeekOffsetStruct*)':
32:40.22 Warning: -Wmaybe-uninitialized in /opt/FirefoxSource/mozilla-release/layout/generic/nsFrame.cpp: 'blockFrameOrBR.nsContentAndOffset::mOffset' may be used uninitialized in this function
32:40.22 /opt/FirefoxSource/mozilla-release/layout/generic/nsFrame.cpp:6225:54: warning: 'blockFrameOrBR.nsContentAndOffset::mOffset' may be used uninitialized in this function [-Wmaybe-uninitialized]
32:40.22 /opt/FirefoxSource/mozilla-release/layout/generic/nsFrame.cpp: In member function 'bool nsIFrame::FinishAndStoreOverflow(nsOverflowAreas&, nsSize, nsSize*)':
32:40.22 Warning: -Wmaybe-uninitialized in /opt/FirefoxSource/mozilla-release/layout/generic/nsFrame.cpp: 'width' may be used uninitialized in this function
32:40.22 /opt/FirefoxSource/mozilla-release/layout/generic/nsFrame.cpp:7189:37: warning: 'width' may be used uninitialized in this function [-Wmaybe-uninitialized]
32:40.22 /opt/FirefoxSource/mozilla-release/layout/generic/nsFrame.cpp:7110:11: note: 'width' was declared here
32:40.23 nsFrameSetFrame.o
32:41.73 /opt/FirefoxSource/mozilla-release/layout/style/nsStyleContext.cpp: In member function 'nsChangeHint nsStyleContext::CalcStyleDifference(nsStyleContext*, nsChangeHint)':
32:41.73 Warning: -Wmaybe-uninitialized in /opt/FirefoxSource/mozilla-release/layout/style/nsStyleContext.cpp: 'otherVisDecColor' may be used uninitialized in this function
32:41.74 /opt/FirefoxSource/mozilla-release/layout/style/nsStyleContext.cpp:610:7: warning: 'otherVisDecColor' may be used uninitialized in this function [-Wmaybe-uninitialized]
32:41.74 /opt/FirefoxSource/mozilla-release/layout/style/nsStyleContext.cpp:604:32: note: 'otherVisDecColor' was declared here
32:41.74 Warning: -Wmaybe-uninitialized in /opt/FirefoxSource/mozilla-release/layout/style/nsStyleContext.cpp: 'thisVisDecColor' may be used uninitialized in this function
32:41.74 /opt/FirefoxSource/mozilla-release/layout/style/nsStyleContext.cpp:610:7: warning: 'thisVisDecColor' may be used uninitialized in this function [-Wmaybe-uninitialized]
32:41.74 /opt/FirefoxSource/mozilla-release/layout/style/nsStyleContext.cpp:604:15: note: 'thisVisDecColor' was declared here
32:41.74 Warning: -Wmaybe-uninitialized in /opt/FirefoxSource/mozilla-release/layout/style/nsStyleContext.cpp: 'otherColor' may be used uninitialized in this function
32:41.74 /opt/FirefoxSource/mozilla-release/layout/style/nsStyleContext.cpp:580:7: warning: 'otherColor' may be used uninitialized in this function [-Wmaybe-uninitialized]
32:41.74 /opt/FirefoxSource/mozilla-release/layout/style/nsStyleContext.cpp:579:26: note: 'otherColor' was declared here
32:41.74 Warning: -Wmaybe-uninitialized in /opt/FirefoxSource/mozilla-release/layout/style/nsStyleContext.cpp: 'otherColor' may be used uninitialized in this function
32:41.74 /opt/FirefoxSource/mozilla-release/layout/style/nsStyleContext.cpp:567:9: warning: 'otherColor' may be used uninitialized in this function [-Wmaybe-uninitialized]
32:41.74 /opt/FirefoxSource/mozilla-release/layout/style/nsStyleContext.cpp:564:28: note: 'otherColor' was declared here
32:41.74 Warning: -Wmaybe-uninitialized in /opt/FirefoxSource/mozilla-release/layout/style/nsStyleContext.cpp: 'thisColor' may be used uninitialized in this function
32:41.74 /opt/FirefoxSource/mozilla-release/layout/style/nsStyleContext.cpp:567:9: warning: 'thisColor' may be used uninitialized in this function [-Wmaybe-uninitialized]
32:41.74 /opt/FirefoxSource/mozilla-release/layout/style/nsStyleContext.cpp:564:17: note: 'thisColor' was declared here
32:41.74 nsStyleSet.o
32:42.58 SVGTSpanElement.o
32:43.00 nsStyleStruct.o
32:43.25 nsFrameState.o
32:45.83 /opt/FirefoxSource/mozilla-release/layout/base/nsDisplayList.cpp: In static member function 'static bool nsDisplayBackgroundImage::AppendBackgroundItemsToTop(nsDisplayListBuilder*, nsIFrame*, nsDisplayList*)':
32:45.83 Warning: -Wmaybe-uninitialized in /opt/FirefoxSource/mozilla-release/layout/base/nsDisplayList.cpp: 'color' may be used uninitialized in this function
32:45.83 /opt/FirefoxSource/mozilla-release/layout/base/nsDisplayList.cpp:1880:3: warning: 'color' may be used uninitialized in this function [-Wmaybe-uninitialized]
32:45.84 nsFrameManager.o
32:45.95 SVGTests.o
32:49.43 SVGTextContentElement.o
32:50.16 nsStyleTransformMatrix.o
32:50.17 nsFrameTraversal.o
32:50.39 nsFrameUtil.o
32:53.35 SVGTextElement.o
32:54.02 nsGenConList.o
32:55.23 nsGfxScrollFrame.o
32:56.95 nsLayoutDebugger.o
32:57.28 /opt/FirefoxSource/mozilla-release/layout/style/nsStyleStruct.cpp: In member function 'nsChangeHint nsStyleTextReset::CalcDifference(const nsStyleTextReset&) const':
32:57.28 Warning: -Wmaybe-uninitialized in /opt/FirefoxSource/mozilla-release/layout/style/nsStyleStruct.cpp: 'otherDecColor' may be used uninitialized in this function
32:57.28 /opt/FirefoxSource/mozilla-release/layout/style/nsStyleStruct.cpp:3037:5: warning: 'otherDecColor' may be used uninitialized in this function [-Wmaybe-uninitialized]
32:57.28 Warning: -Wmaybe-uninitialized in /opt/FirefoxSource/mozilla-release/layout/style/nsStyleStruct.cpp: 'decColor' may be used uninitialized in this function
32:57.28 /opt/FirefoxSource/mozilla-release/layout/style/nsStyleStruct.cpp:3037:5: warning: 'decColor' may be used uninitialized in this function [-Wmaybe-uninitialized]
32:57.28 nsStyleUtil.o
32:58.35 SVGTextPathElement.o
32:58.72 nsGridContainerFrame.o
32:59.12 nsTransitionManager.o
33:00.50 nsLayoutHistoryState.o
33:02.58 SVGTextPositioningElement.o
33:04.70 nsLayoutUtils.o
33:05.40 nsPresContext.o
33:06.48 SVGTitleElement.o
33:07.78 nsQuoteList.o
33:09.23 SVGTransform.o
33:09.56 nsHTMLCanvasFrame.o
33:11.90 nsHTMLReflowMetrics.o
33:12.03 SVGTransformList.o
33:14.49 SVGTransformListParser.o
33:15.33 SVGTransformListSMILType.o
33:16.45 nsHTMLReflowState.o
33:16.69 SVGTransformableElement.o
33:17.52 SVGUseElement.o
33:17.87 /opt/FirefoxSource/mozilla-release/layout/base/nsLayoutUtils.cpp: In static member function 'static nscoord nsLayoutUtils::ComputeWidthValue(nsRenderingContext*, nsIFrame*, nscoord, nscoord, nscoord, const nsStyleCoord&)':
33:17.87 Warning: -Wmaybe-uninitialized in /opt/FirefoxSource/mozilla-release/layout/base/nsLayoutUtils.cpp: 'result' may be used uninitialized in this function
33:17.87 /opt/FirefoxSource/mozilla-release/layout/base/nsLayoutUtils.cpp:3971:11: warning: 'result' may be used uninitialized in this function [-Wmaybe-uninitialized]
33:17.89 nsStyleChangeList.o
33:17.90 nsButtonFrameRenderer.o
33:17.90 nsColorControlFrame.o
33:18.74 nsImageFrame.o
33:20.70 nsStyleSheetService.o
33:21.26 SVGViewBoxSMILType.o
33:21.68 nsComboboxControlFrame.o
33:24.26 /opt/FirefoxSource/mozilla-release/layout/generic/nsHTMLReflowState.cpp: In member function 'void nsHTMLReflowState::InitConstraints(nsPresContext*, nscoord, nscoord, const nsMargin*, const nsMargin*, nsIAtom*)':
33:24.26 Warning: -Wmaybe-uninitialized in /opt/FirefoxSource/mozilla-release/layout/generic/nsHTMLReflowState.cpp: 'fType' may be used uninitialized in this function
33:24.26 /opt/FirefoxSource/mozilla-release/layout/generic/nsHTMLReflowState.cpp:1992:37: warning: 'fType' may be used uninitialized in this function [-Wmaybe-uninitialized]
33:24.26 nsImageMap.o
33:24.55 SVGViewElement.o
33:25.45 nsFieldSetFrame.o
33:25.46 /opt/FirefoxSource/mozilla-release/layout/base/nsStyleSheetService.cpp: In member function 'virtual nsresult nsStyleSheetService::UnregisterSheet(nsIURI*, uint32_t)':
33:25.46 Warning: -Wmaybe-uninitialized in /opt/FirefoxSource/mozilla-release/layout/base/nsStyleSheetService.cpp: 'message' may be used uninitialized in this function
33:25.46 /opt/FirefoxSource/mozilla-release/layout/base/nsStyleSheetService.cpp:266:51: warning: 'message' may be used uninitialized in this function [-Wmaybe-uninitialized]
33:25.47 nsInlineFrame.o
33:26.51 SVGZoomEvent.o
33:28.95 nsISVGPoint.o
33:29.65 nsSVGAngle.o
33:31.02 nsIntervalSet.o
33:31.25 nsFileControlFrame.o
33:31.67 nsFormControlFrame.o
33:32.25 nsSVGAnimatedTransformList.o
33:34.89 nsSVGBoolean.o
33:35.52 nsLeafFrame.o
33:35.76 nsLineBox.o
33:35.78 nsPageContentFrame.o
33:36.22 nsGfxButtonControlFrame.o
33:37.45 nsSVGClass.o
33:38.49 nsPageFrame.o
33:38.96 nsPlaceholderFrame.o
33:39.49 /opt/FirefoxSource/mozilla-release/content/svg/content/src/nsSVGBoolean.cpp: In member function 'nsresult nsSVGBoolean::SetBaseValueAtom(const nsIAtom*, nsSVGElement*)':
33:39.49 Warning: -Wmaybe-uninitialized in /opt/FirefoxSource/mozilla-release/content/svg/content/src/nsSVGBoolean.cpp: 'val' may be used uninitialized in this function
33:39.49 /opt/FirefoxSource/mozilla-release/content/svg/content/src/nsSVGBoolean.cpp:68:24: warning: 'val' may be used uninitialized in this function [-Wmaybe-uninitialized]
33:39.50 nsSVGDataParser.o
33:39.52 nsGfxCheckboxControlFrame.o
33:41.47 nsSelection.o
33:41.68 nsSVGElement.o
33:42.81 nsSVGEnum.o
33:42.85 nsGfxRadioControlFrame.o
33:43.09 BasicTableLayoutStrategy.o
33:43.09 FixedTableLayoutStrategy.o
33:45.13 nsSimplePageSequenceFrame.o
33:46.56 SpanningCellSorter.o
33:46.57 nsHTMLButtonControlFrame.o
33:48.62 nsSVGFeatures.o
33:50.27 nsCellMap.o
33:50.33 nsImageControlFrame.o
33:50.86 nsSVGFilters.o
33:51.01 nsTableCellFrame.o
33:52.21 nsSVGInteger.o
33:53.98 nsLegendFrame.o
33:54.00 nsSplittableFrame.o
33:55.56 nsTableColFrame.o
33:56.87 nsSVGIntegerPair.o
33:57.53 nsListControlFrame.o
33:58.80 nsSubDocumentFrame.o
33:59.21 nsSVGLength2.o
34:00.44 nsTableColGroupFrame.o
34:01.34 nsMeterFrame.o
34:01.48 nsTextFrame.o
34:01.77 nsSVGNumber2.o
34:03.92 nsTableFrame.o
34:05.39 nsSVGNumberPair.o
34:06.81 nsTextFrameUtils.o
34:07.41 nsTableOuterFrame.o
34:08.19 nsSVGPathDataParser.o
34:08.97 nsNumberControlFrame.o
34:10.67 nsSVGPathGeometryElement.o
34:13.23 nsSVGPolyElement.o
34:13.47 nsProgressFrame.o
34:15.35 /opt/FirefoxSource/mozilla-release/layout/tables/nsTableFrame.cpp: In member function 'void nsTableFrame::HomogenousInsertFrames(nsIFrame::ChildListID, nsIFrame*, nsFrameList&)':
34:15.35 Warning: -Wmaybe-uninitialized in /opt/FirefoxSource/mozilla-release/layout/tables/nsTableFrame.cpp: 'content' may be used uninitialized in this function
34:15.35 /opt/FirefoxSource/mozilla-release/layout/tables/nsTableFrame.cpp:2343:59: warning: 'content' may be used uninitialized in this function [-Wmaybe-uninitialized]
34:15.35 /opt/FirefoxSource/mozilla-release/layout/tables/nsTableFrame.cpp:2337:19: note: 'content' was declared here
34:15.37 nsTablePainter.o
34:16.65 nsSVGString.o
34:16.90 nsTextRunTransformations.o
34:18.80 nsVideoFrame.o
34:18.82 nsRangeFrame.o
34:19.59 nsSVGTransform.o
34:19.67 /opt/FirefoxSource/mozilla-release/layout/tables/nsTableOuterFrame.cpp: In member function 'virtual void nsTableOuterFrame::Reflow(nsPresContext*, nsHTMLReflowMetrics&, const nsHTMLReflowState&, nsReflowStatus&)':
34:19.67 Warning: -Wmaybe-uninitialized in /opt/FirefoxSource/mozilla-release/layout/tables/nsTableOuterFrame.cpp: 'captionFirstReflow' may be used uninitialized in this function
34:19.67 /opt/FirefoxSource/mozilla-release/layout/tables/nsTableOuterFrame.cpp:1036:59: warning: 'captionFirstReflow' may be used uninitialized in this function [-Wmaybe-uninitialized]
34:19.67 /opt/FirefoxSource/mozilla-release/layout/tables/nsTableOuterFrame.cpp:903:8: note: 'captionFirstReflow' was declared here
34:19.68 nsTableRowFrame.o
34:21.71 nsSVGViewBox.o
34:21.87 nsViewportFrame.o
34:23.24 nsSelectsAreaFrame.o
34:23.26 nsTableRowGroupFrame.o
34:27.57 SVGFEContainerFrame.o
34:27.57 SVGFEImageFrame.o
34:28.98 nsTextControlFrame.o
34:30.80 nsBox.o
34:30.80 nsBoxFrame.o
34:31.23 SVGFELeafFrame.o
34:31.71 RenderFrameChild.o
34:31.72 RenderFrameParent.o
34:34.55 nsBoxLayout.o
34:34.73 SVGFEUnstyledLeafFrame.o
34:38.30 SVGTextFrame.o
34:39.29 nsMathMLChar.o
34:39.30 nsMathMLContainerFrame.o
34:39.34 nsBoxLayoutState.o
34:41.78 nsBoxObject.o
34:41.81 SVGViewFrame.o
34:42.70 inCSSValueSearch.o
34:42.71 inDOMUtils.o
34:42.95 nsButtonBoxFrame.o
34:44.79 nsMathMLFrame.o
34:45.37 inDOMView.o
34:46.55 nsContainerBoxObject.o
34:50.05 nsFilterInstance.o
34:50.13 nsMathMLOperators.o
34:50.18 inDeepTreeWalker.o
34:50.95 nsDeckFrame.o
34:52.93 inFlasher.o
34:53.60 nsSVGAFrame.o
34:54.50 nsMathMLSelectedFrame.o
34:54.59 nsDocElementBoxFrame.o
34:55.19 inLayoutUtils.o
34:55.63 nsMathMLTokenFrame.o
34:58.21 nsSVGClipPathFrame.o
34:58.24 inSearchLoop.o
34:58.27 nsGroupBoxFrame.o
34:59.92 nsMathMLmactionFrame.o
35:01.02 nsFontFace.o
35:01.23 nsFontFaceList.o
35:01.69 nsSVGContainerFrame.o
35:02.14 nsImageBoxFrame.o
35:04.52 nsMathMLmencloseFrame.o
35:05.72 nsSVGEffects.o
35:05.86 nsLeafBoxFrame.o
35:07.83 nsSVGFilterFrame.o
35:08.33 nsMathMLmfencedFrame.o
35:09.87 nsMathMLmfracFrame.o
35:10.45 nsListBoxBodyFrame.o
35:12.30 nsSVGFilterInstance.o
35:13.20 nsListBoxLayout.o
35:14.09 nsMathMLmmultiscriptsFrame.o
35:14.28 nsMathMLmoFrame.o
35:16.43 nsSVGForeignObjectFrame.o
35:18.09 nsListBoxObject.o
35:18.52 nsSVGGFrame.o
35:18.78 nsMathMLmpaddedFrame.o
35:20.53 nsListItemFrame.o
35:20.86 nsPrintData.o
35:20.86 nsPrintEngine.o
35:22.64 nsSVGGenericContainerFrame.o
35:22.99 nsMathMLmphantomFrame.o
35:23.19 nsMenuBarFrame.o
35:23.34 nsPagePrintTimer.o
35:26.11 nsSVGGradientFrame.o
35:26.71 nsMenuBarListener.o
35:26.92 nsMathMLmrootFrame.o
35:28.77 nsSVGImageFrame.o
35:29.54 nsPrintObject.o
35:30.38 nsMenuBoxObject.o
35:30.70 nsMathMLmrowFrame.o
35:32.19 nsPrintPreviewListener.o
35:32.90 nsSVGInnerSVGFrame.o
35:33.31 nsMenuFrame.o
35:34.63 nsMathMLmspaceFrame.o
35:36.02 nsMenuPopupFrame.o
35:37.07 nsMathMLmsqrtFrame.o
35:37.50 nsSVGIntegrationUtils.o
35:38.44 nsContentDLF.o
35:38.44 nsLayoutModule.o
35:40.80 nsMathMLmtableFrame.o
35:41.17 nsPopupBoxObject.o
35:41.50 nsLayoutStatics.o
35:41.51 nsSVGMarkerFrame.o
35:44.41 nsMathMLmunderoverFrame.o
35:46.10 nsSVGMaskFrame.o
35:46.80 nsPopupSetFrame.o
35:49.84 nsMathMLsemanticsFrame.o
35:49.90 nsProgressMeterFrame.o
35:50.26 nsSVGOuterSVGFrame.o
35:52.64 nsRepeatService.o
35:54.24 nsSVGPaintServerFrame.o
35:55.54 nsResizerFrame.o
35:55.83 nsRootBoxFrame.o
35:57.56 nsSVGPathGeometryFrame.o
35:59.42 nsDocShell.o
35:59.42 LoadContext.o
35:59.74 nsScrollBoxFrame.o
36:01.00 nsSVGPatternFrame.o
36:01.83 nsSVGStopFrame.o
36:02.49 nsScrollBoxObject.o
36:05.48 nsScrollbarButtonFrame.o
36:06.04 nsSVGSwitchFrame.o
36:06.09 nsScrollbarFrame.o
36:08.07 nsSVGUseFrame.o
36:09.20 nsSliderFrame.o
36:09.48 nsSVGUtils.o
36:12.35 nsSplitterFrame.o
36:13.35 nsSprocketLayout.o
36:16.33 LoadInfo.o
36:17.18 nsStackFrame.o
36:18.17 nsSHEntry.o
36:18.17 nsSHEntryShared.o
36:18.78 SerializedLoadContext.o
36:18.93 nsStackLayout.o
36:19.04 nsAboutRedirector.o
36:19.40 nsSHTransaction.o
36:20.45 nsDSURIContentListener.o
36:20.48 /opt/FirefoxSource/mozilla-release/layout/xul/nsSprocketLayout.cpp: In member function 'void nsSprocketLayout::AlignChildren(nsIFrame*, nsBoxLayoutState&)':
36:20.48 Warning: -Wmaybe-uninitialized in /opt/FirefoxSource/mozilla-release/layout/xul/nsSprocketLayout.cpp: 'y' may be used uninitialized in this function
36:20.48 /opt/FirefoxSource/mozilla-release/layout/xul/nsSprocketLayout.cpp:973:22: warning: 'y' may be used uninitialized in this function [-Wmaybe-uninitialized]
36:20.48 Warning: -Wmaybe-uninitialized in /opt/FirefoxSource/mozilla-release/layout/xul/nsSprocketLayout.cpp: 'x' may be used uninitialized in this function
36:20.48 /opt/FirefoxSource/mozilla-release/layout/xul/nsSprocketLayout.cpp:993:22: warning: 'x' may be used uninitialized in this function [-Wmaybe-uninitialized]
36:20.48 Warning: -Wmaybe-uninitialized in /opt/FirefoxSource/mozilla-release/layout/xul/nsSprocketLayout.cpp: 'isLTR' may be used uninitialized in this function
36:20.48 /opt/FirefoxSource/mozilla-release/layout/xul/nsSprocketLayout.cpp:989:45: warning: 'isLTR' may be used uninitialized in this function [-Wmaybe-uninitialized]
36:20.48 Warning: -Wmaybe-uninitialized in /opt/FirefoxSource/mozilla-release/layout/xul/nsSprocketLayout.cpp: 'maxAscent' may be used uninitialized in this function
36:20.48 /opt/FirefoxSource/mozilla-release/layout/xul/nsSprocketLayout.cpp:967:54: warning: 'maxAscent' may be used uninitialized in this function [-Wmaybe-uninitialized]
36:20.49 nsTextBoxFrame.o
36:21.22 nsDefaultURIFixup.o
36:21.33 nsSHistory.o
36:22.33 nsTitleBarFrame.o
36:23.35 nsXULLabelFrame.o
36:23.54 nsDocShellEditorData.o
36:24.12 nsXULPopupManager.o
36:27.22 nsDocShellEnumerator.o
36:27.23 /opt/FirefoxSource/mozilla-release/layout/xul/nsTextBoxFrame.cpp: In member function 'void nsTextBoxFrame::DrawText(nsRenderingContext&, const nsRect&, const nsRect&, const nscolor*)':
36:27.23 Warning: -Wmaybe-uninitialized in /opt/FirefoxSource/mozilla-release/layout/xul/nsTextBoxFrame.cpp: 'underColor' may be used uninitialized in this function
36:27.23 /opt/FirefoxSource/mozilla-release/layout/xul/nsTextBoxFrame.cpp:488:43: warning: 'underColor' may be used uninitialized in this function [-Wmaybe-uninitialized]
36:27.23 Warning: -Wmaybe-uninitialized in /opt/FirefoxSource/mozilla-release/layout/xul/nsTextBoxFrame.cpp: 'overColor' may be used uninitialized in this function
36:27.23 /opt/FirefoxSource/mozilla-release/layout/xul/nsTextBoxFrame.cpp:495:42: warning: 'overColor' may be used uninitialized in this function [-Wmaybe-uninitialized]
36:27.23 Warning: -Wmaybe-uninitialized in /opt/FirefoxSource/mozilla-release/layout/xul/nsTextBoxFrame.cpp: 'strikeColor' may be used uninitialized in this function
36:27.23 /opt/FirefoxSource/mozilla-release/layout/xul/nsTextBoxFrame.cpp:573:37: warning: 'strikeColor' may be used uninitialized in this function [-Wmaybe-uninitialized]
36:27.23 Warning: -Wmaybe-uninitialized in /opt/FirefoxSource/mozilla-release/layout/xul/nsTextBoxFrame.cpp: 'strikeStyle' may be used uninitialized in this function
36:27.23 /opt/FirefoxSource/mozilla-release/layout/xul/nsTextBoxFrame.cpp:573:37: warning: 'strikeStyle' may be used uninitialized in this function [-Wmaybe-uninitialized]
36:27.23 Warning: -Wmaybe-uninitialized in /opt/FirefoxSource/mozilla-release/layout/xul/nsTextBoxFrame.cpp: 'underStyle' may be used uninitialized in this function
36:27.23 /opt/FirefoxSource/mozilla-release/layout/xul/nsTextBoxFrame.cpp:488:43: warning: 'underStyle' may be used uninitialized in this function [-Wmaybe-uninitialized]
36:27.24 Warning: -Wmaybe-uninitialized in /opt/FirefoxSource/mozilla-release/layout/xul/nsTextBoxFrame.cpp: 'overStyle' may be used uninitialized in this function
36:27.24 /opt/FirefoxSource/mozilla-release/layout/xul/nsTextBoxFrame.cpp:495:42: warning: 'overStyle' may be used uninitialized in this function [-Wmaybe-uninitialized]
36:27.24 nsXULTooltipListener.o
36:27.31 nsDocShellLoadInfo.o
36:27.90 nsDocShellTransferableHooks.o
36:27.96 nsDownloadHistory.o
36:28.21 nsWebNavigationInfo.o
36:28.48 nsDocShellModule.o
36:29.63 nsAutoWindowStateHelper.o
36:29.63 nsDialogParamBlock.o
36:29.88 nsWindowWatcher.o
36:30.98 nsAppStartupNotifier.o
36:31.24 nsFind.o
36:31.24 nsWebBrowserFind.o
36:31.39 nsWebBrowserPersist.o
36:32.74 nsBaseCommandController.o
36:32.74 nsCommandGroup.o
36:33.14 nsCommandManager.o
36:33.86 nsCommandParams.o
36:34.36 nsControllerCommandTable.o
36:34.87 nsPrintProgress.o
36:34.87 nsPrintProgressParams.o
36:35.72 nsPrintingPromptService.o
36:35.94 nsEmbeddingModule.o
36:36.82 nsCommandHandler.o
36:36.82 nsContextMenuInfo.o
36:36.90 nsWebBrowserModule.o
36:37.93 nsDocShellTreeOwner.o
36:38.18 nsEmbedStream.o
36:38.22 nsAppShellFactory.o
36:38.22 nsAppShellService.o
36:38.70 nsAppShellWindowEnumerator.o
36:39.22 nsChromeTreeOwner.o
36:40.56 nsWebBrowser.o
36:40.71 nsContentTreeOwner.o
36:40.96 nsWebShellWindow.o
36:41.07 nsWebBrowserContentPolicy.o
36:43.20 nsWindowMediator.o
36:44.03 nsXULWindow.o
36:44.86 ANPCanvas.o
36:44.86 ANPPaint.o
36:45.44 ANPPath.o
36:45.90 ANPTypeface.o
36:46.27 CharDistribution.o
36:46.27 JpCntx.o
36:46.33 SkANP.o
36:46.60 LangBulgarianModel.o
36:46.74 LangCyrillicModel.o
36:46.77 /opt/FirefoxSource/mozilla-release/other-licenses/skia-npapi/ANPTypeface.cpp: In function 'int32_t anp_getFontPath(const ANPTypeface*, char*, int32_t, int32_t*)':
36:46.77 Warning: -Wunused-variable in /opt/FirefoxSource/mozilla-release/other-licenses/skia-npapi/ANPTypeface.cpp: unused variable 'stream'
36:46.77 /opt/FirefoxSource/mozilla-release/other-licenses/skia-npapi/ANPTypeface.cpp:63:15: warning: unused variable 'stream' [-Wunused-variable]
36:46.87 LangGreekModel.o
36:46.97 LangHebrewModel.o
36:47.07 LangHungarianModel.o
36:47.17 LangThaiModel.o
36:47.21 nsBig5Prober.o
36:47.30 nsCharSetProber.o
36:47.31 nsEUCJPProber.o
36:47.35 nsUdetXPCOMWrapper.o
36:47.35 nsUniversalCharDetModule.o
36:47.43 nsEUCKRProber.o
36:47.49 nsEUCTWProber.o
36:47.62 nsEscCharsetProber.o
36:47.68 nsEscSM.o
36:47.79 nsGB2312Prober.o
36:47.84 nsHebrewProber.o
36:47.92 nsLatin1Prober.o
36:48.03 nsMBCSGroupProber.o
36:48.04 nsMBCSSM.o
36:48.17 nsSBCSGroupProber.o
36:48.30 nsSBCharSetProber.o
36:48.33 AccessibleWrap.o
36:48.33 Platform.o
36:48.37 nsSJISProber.o
36:48.49 nsUTF8Prober.o
36:48.53 nsUniversalDetector.o
36:48.68 ARIAMap.o
36:48.69 ARIAStateMap.o
36:48.96 ARIAGridAccessible.o
36:48.96 Accessible.o
36:49.42 HTMLCanvasAccessible.o
36:49.42 HTMLElementAccessibles.o
36:49.71 HTMLFormControlAccessible.o
36:51.47 AccCollector.o
36:52.29 xpcAccEvents.o
36:52.29 nsAccessibleRelation.o
36:52.46 ApplicationAccessible.o
36:53.27 HTMLImageMapAccessible.o
36:53.28 xpcAccessibleHyperText.o
36:54.47 AccEvent.o
36:55.51 AccGroupInfo.o
36:56.26 xpcAccessibleSelectable.o
36:57.72 HTMLLinkAccessible.o
36:58.78 AccIterator.o
36:59.50 xpcAccessibleTable.o
37:00.51 xpcAccessibleTableCell.o
37:01.46 Asserts.o
37:01.72 HTMLListAccessible.o
37:01.73 BaseAccessibles.o
37:01.74 xpcAccessibleTextRange.o
37:02.77 xpcAccessibleValue.o
37:04.79 DocManager.o
37:04.87 HTMLSelectAccessible.o
37:04.92 DocAccessible.o
37:04.93 EventQueue.o
37:06.88 XULAlertAccessible.o
37:06.88 XULColorPickerAccessible.o
37:07.85 FormControlAccessible.o
37:07.85 XULComboboxAccessible.o
37:08.16 HTMLTableAccessible.o
37:09.08 Filters.o
37:10.95 XULElementAccessibles.o
37:12.26 FocusManager.o
37:13.71 HyperTextAccessible.o
37:13.93 XULFormControlAccessible.o
37:15.04 Logging.o
37:16.60 ImageAccessible.o
37:17.75 nsProfileDirServiceProvider.o
37:17.75 nsProfileLock.o
37:18.28 XULListboxAccessible.o
37:18.73 XULMenuAccessible.o
37:18.96 NotificationController.o
37:21.42 OuterDocAccessible.o
37:22.14 XULSelectControlAccessible.o
37:22.54 XULSliderAccessible.o
37:22.60 SelectionManager.o
37:25.25 RootAccessible.o
37:25.76 local_debug_info_symbolizer.o
37:25.76 platform-linux.o
37:25.99 XULTabAccessible.o
37:26.54 StyleInfo.o
37:27.68 shared-libraries-linux.o
37:28.40 TableCellAccessible.o
37:28.96 XULTreeAccessible.o
37:28.97 EHABIStackWalk.o
37:30.24 TextAttrs.o
37:30.31 AutoObjectMapper.o
37:31.64 BreakpadSampler.o
37:32.11 XULTreeGridAccessible.o
37:32.41 TextLeafAccessible.o
37:32.57 JSStreamWriter.o
37:33.33 TextRange.o
37:33.72 LulCommon.o
37:34.63 LulDwarf.o
37:35.40 LulDwarfSummariser.o
37:37.25 LulElf.o
37:37.32 TextUpdater.o
37:37.44 LulExidx.o
37:37.59 nsWindowDataSource.o
37:38.67 LulMain.o
37:38.69 LulRWLock.o
37:39.05 TreeWalker.o
37:40.36 ProfileEntry.o
37:40.48 nsAccUtils.o
37:40.48 ProfilerBacktrace.o
37:40.56 nsAccessibilityService.o
37:42.27 ProfilerIOInterposeObserver.o
37:42.46 nsDirectoryViewer.o
37:42.76 ProfilerMarkers.o
37:43.56 nsAccessiblePivot.o
37:43.77 SaveProfileTask.o
37:44.02 nsCoreUtils.o
37:44.48 SyncProfile.o
37:45.42 TableTicker.o
37:45.57 nsEventShell.o
37:45.97 ThreadResponsiveness.o
37:47.72 nsTextEquivUtils.o
37:48.98 UnwinderThread2.o
37:49.71 nsProfiler.o
37:49.95 nsModule.o
37:50.43 mozHunspell.o
37:50.43 mozHunspellDirProvider.o
37:50.79 mozEnglishWordUtils.o
37:50.79 mozGenericWordUtils.o
37:50.94 nsProfilerFactory.o
37:51.37 mozInlineSpellChecker.o
37:51.64 mozInlineSpellWordUtil.o
37:52.51 platform.o
37:53.56 nsSecureBrowserUIImpl.o
37:53.56 PublicKeyPinningService.o
37:54.14 RemoteSpellCheckEngineChild.o
37:54.64 RemoteSpellCheckEngineParent.o
37:56.01 nsBOOTModule.o
37:56.06 affentry.o
37:56.21 mozPersonalDictionary.o
37:56.33 affixmgr.o
37:56.67 nsEntropyCollector.o
37:57.05 csutil.o
37:57.21 nsSecurityHeaderParser.o
37:57.54 mozSpellChecker.o
37:57.55 nsSecurityWarningDialogs.o
37:57.90 nsSiteSecurityService.o
37:59.00 mozSpellCheckerFactory.o
37:59.65 mozSpellI18NManager.o
37:59.73 md4.o
37:59.73 CryptoTask.o
37:59.91 nsCertificatePrincipal.o
38:00.16 dictmgr.o
38:00.58 nsCertOverrideService.o
38:00.90 nsCertPicker.o
38:01.00 filemgr.o
38:01.38 hashmgr.o
38:01.72 hunspell.o
38:02.54 nsCertVerificationThread.o
38:02.65 hunzip.o
38:02.65 nsClientAuthRemember.o
38:03.15 OCSPCommon.o
38:03.15 TLSServer.o
38:03.49 nsCrypto.o
38:03.65 BadCertServer.o
38:03.65 GenerateOCSPResponse.o
38:03.81 nsDataSignatureVerifier.o
38:04.05 OCSPStaplingServer.o
38:04.49 phonet.o
38:04.53 nsKeygenHandler.o
38:04.65 OCSPCacheTest.o
38:04.65 TLSIntoleranceTest.o
38:04.90 TestCertDB.o
38:05.00 replist.o
38:05.07 nsASN1Tree.o
38:05.08 nsFormSigningDialog.o
38:05.32 nsKeygenThread.o
38:05.49 suggestmgr.o
38:05.69 nsNSSDialogHelper.o
38:06.24 nsNSSDialogs.o
38:06.81 nsKeyModule.o
38:06.89 nsPKIModule.o
38:07.41 nsNSSASN1Object.o
38:07.44 nsAlertsService.o
38:07.44 nsXULAlerts.o
38:07.78 nsPKIParamBlock.o
38:07.94 nsNSSCallbacks.o
38:08.25 nsCommandLine.o
38:08.43 /opt/FirefoxSource/mozilla-release/security/manager/ssl/src/nsNSSASN1Object.cpp: In function 'nsresult buildASN1ObjectFromDER(unsigned char*, unsigned char*, nsIASN1Sequence*)':
38:08.43 Warning: -Wmaybe-uninitialized in /opt/FirefoxSource/mozilla-release/security/manager/ssl/src/nsNSSASN1Object.cpp: 'bytesUsed' may be used uninitialized in this function
38:08.43 /opt/FirefoxSource/mozilla-release/security/manager/ssl/src/nsNSSASN1Object.cpp:131:22: warning: 'bytesUsed' may be used uninitialized in this function [-Wmaybe-uninitialized]
38:08.43 nsNSSCertCache.o
38:09.60 DiskSpaceWatcher.o
38:09.68 SQLFunctions.o
38:09.68 ApplicationReputation.o
38:10.43 csd.pb.o
38:10.60 nsNSSCertHelper.o
38:11.12 nsNSSCertificate.o
38:11.29 FinalizationWitnessService.o
38:11.89 nsFindService.o
38:12.20 DownloadPlatform.o
38:12.25 nsDownloadManager.o
38:13.09 nsNSSCertificateFakeTransport.o
38:14.16 mp3sniff.o
38:14.16 nsMediaSniffer.o
38:14.24 nsMediaSnifferModule.o
38:14.48 NativeOSFileInternals.o
38:14.87 nsParentalControlsServiceDefault.o
38:15.22 nsNSSCertTrust.o
38:15.26 nsNSSCertValidity.o
38:15.64 nsNSSCleaner.o
38:15.99 PerfMeasurement.o
38:16.24 nsNSSErrors.o
38:16.26 nsNSSIOLayer.o
38:16.37 nsNSSModule.o
38:16.89 nsNSSShutDown.o
38:16.96 extension_set.o
38:16.96 generated_message_util.o
38:18.25 coded_stream.o
38:18.72 zero_copy_stream.o
38:19.32 nsNTLMAuthModule.o
38:19.33 zero_copy_stream_impl_lite.o
38:19.58 message_lite.o
38:19.64 reflect.o
38:19.71 repeated_field.o
38:19.80 nsPK11TokenDB.o
38:20.27 common.o
38:20.38 StartupTimeline.o
38:20.38 nsAppStartup.o
38:20.46 once.o
38:20.52 nsPKCS11Slot.o
38:20.74 nsUserInfoUnix.o
38:20.77 nsPKCS12Blob.o
38:21.14 wire_format_lite.o
38:21.51 nsProtectedAuthThread.o
38:21.80 nsPSMBackgroundThread.o
38:22.22 nsBrowserStatusFilter.o
38:22.34 Telemetry.o
38:22.41 nsRandomGenerator.o
38:22.69 nsSDR.o
38:22.90 NSSErrorsService.o
38:23.10 nsTypeAheadFind.o
38:23.28 nsSSLSocketProvider.o
38:23.87 nsSSLStatus.o
38:24.49 nsStreamCipher.o
38:24.70 nsTLSSocketProvider.o
38:25.23 nsUsageArrayHelper.o
38:25.44 PSMRunnable.o
38:26.13 lz4.o
38:26.45 ctypes.o
38:26.45 SharedSSLState.o
38:27.09 SSLServerCertVerification.o
38:27.63 nsAutoCompleteController.o
38:27.64 nsAutoCompleteSimpleResult.o
38:28.00 TransportSecurityInfo.o
38:28.53 nsFormFillController.o
38:29.04 nsCryptoHash.o
38:29.86 nsUrlClassifierPrefixSet.o
38:29.87 nsUrlClassifierStreamUpdater.o
38:30.18 nsToolkitCompsModule.o
38:30.78 HashStore.o
38:30.82 nsNSSCertificateDB.o
38:31.77 nsNSSComponent.o
38:32.16 nsJSInspector.o
38:32.22 ChunkSet.o
38:33.70 IdentityCryptoService.o
38:34.02 nsNSSVersion.o
38:34.74 AddonPathService.o
38:34.95 BadPlugin.o
38:34.96 GoodPlugin.o
38:34.98 Classifier.o
38:35.19 PSMContentListener.o
38:35.67 nsCertTree.o
38:36.60 LookupCache.o
38:36.80 nsProfileLock.o
38:36.81 nsToolkitProfileService.o
38:37.34 ProtocolParser.o
38:38.41 TestWebappRT.o
38:38.55 convert_UTF.o
38:38.55 nsCheckSummedOutputStream.o
38:38.55 breakpad_getcontext.o
38:38.58 nsAndroidSystemProxySettings.o
38:38.91 arm_ex_reader.o
38:38.97 arm_ex_to_module.o
38:39.12 nsUrlClassifierDBService.o
38:39.93 nsUrlClassifierProxies.o
38:39.98 basic_code_modules.o
38:39.98 basic_source_line_resolver.o
38:40.11 bytereader.o
38:41.20 call_stack.o
38:41.54 /opt/FirefoxSource/mozilla-release/toolkit/system/androidproxy/nsAndroidSystemProxySettings.cpp: In member function 'virtual MozExternalRefCountType nsAndroidSystemProxySettings::Release()':
38:41.54 Warning: -Wdelete-non-virtual-dtor in /opt/FirefoxSource/mozilla-release/toolkit/system/androidproxy/nsAndroidSystemProxySettings.cpp: deleting object of polymorphic class type 'nsAndroidSystemProxySettings' which has non-virtual destructor might cause undefined behaviour
38:41.54 /opt/FirefoxSource/mozilla-release/toolkit/system/androidproxy/nsAndroidSystemProxySettings.cpp:32:409: warning: deleting object of polymorphic class type 'nsAndroidSystemProxySettings' which has non-virtual destructor might cause undefined behaviour [-Wdelete-non-virtual-dtor]
38:41.54 nsUrlClassifierUtils.o
38:41.57 dwarf2diehandler.o
38:42.22 dwarf2reader.o
38:43.24 cfi_frame_info.o
38:43.26 dwarf_cfi_to_module.o
38:43.78 minidump.o
38:44.28 source_line_resolver_base.o
38:44.52 file_id.o
38:44.54 elfutils.o
38:45.15 guid_creator.o
38:45.45 linux_libc_support.o
38:45.68 memory_mapped_file.o
38:45.98 safe_readlink.o
38:46.51 dwarf_cu_to_module.o
38:46.92 nsAppRunner.o
38:46.99 nsEmbedFunctions.o
38:47.69 stack_frame_symbolizer.o
38:49.16 dwarf_line_to_module.o
38:50.16 language.o
38:50.76 stackwalker.o
38:51.51 nsAutoConfig.o
38:51.52 nsConfigFactory.o
38:51.68 stackwalker_amd64.o
38:52.72 /opt/FirefoxSource/mozilla-release/toolkit/crashreporter/google-breakpad/src/common/dwarf_cu_to_module.cc: In member function 'std::string google_breakpad::DwarfCUToModule::GenericDIEHandler::ComputeQualifiedName()':
38:52.72 Warning: -Wmaybe-uninitialized in /opt/FirefoxSource/mozilla-release/toolkit/crashreporter/google-breakpad/src/common/dwarf_cu_to_module.cc: 'enclosing_name' may be used uninitialized in this function
38:52.72 /opt/FirefoxSource/mozilla-release/toolkit/crashreporter/google-breakpad/src/common/dwarf_cu_to_module.cc:386:68: warning: 'enclosing_name' may be used uninitialized in this function [-Wmaybe-uninitialized]
38:52.72 Warning: -Wmaybe-uninitialized in /opt/FirefoxSource/mozilla-release/toolkit/crashreporter/google-breakpad/src/common/dwarf_cu_to_module.cc: 'unqualified_name' may be used uninitialized in this function
38:52.72 /opt/FirefoxSource/mozilla-release/toolkit/crashreporter/google-breakpad/src/common/dwarf_cu_to_module.cc:386:68: warning: 'unqualified_name' may be used uninitialized in this function [-Wmaybe-uninitialized]
38:52.73 dump_symbols.o
38:53.21 stackwalker_arm.o
38:53.26 nsJSConfigTriggers.o
38:53.66 elf_symbols_to_module.o
38:54.12 nsReadConfig.o
38:54.43 stackwalker_ppc.o
38:54.72 /opt/FirefoxSource/mozilla-release/toolkit/xre/nsAppRunner.cpp: In member function 'int XREMain::XRE_mainStartup(bool*)':
38:54.72 Warning: -Wmaybe-uninitialized in /opt/FirefoxSource/mozilla-release/toolkit/xre/nsAppRunner.cpp: 'currentIsSelected' may be used uninitialized in this function
38:54.72 /opt/FirefoxSource/mozilla-release/toolkit/xre/nsAppRunner.cpp:2096:7: warning: 'currentIsSelected' may be used uninitialized in this function [-Wmaybe-uninitialized]
38:54.72 /opt/FirefoxSource/mozilla-release/toolkit/xre/nsAppRunner.cpp:2094:12: note: 'currentIsSelected' was declared here
38:54.74 CreateAppData.o
38:55.81 stackwalker_sparc.o
38:56.33 logging.o
38:56.82 stackwalker_x86.o
38:57.25 md5.o
38:57.55 nsSyncJPAKE.o
38:57.60 tokenize.o
38:58.34 StartupCache.o
38:58.35 StartupCacheModule.o
38:58.41 module.o
38:58.67 pathname_stripper.o
39:00.28 EventTracer.o
39:00.50 StartupCacheUtils.o
39:00.81 ProfileReset.o
39:00.94 nsAndroidStartup.o
39:01.24 string_conversion.o
39:01.37 unique_string.o
39:01.88 JSDebugger.o
39:01.94 nsConsoleWriter.o
39:02.41 snappy-c.o
39:02.41 snappy-sinksource.o
39:02.80 snappy-stubs-internal.o
39:02.87 snappy.o
39:03.04 nsBrowserModule.o
39:03.05 nsShellService.o
39:03.39 nsAndroidHistory.o
39:03.61 StaticXULComponentsStart.o
39:03.85 ssltunnel.o
39:04.02 nsNativeAppSupportBase.o
39:04.31 nsNativeAppSupportDefault.o
39:04.48 nsSigHandlers.o
39:04.70 nsXREDirProvider.o
39:05.32 /opt/FirefoxSource/mozilla-release/mobile/android/components/build/nsShellService.cpp: In member function 'virtual MozExternalRefCountType nsShellService::Release()':
39:05.32 Warning: -Wdelete-non-virtual-dtor in /opt/FirefoxSource/mozilla-release/mobile/android/components/build/nsShellService.cpp: deleting object of polymorphic class type 'nsShellService' which has non-virtual destructor might cause undefined behaviour
39:05.32 /opt/FirefoxSource/mozilla-release/mobile/android/components/build/nsShellService.cpp:13:381: warning: deleting object of polymorphic class type 'nsShellService' which has non-virtual destructor might cause undefined behaviour [-Wdelete-non-virtual-dtor]
39:05.35 TestArrayUtils.o
39:05.36 TestAtomics.o
39:05.42 TestVolatileBuffer.o
39:05.63 TestBinarySearch.o
39:06.06 TestBloomFilter.o
39:06.43 TestCasting.o
39:06.58 TestCeilingFloor.o
39:06.70 TestCheckedInt.o
39:06.90 TestCountPopulation.o
39:07.03 editline.o
39:07.03 sysunix.o
39:07.36 /opt/FirefoxSource/mozilla-release/mobile/android/components/build/nsAndroidHistory.cpp: In member function 'virtual MozExternalRefCountType nsAndroidHistory::Release()':
39:07.36 Warning: -Wdelete-non-virtual-dtor in /opt/FirefoxSource/mozilla-release/mobile/android/components/build/nsAndroidHistory.cpp: deleting object of polymorphic class type 'nsAndroidHistory' which has non-virtual destructor might cause undefined behaviour
39:07.36 /opt/FirefoxSource/mozilla-release/mobile/android/components/build/nsAndroidHistory.cpp:18:385: warning: deleting object of polymorphic class type 'nsAndroidHistory' which has non-virtual destructor might cause undefined behaviour [-Wdelete-non-virtual-dtor]
39:07.37 js.o
39:07.37 jsheaptools.o
39:08.01 TestCountZeroes.o
39:08.11 TestEndian.o
39:08.23 TestEnumSet.o
39:08.32 selfTest.o
39:08.32 testAddPropertyPropcache.o
39:09.40 TestFloatingPoint.o
39:09.73 TestIntegerPrintfMacros.o
39:10.19 TestMacroArgs.o
39:10.65 TestMacroForEach.o
39:10.65 testArgumentsObject.o
39:10.71 testArrayBuffer.o
39:13.06 TestPair.o
39:13.17 TestRollingMean.o
39:13.30 TestSHA1.o
39:13.67 jsoptparse.o
39:16.15 In file included from /opt/FirefoxSource/mozilla-release/js/src/shell/../jsweakmap.h:10:0,
39:16.15                  from /opt/FirefoxSource/mozilla-release/js/src/shell/../vm/ScopeObject.h:12,
39:16.15                  from /opt/FirefoxSource/mozilla-release/js/src/shell/../frontend/SharedContext.h:19,
39:16.15                  from /opt/FirefoxSource/mozilla-release/js/src/shell/../frontend/FullParseHandler.h:13,
39:16.15                  from /opt/FirefoxSource/mozilla-release/js/src/shell/../frontend/Parser.h:17,
39:16.15                  from /opt/FirefoxSource/mozilla-release/js/src/shell/js.cpp:58:
39:16.15 /opt/FirefoxSource/mozilla-release/js/src/shell/../jscompartment.h: In function 'bool EvalInFrame(JSContext*, unsigned int, jsval*)':
39:16.15 Warning: -Wmaybe-uninitialized in /opt/FirefoxSource/mozilla-release/js/src/jscompartment.h: 'ac.js::AutoCompartment::origin_' may be used uninitialized in this function
39:16.15 /opt/FirefoxSource/mozilla-release/js/src/shell/../jscompartment.h:157:31: warning: 'ac.js::AutoCompartment::origin_' may be used uninitialized in this function [-Wmaybe-uninitialized]
39:16.15 /opt/FirefoxSource/mozilla-release/js/src/shell/js.cpp:2775:37: note: 'ac.js::AutoCompartment::origin_' was declared here
39:16.15 In file included from /opt/FirefoxSource/mozilla-release/js/src/shell/../jscompartmentinlines.h:14:0,
39:16.15                  from /opt/FirefoxSource/mozilla-release/js/src/shell/js.cpp:73:
39:16.15 Warning: -Wmaybe-uninitialized in /opt/FirefoxSource/mozilla-release/js/src/jscntxtinlines.h: 'ac.js::AutoCompartment::cx_' may be used uninitialized in this function
39:16.15 /opt/FirefoxSource/mozilla-release/js/src/shell/../jscntxtinlines.h:413:29: warning: 'ac.js::AutoCompartment::cx_' may be used uninitialized in this function [-Wmaybe-uninitialized]
39:16.15 /opt/FirefoxSource/mozilla-release/js/src/shell/js.cpp:2775:37: note: 'ac.js::AutoCompartment::cx_' was declared here
39:16.15 In file included from /opt/FirefoxSource/mozilla-release/js/src/shell/../jsweakmap.h:10:0,
39:16.15                  from /opt/FirefoxSource/mozilla-release/js/src/shell/../vm/ScopeObject.h:12,
39:16.15                  from /opt/FirefoxSource/mozilla-release/js/src/shell/../frontend/SharedContext.h:19,
39:16.15                  from /opt/FirefoxSource/mozilla-release/js/src/shell/../frontend/FullParseHandler.h:13,
39:16.15                  from /opt/FirefoxSource/mozilla-release/js/src/shell/../frontend/Parser.h:17,
39:16.15                  from /opt/FirefoxSource/mozilla-release/js/src/shell/js.cpp:58:
39:16.15 /opt/FirefoxSource/mozilla-release/js/src/shell/../jscompartment.h: In function 'bool Evaluate(JSContext*, unsigned int, jsval*)':
39:16.15 Warning: -Wmaybe-uninitialized in /opt/FirefoxSource/mozilla-release/js/src/jscompartment.h: '*((void*)(& ancx)+24).js::AutoCompartment::origin_' may be used uninitialized in this function
39:16.15 /opt/FirefoxSource/mozilla-release/js/src/shell/../jscompartment.h:157:31: warning: '*((void*)(& ancx)+24).js::AutoCompartment::origin_' may be used uninitialized in this function [-Wmaybe-uninitialized]
39:16.15 /opt/FirefoxSource/mozilla-release/js/src/shell/js.cpp:1229:20: note: '*((void*)(& ancx)+24).js::AutoCompartment::origin_' was declared here
39:16.15 In file included from /opt/FirefoxSource/mozilla-release/js/src/shell/../jscompartmentinlines.h:14:0,
39:16.15                  from /opt/FirefoxSource/mozilla-release/js/src/shell/js.cpp:73:
39:16.15 Warning: -Wmaybe-uninitialized in /opt/FirefoxSource/mozilla-release/js/src/jscntxtinlines.h: '*((void*)(& ancx)+24).js::AutoCompartment::cx_' may be used uninitialized in this function
39:16.15 /opt/FirefoxSource/mozilla-release/js/src/shell/../jscntxtinlines.h:449:53: warning: '*((void*)(& ancx)+24).js::AutoCompartment::cx_' may be used uninitialized in this function [-Wmaybe-uninitialized]
39:16.15 /opt/FirefoxSource/mozilla-release/js/src/shell/js.cpp:1229:20: note: '*((void*)(& ancx)+24).js::AutoCompartment::cx_' was declared here
39:16.15 In file included from /opt/FirefoxSource/mozilla-release/js/src/shell/js.cpp:38:0:
39:16.15 Warning: -Wmaybe-uninitialized in /opt/FirefoxSource/mozilla-release/js/src/jsapi.h: '*((void*)(& ancx)+8).JSAutoRequest::mContext' may be used uninitialized in this function
39:16.15 /opt/FirefoxSource/mozilla-release/js/src/shell/../jsapi.h:1327:32: warning: '*((void*)(& ancx)+8).JSAutoRequest::mContext' may be used uninitialized in this function [-Wmaybe-uninitialized]
39:16.15 /opt/FirefoxSource/mozilla-release/js/src/shell/js.cpp:1229:20: note: '*((void*)(& ancx)+8).JSAutoRequest::mContext' was declared here
39:17.84 testBindCallable.o
39:18.09 gdb-tests.o
39:18.11 test-JSObject.o
39:18.28 testBug604087.o
39:18.86 test-JSString.o
39:19.33 test-JSSymbol.o
39:20.58 testCallNonGenericMethodOnProxy.o
39:20.91 test-Root.o
39:21.45 test-jsid.o
39:22.47 test-jsval.o
39:22.74 TestTypedEnum.o
39:22.84 TestTypeTraits.o
39:22.92 testChromeBuffer.o
39:22.97 test-prettyprinters.o
39:23.23 pkixbind.o
39:23.23 pkixbuild.o
39:23.36 pkixcert.o
39:23.45 typedef-printers.o
39:24.03 pkixcheck.o
39:24.34 testClassGetter.o
39:24.47 pkixder.o
39:25.06 In file included from /opt/FirefoxSource/mozilla-release/security/pkix/lib/pkixutil.h:28:0,
39:25.06                  from /opt/FirefoxSource/mozilla-release/security/pkix/lib/pkixcheck.h:29,
39:25.06                  from /opt/FirefoxSource/mozilla-release/security/pkix/lib/pkixcheck.cpp:29:
39:25.06 /opt/FirefoxSource/mozilla-release/security/pkix/lib/pkixder.h: In function 'mozilla::pkix::Result mozilla::pkix::DecodeBasicConstraints(mozilla::pkix::Input&, bool&, long int&)':
39:25.06 Warning: -Wmaybe-uninitialized in /opt/FirefoxSource/mozilla-release/security/pkix/lib/pkixder.h: 'parsedValue' may be used uninitialized in this function
39:25.06 /opt/FirefoxSource/mozilla-release/security/pkix/lib/pkixder.h:396:22: warning: 'parsedValue' may be used uninitialized in this function [-Wmaybe-uninitialized]
39:25.06 /opt/FirefoxSource/mozilla-release/security/pkix/lib/pkixder.h:391:11: note: 'parsedValue' was declared here
39:25.06 pkixnss.o
39:25.41 pkixocsp.o
39:26.84 /opt/FirefoxSource/mozilla-release/security/pkix/lib/pkixocsp.cpp: In function 'mozilla::pkix::Result mozilla::pkix::BasicResponse(mozilla::pkix::Input&, mozilla::pkix::Context&)':
39:26.84 Warning: -Wmaybe-uninitialized in /opt/FirefoxSource/mozilla-release/security/pkix/lib/pkixocsp.cpp: 'version' may be used uninitialized in this function
39:26.84 /opt/FirefoxSource/mozilla-release/security/pkix/lib/pkixocsp.cpp:470:3: warning: 'version' may be used uninitialized in this function [-Wmaybe-uninitialized]
39:26.84 /opt/FirefoxSource/mozilla-release/security/pkix/lib/pkixocsp.cpp:465:16: note: 'version' was declared here
39:26.91 AppData.o
39:26.92 FileUtils.o
39:26.94 nsArrayEnumerator.o
39:27.01 testCloneScript.o
39:27.26 nsArrayUtils.o
39:27.46 GenericModule.o
39:27.48 nsStringAPI.o
39:27.73 nsCategoryCache.o
39:28.02 nsClassInfoImpl.o
39:28.07 AppData.o
39:28.58 nsCOMArray.o
39:28.73 nsComponentManagerUtils.o
39:28.96 BlockingResourceBase.o
39:29.36 nsCOMPtr.o
39:29.47 DeadlockDetector.o
39:29.67 FileUtils.o
39:29.74 nsCRTGlue.o
39:29.92 nsCycleCollectionParticipant.o
39:30.03 GenericFactory.o
39:30.04 testConservativeGC.o
39:30.17 nsDeque.o
39:30.48 nsArrayEnumerator.o
39:30.96 nsEnumeratorUtils.o
39:30.97 nsArrayUtils.o
39:31.20 nsID.o
39:31.38 nsCOMArray.o
39:31.51 nsIInterfaceRequestorUtils.o
39:31.61 nsCOMPtr.o
39:31.70 nsINIParser.o
39:31.95 nsISupportsImpl.o
39:32.51 nsCRTGlue.o
39:32.55 nsMemory.o
39:32.74 nsQuickSort.o
39:32.86 nsCategoryCache.o
39:33.26 nsClassInfoImpl.o
39:33.33 nsTArray.o
39:33.51 nsTHashtable.o
39:33.84 nsThreadUtils.o
39:34.08 nsTObserverArray.o
39:34.42 nsComponentManagerUtils.o
39:34.47 testContexts.o
39:34.76 nsVersionComparator.o
39:34.81 nsCycleCollectionParticipant.o
39:34.98 nsVoidArray.o
39:35.10 nsWeakReference.o
39:35.34 nsDeque.o
39:35.84 TestUniquePtr.o
39:35.96 pldhash.o
39:36.14 TestWeakPtr.o
39:36.27 nsStringAPI.o
39:36.63 nsEnumeratorUtils.o
39:36.69 nsXPCOMGlue.o
39:37.19 nsID.o
39:37.33 testCustomIterator.o
39:37.35 TestPoisonArea.o
39:37.58 nsIInterfaceRequestorUtils.o
39:37.77 nsINIParser.o
39:37.91 TestFileUtils.o
39:37.92 nsISupportsImpl.o
39:37.92 TestGCPostBarriers.o
39:38.27 testDebugger.o
39:38.39 nsMemory.o
39:38.53 nsProxyRelease.o
39:39.23 nsQuickSort.o
39:39.60 nsTArray.o
39:39.78 nsTHashtable.o
39:39.97 nsTObserverArray.o
39:40.08 nsTextFormatter.o
39:40.08 xptcinvoke_arm.o
39:40.08 xptcstubs_arm.o
39:40.25 nsThreadUtils.o
39:40.89 nsVersionComparator.o
39:41.36 nsVoidArray.o
39:41.61 nsWeakReference.o
39:41.74 pldhash.o
39:41.89 testDeepFreeze.o
39:42.02 unused.o
39:42.42 testDefineGetterSetterNonEnumerable.o
39:42.51 TestMinStringAPI.o
39:43.29 TestComponent.o
39:43.67 TestComponent.o
39:43.74 TestComponent.o
39:44.08 nsTestSample.o
39:44.17 nsCollationUnix.o
39:44.19 nsDateTimeFormatUnix.o
39:44.54 nsPosixLocale.o
39:45.07 GreekCasing.o
39:45.09 IrishCasing.o
39:45.59 nsBidiUtils.o
39:45.61 nsAndroidCharset.o
39:45.95 testDefineProperty.o
39:46.12 nsSpecialCasingData.o
39:46.52 nsUnicharUtils.o
39:46.56 nsUnicodeProperties.o
39:47.59 testEnclosingFunction.o
39:47.60 StreamFunctions.o
39:47.60 ZipWriterModule.o
39:47.93 nsDeflateConverter.o
39:48.49 nsZipDataStream.o
39:48.60 nsZipHeader.o
39:48.83 nsZipWriter.o
39:49.62 testErrorCopying.o
39:49.74 nsRDFResource.o
39:50.09 WriteArgument.o
39:50.24 nsIconChannel.o
39:50.36 nsIconModule.o
39:50.36 nsIconProtocolHandler.o
39:50.78 nsIconURI.o
39:52.06 TestCodeGenBinding.o
39:52.08 TestDictionaryBinding.o
39:52.47 testException.o
39:52.86 ANPAudio.o
39:52.87 ANPBitmap.o
39:54.34 testExternalStrings.o
39:55.71 ANPEvent.o
39:56.18 ANPLog.o
39:56.60 ANPMatrix.o
39:56.95 testFindSCCs.o
39:57.16 testFreshGlobalEvalRedefinition.o
39:58.97 ANPNativeWindow.o
39:59.41 ANPOpenGL.o
39:59.62 testFuncCallback.o
40:01.70 testFunctionProperties.o
40:02.17 ANPSurface.o
40:02.95 testGCAllocator.o
40:03.61 testGCExactRooting.o
40:05.12 ANPSystem.o
40:05.33 testGCFinalizeCallback.o
40:05.54 ANPVideo.o
40:07.28 testGCHeapPostBarriers.o
40:07.41 testGCOutOfMemory.o
40:07.47 testGCStoreBufferRemoval.o
40:08.23 ANPWindow.o
40:09.79 testHashTable.o
40:10.46 testHashTableInit.o
40:12.31 testIndexToString.o
40:13.44 IndexedDBChild.o
40:13.44 IndexedDBParent.o
40:14.20 testIntString.o
40:15.89 TestExampleGenBinding.o
40:17.96 testIntTypesABI.o
40:17.96 testIntern.o
40:20.38 testIsInsideNursery.o
40:20.61 TestJSImplGenBinding.o
40:22.36 testJSEvaluateScript.o
40:24.00 testJitFoldsTo.o
40:26.50 TestJSImplInheritanceGenBinding.o
40:26.95 testJitMoveEmitterCycles.o
40:27.23 In file included from ../../../dist/include/mozilla/dom/indexedDB/IndexedDatabase.h:14:0,
40:27.23                  from /opt/FirefoxSource/mozilla-release/dom/indexedDB/ipc/IndexedDBParent.h:11,
40:27.23                  from /opt/FirefoxSource/mozilla-release/dom/indexedDB/ipc/IndexedDBParent.cpp:6:
40:27.23 ../../../dist/include/nsAutoPtr.h: In member function 'nsresult mozilla::dom::indexedDB::IndexedDBDatabaseParent::HandleRequestEvent(nsIDOMEvent*, const nsAString_internal&)':
40:27.23 Warning: -Wmaybe-uninitialized in /opt/FirefoxSource/mozilla-release/objdir-droid/dist/include/nsAutoPtr.h: 'database' may be used uninitialized in this function
40:27.23 ../../../dist/include/nsAutoPtr.h:926:5: warning: 'database' may be used uninitialized in this function [-Wmaybe-uninitialized]
40:27.23 /opt/FirefoxSource/mozilla-release/dom/indexedDB/ipc/IndexedDBParent.cpp:417:16: note: 'database' was declared here
40:27.26 AndroidLocationProvider.o
40:27.26 nsHapticFeedback.o
40:31.91 testJitRValueAlloc.o
40:31.97 testLookup.o
40:33.56 TestAudioChannelService.o
40:35.10 nptest.o
40:35.11 nptest_droid.o
40:35.96 testLooselyEqual.o
40:38.02 nptest_utils.o
40:38.44 nptest_name.o
40:38.97 testMappedArrayBuffer.o
40:41.45 nptest.o
40:41.45 nptest_droid.o
40:43.49 MediaEncoder.o
40:43.49 OpusTrackEncoder.o
40:44.04 nptest_utils.o
40:44.44 nptest_name.o
40:44.91 TestTypedefBinding.o
40:45.52 TrackEncoder.o
40:46.70 testNewObject.o
40:48.68 testNullRoot.o
40:49.91 GMPChild.o
40:49.91 GMPParent.o
40:51.95 GMPPlatform.o
40:52.71 testOOM.o
40:53.27 GMPProcessChild.o
40:54.16 GMPProcessParent.o
40:54.67 testObjectEmulatingUndefined.o
40:54.91 MediaSource.o
40:54.91 MediaSourceDecoder.o
40:55.85 GMPService.o
40:56.28 testOps.o
40:57.05 GMPSharedMemManager.o
40:58.67 testOriginPrincipals.o
40:59.12 SourceBuffer.o
40:59.67 GMPVideoDecoderChild.o
41:00.80 GMPVideoDecoderParent.o
41:01.37 testParseJSON.o
41:02.44 GMPVideoEncodedFrameImpl.o
41:04.06 SourceBufferList.o
41:04.29 GMPVideoEncoderChild.o
41:05.66 GMPVideoEncoderParent.o
41:06.78 testPersistentRooted.o
41:07.30 GMPVideoHost.o
41:07.37 SourceBufferResource.o
41:09.26 GMPVideoPlaneImpl.o
41:10.54 GMPVideoi420FrameImpl.o
41:11.09 testProfileStrings.o
41:11.16 OggCodecState.o
41:11.16 OggDecoder.o
41:11.75 testPropCache.o
41:13.35 testRegExp.o
41:14.82 AnalyserNode.o
41:14.82 AudioBuffer.o
41:15.74 testResolveRecursion.o
41:16.06 OggReader.o
41:16.08 RawDecoder.o
41:16.08 RawReader.o
41:18.15 AudioBufferSourceNode.o
41:18.59 testSameValue.o
41:20.11 OggWriter.o
41:20.19 WaveDecoder.o
41:20.19 WaveReader.o
41:21.12 AudioContext.o
41:22.33 testScriptInfo.o
41:24.14 testScriptObject.o
41:24.44 AudioDestinationNode.o
41:25.38 OpusParser.o
41:26.83 testSetProperty.o
41:28.34 WebMBufferedParser.o
41:28.34 WebMDecoder.o
41:28.39 AudioListener.o
41:29.18 WebMReader.o
41:29.80 testSetPropertyIgnoringNamedGetter.o
41:31.75 AudioNode.o
41:31.78 testSourcePolicy.o
41:31.90 testStringBuffer.o
41:33.97 AndroidMediaDecoder.o
41:33.97 AndroidMediaPluginHost.o
41:34.41 testStructuredClone.o
41:34.50 AudioParam.o
41:35.89 AndroidMediaReader.o
41:36.15 MediaEngineDefault.o
41:36.15 PeerIdentity.o
41:37.11 testSymbol.o
41:37.90 AudioProcessingEvent.o
41:40.02 AndroidMediaResourceServer.o
41:40.50 BiquadFilterNode.o
41:41.30 testToIntWidth.o
41:42.18 testTrap.o
41:42.38 SpeechSynthesis.o
41:42.38 SpeechSynthesisUtterance.o
41:42.90 SpeechGrammar.o
41:42.90 SpeechGrammarList.o
41:43.30 ChannelMergerNode.o
41:43.53 SpeechRecognition.o
41:44.12 SpeechRecognitionAlternative.o
41:44.24 testTypedArrays.o
41:46.90 ChannelSplitterNode.o
41:47.24 testUTF8.o
41:47.30 SpeechSynthesisVoice.o
41:49.35 SpeechRecognitionResult.o
41:49.81 ConvolverNode.o
41:49.91 SpeechSynthesisChild.o
41:52.30 SpeechRecognitionResultList.o
41:52.47 SpeechSynthesisParent.o
41:52.54 testUncaughtError.o
41:52.76 DelayBuffer.o
41:54.76 testWeakMap.o
41:55.32 SpeechStreamListener.o
41:55.45 nsSpeechTask.o
41:56.33 DelayNode.o
41:56.73 testXDR.o
41:58.20 endpointer.o
41:58.31 tests.o
41:58.59 nsSynthVoiceRegistry.o
41:59.18 DynamicsCompressorNode.o
42:01.04 energy_endpointer.o
42:01.79 energy_endpointer_params.o
42:02.33 FakeSpeechRecognitionService.o
42:02.48 FFTBlock.o
42:05.56 CDMProxy.o
42:05.56 EMELog.o
42:06.00 GainNode.o
42:06.93 TestAudioCompactor.o
42:06.93 TestTrackEncoder.o
42:07.85 MediaKeyError.o
42:07.91 MediaKeyMessageEvent.o
42:07.92 MediaKeyNeededEvent.o
42:08.91 MediaBufferDecoder.o
42:09.01 MediaElementAudioSourceNode.o
42:09.43 MediaKeySession.o
42:09.73 TestVideoSegment.o
42:11.58 MediaKeys.o
42:11.96 TestAudioMixer.o
42:12.12 /opt/FirefoxSource/mozilla-release/content/media/webaudio/MediaBufferDecoder.cpp: In member function 'void mozilla::WebAudioDecodeJob::OnFailure(mozilla::WebAudioDecodeJob::ErrorCode)':
42:12.12 Warning: -Wmaybe-uninitialized in /opt/FirefoxSource/mozilla-release/content/media/webaudio/MediaBufferDecoder.cpp: 'errorMessage' may be used uninitialized in this function
42:12.12 /opt/FirefoxSource/mozilla-release/content/media/webaudio/MediaBufferDecoder.cpp:583:48: warning: 'errorMessage' may be used uninitialized in this function [-Wmaybe-uninitialized]
42:12.12 MediaStreamAudioDestinationNode.o
42:14.92 TestTXMgr.o
42:15.31 MediaStreamAudioSourceNode.o
42:15.48 host_ListCSSProperties.o
42:15.88 nsTreeBodyFrame.o
42:15.88 nsTreeBoxObject.o
42:17.28 OfflineAudioCompletionEvent.o
42:17.47 nsGrid.o
42:17.49 nsGridCell.o
42:18.91 nsGridLayout2.o
42:20.29 nsTreeColFrame.o
42:20.61 OscillatorNode.o
42:21.10 nsGridRow.o
42:22.80 PannerNode.o
42:23.48 nsGridRowGroupFrame.o
42:24.15 In file included from /opt/FirefoxSource/mozilla-release/layout/xul/tree/../nsBox.h:10:0,
42:24.15                  from /opt/FirefoxSource/mozilla-release/layout/xul/tree/../../generic/nsFrame.h:14,
42:24.15                  from /opt/FirefoxSource/mozilla-release/layout/xul/tree/../../generic/nsLeafFrame.h:12,
42:24.15                  from /opt/FirefoxSource/mozilla-release/layout/xul/tree/../nsLeafBoxFrame.h:9,
42:24.15                  from /opt/FirefoxSource/mozilla-release/layout/xul/tree/nsTreeBodyFrame.h:11,
42:24.15                  from /opt/FirefoxSource/mozilla-release/layout/xul/tree/nsTreeBoxObject.cpp:15:
42:24.15 /opt/FirefoxSource/mozilla-release/layout/xul/tree/../../generic/nsIFrame.h: In member function 'nsTreeBodyFrame* nsTreeBoxObject::GetTreeBody(bool)':
42:24.15 Warning: -Wmaybe-uninitialized in /opt/FirefoxSource/mozilla-release/layout/generic/nsIFrame.h: 'frame' may be used uninitialized in this function
42:24.15 /opt/FirefoxSource/mozilla-release/layout/xul/tree/../../generic/nsIFrame.h:487:43: warning: 'frame' may be used uninitialized in this function [-Wmaybe-uninitialized]
42:24.15 /opt/FirefoxSource/mozilla-release/layout/xul/tree/nsTreeBoxObject.cpp:87:13: note: 'frame' was declared here
42:24.16 PeriodicWave.o
42:24.49 /opt/FirefoxSource/mozilla-release/layout/xul/tree/nsTreeBodyFrame.cpp: In member function 'void nsTreeBodyFrame::PaintCell(int32_t, nsTreeColumn*, const nsRect&, nsPresContext*, nsRenderingContext&, const nsRect&, nscoord&, nsPoint)':
42:24.49 Warning: -Wmaybe-uninitialized in /opt/FirefoxSource/mozilla-release/layout/xul/tree/nsTreeBodyFrame.cpp: 'color' may be used uninitialized in this function
42:24.49 /opt/FirefoxSource/mozilla-release/layout/xul/tree/nsTreeBodyFrame.cpp:3209:40: warning: 'color' may be used uninitialized in this function [-Wmaybe-uninitialized]
42:24.50 nsTreeColumns.o
42:25.74 nsGridRowGroupLayout.o
42:26.41 nsGridRowLayout.o
42:27.89 ScriptProcessorNode.o
42:28.33 nsTreeContentView.o
42:28.35 ThreeDPoint.o
42:28.88 nsGridRowLeafFrame.o
42:30.95 nsTreeImageListener.o
42:31.31 nsGridRowLeafLayout.o
42:31.60 WaveShaperNode.o
42:32.04 WebAudioUtils.o
42:33.81 JSStreamWriterTest.o
42:33.81 LulTest.o
42:35.14 nsTreeSelection.o
42:35.53 nsTreeStyleCache.o
42:35.88 ThreadProfileTest.o
42:37.77 nsTreeUtils.o
42:38.07 jsctypes-test-errno.o
42:38.07 jsctypes-test-finalizer.o
42:38.20 jsctypes-test.o
42:39.28 TestStartupCache.o
42:39.72 StaticXULComponentsEnd.o
42:40.24 pkixtestutil.o
42:40.24 nssgtest.o
42:40.24 pkixbuild_tests.o
42:40.26 Biquad.o
42:40.27 DirectConvolver.o
42:40.60 DynamicsCompressor.o
42:40.89 DynamicsCompressorKernel.o
42:41.01 TestAudioEventTimeline.o
42:41.10 FFTConvolver.o
42:41.72 HRTFDatabase.o
42:42.11 pkixcert_extension_tests.o
42:42.87 HRTFDatabaseLoader.o
42:43.78 HRTFElevation.o
42:44.41 pkixcert_signature_algorithm_tests.o
42:44.54 HRTFKernel.o
42:45.74 HRTFPanner.o
42:46.38 pkixcheck_CheckKeyUsage_tests.o
42:46.79 PeriodicWave.o
42:47.87 Reverb.o
42:48.62 ReverbAccumulationBuffer.o
42:49.00 pkixcheck_CheckValidity_tests.o
42:49.89 ReverbConvolver.o
42:50.80 ReverbConvolverStage.o
42:51.20 pkixder_input_tests.o
42:51.92 ReverbInputBuffer.o
42:52.65 ZeroPole.o
42:53.01 pkixder_pki_types_tests.o
42:53.23 pkixder_universal_types_tests.o
42:53.93 pkixocsp_CreateEncodedOCSPRequest_tests.o
42:55.11 pkixocsp_VerifyEncodedOCSPResponse.o
43:02.10 libstlport_static.a
43:02.90 annotationProcessors.jar
43:04.46 Note: /opt/FirefoxSource/mozilla-release/build/annotationProcessors/utils/GeneratableElementIterator.java uses unchecked or unsafe operations.
43:04.46 Note: Recompile with -Xlint:unchecked for details.
43:05.04 libmfbt.a.desc
43:05.17 TestArrayUtils
43:05.17 TestAtomics
43:05.18 TestBinarySearch
43:05.18 TestBloomFilter
43:05.18 TestCasting
43:05.72 TestCeilingFloor
43:05.72 TestCheckedInt
43:05.72 TestCountPopulation
43:05.72 TestCountZeroes
43:05.84 TestEndian
43:05.84 TestEnumSet
43:05.85 TestFloatingPoint
43:05.85 TestIntegerPrintfMacros
43:05.96 TestMacroArgs
43:05.96 TestMacroForEach
43:05.97 TestPair
43:05.98 TestRollingMean
43:06.08 TestSHA1
43:06.08 TestTypedEnum
43:06.09 TestTypeTraits
43:06.09 TestUniquePtr
43:06.20 TestWeakPtr
43:06.20 TestPoisonArea
43:06.61 libother-licenses_android.a.desc
43:06.69 libjemalloc.a.desc
43:06.78 libmemory.a.desc
43:07.18 liblinker.a.desc
43:07.21 szip
43:09.05 libmozglue_android.a.desc
43:09.14 libmozglue.so
43:09.65 TestZip
43:09.83 libmozalloc.so
43:10.56 libmozsqlite3.a.desc
43:10.65 libmedia_libjpeg.a.desc
43:10.77 libmedia_libtremor_lib.a.desc
43:10.96 libmedia_libopus.a.desc
43:11.15 libmedia_libnestegg_src.a.desc
43:11.50 libmedia_libvpx.a.desc
43:11.77 libmozpng.a.desc
43:11.89 libmedia_kiss_fft.a.desc
43:12.01 libcubeb.a.desc
43:12.14 libmedia_libogg.a.desc
43:12.26 libmedia_libtheora_lib.a.desc
43:12.37 libspeex.a.desc
43:12.53 libmedia_libstagefright.a.desc
43:12.69 libmedia_libsoundtouch_src.a.desc
43:12.91 /opt/FirefoxSource/mozilla-release/security/build/nss.def: WARNING: no preprocessor directives found
43:12.94 /opt/FirefoxSource/mozilla-release/security/build/nspr-dummy.def: WARNING: no preprocessor directives found
43:13.23 sechash.c: In function 'HASH_ResultLen':
43:13.23 sechash.c:263:5: warning: comparison of unsigned expression < 0 is always false [-Wtype-limits]
43:13.23 sechash.c: In function 'HASH_HashBuf':
43:13.23 sechash.c:288:5: warning: comparison of unsigned expression < 0 is always false [-Wtype-limits]
43:13.23 sechash.c: In function 'HASH_Create':
43:13.23 sechash.c:310:5: warning: comparison of unsigned expression < 0 is always false [-Wtype-limits]
43:13.26 quickder.c: In function 'DecodeItem':
43:13.26 quickder.c:611:12: warning: variable 'optional' set but not used [-Wunused-but-set-variable]
43:13.74 derenc.c: In function 'der_encode':
43:13.74 derenc.c:282:22: warning: variable 'optional' set but not used [-Wunused-but-set-variable]
43:14.30 pk11akey.c: In function 'pk11_get_Decoded_ECPoint':
43:14.30 pk11akey.c:406:26: warning: comparison between signed and unsigned integer expressions [-Wsign-compare]
43:14.30 pk11akey.c:420:63: warning: comparison between signed and unsigned integer expressions [-Wsign-compare]
43:14.84 nssb64e.c: In function 'NSSBase64_EncodeItem_Util':
43:14.84 nssb64e.c:684:15: warning: 'out_len' may be used uninitialized in this function [-Wmaybe-uninitialized]
43:15.15 ocsp.c: In function 'ocsp_RemoveCacheItem':
43:15.15 ocsp.c:562:12: warning: variable 'couldRemoveFromHashTable' set but not used [-Wunused-but-set-variable]
43:15.66 alg1485.c: In function 'cert_AVAOidTagToMaxLen':
43:15.66 alg1485.c:162:57: warning: signed and unsigned type in conditional expression [-Wsign-compare]
43:15.66 alg1485.c: In function 'AppendAVA':
43:15.66 alg1485.c:963:40: warning: signed and unsigned type in conditional expression [-Wsign-compare]
43:15.84 certhigh.c: In function 'CERT_MatchNickname':
43:15.84 certhigh.c:28:9: warning: variable 'len' set but not used [-Wunused-but-set-variable]
43:16.04 pk11cert.c: In function 'pk11_fastCert':
43:16.04 pk11cert.c:231:14: warning: variable 'status' set but not used [-Wunused-but-set-variable]
43:16.04 pk11cert.c: In function 'PK11_MakeCertFromHandle':
43:16.04 pk11cert.c:297:12: warning: variable 'swapNickname' set but not used [-Wunused-but-set-variable]
43:16.04 pk11cert.c:296:12: warning: variable 'isFortezzaRootCA' set but not used [-Wunused-but-set-variable]
43:16.04 pk11cert.c: In function 'PK11_TraverseCertsForNicknameInSlot':
43:16.04 pk11cert.c:2012:28: warning: variable 'pk11cb' set but not used [-Wunused-but-set-variable]
43:16.04 pk11cert.c: In function 'PK11_FindCertFromDERCertItem':
43:16.04 pk11cert.c:2156:21: warning: unused variable 'td' [-Wunused-variable]
43:16.68 certdb.c: In function 'cert_VerifySubjectAltName':
43:16.68 certdb.c:1428:18: warning: variable 'hnLen' set but not used [-Wunused-but-set-variable]
43:16.68 certdb.c: In function 'CERT_ImportCerts':
43:16.68 certdb.c:2440:15: warning: variable 'rv' set but not used [-Wunused-but-set-variable]
43:16.68 certdb.c: In function 'CERT_UnlockCertRefCount':
43:16.68 certdb.c:2890:14: warning: variable 'prstat' set but not used [-Wunused-but-set-variable]
43:16.68 certdb.c: In function 'CERT_UnlockCertTrust':
43:16.68 certdb.c:2970:14: warning: variable 'prstat' set but not used [-Wunused-but-set-variable]
43:17.59 secoid.c: In function 'SECOID_Init':
43:17.59 secoid.c:1922:19: warning: variable 'c' set but not used [-Wunused-but-set-variable]
43:17.84 certvfypkix.c: In function 'setRevocationMethod':
43:17.84 certvfypkix.c:1422:17: warning: comparison between signed and unsigned integer expressions [-Wsign-compare]
43:18.32 crl.c: In function 'crl_storeCRL':
43:18.32 crl.c:630:15: warning: variable 'rv' set but not used [-Wunused-but-set-variable]
43:18.32 crl.c: In function 'cert_CheckCertRevocationStatus':
43:18.32 crl.c:2688:27: warning: unused variable 'rv2' [-Wunused-variable]
43:18.32 crl.c: In function 'cert_CacheCRLByGeneralName':
43:18.32 crl.c:3045:32: warning: variable 'rv2' set but not used [-Wunused-but-set-variable]
43:18.66 utilmod.c: In function 'nssutil_DeleteSecmodDBEntry.isra.1':
43:18.66 utilmod.c:545:12: warning: 'lib_len' may be used uninitialized in this function [-Wmaybe-uninitialized]
43:19.41 utilpars.c: In function 'nssutil_mkSlotFlags':
43:19.41 utilpars.c:679:17: warning: comparison between signed and unsigned integer expressions [-Wsign-compare]
43:19.41 utilpars.c: In function 'nssutil_mkCipherFlags':
43:19.41 utilpars.c:891:17: warning: comparison between signed and unsigned integer expressions [-Wsign-compare]
43:19.41 utilpars.c:910:17: warning: comparison between signed and unsigned integer expressions [-Wsign-compare]
43:19.59 In file included from pk11load.c:26:0:
43:19.59 debug_module.c: In function 'log_handle':
43:19.59 debug_module.c:339:28: warning: comparison between signed and unsigned integer expressions [-Wsign-compare]
43:19.59 debug_module.c:343:28: warning: comparison between signed and unsigned integer expressions [-Wsign-compare]
43:19.59 pk11load.c: In function 'SECMOD_UnloadModule':
43:19.59 pk11load.c:592:28: warning: unused variable 'status' [-Wunused-variable]
43:20.15 certificate.c: In function 'nssCertificateList_DoCallback':
43:20.15 certificate.c:898:14: warning: variable 'nssrv' set but not used [-Wunused-but-set-variable]
43:20.48 devtoken.c: In function 'nssToken_TraverseCertificates':
43:20.48 devtoken.c:1469:14: warning: variable 'status' set but not used [-Wunused-but-set-variable]
43:20.82 ckhelper.c: In function 'nssCKObject_GetAttributes':
43:20.82 ckhelper.c:139:36: warning: comparison between signed and unsigned integer expressions [-Wsign-compare]
43:20.82 ckhelper.c: In function 'nssCryptokiTrust_GetAttributes':
43:20.82 ckhelper.c:442:36: warning: comparison between signed and unsigned integer expressions [-Wsign-compare]
43:20.83 pk11merge.c: In function 'pk11_matchAcrossTokens':
43:20.83 pk11merge.c:100:32: warning: comparison between signed and unsigned integer expressions [-Wsign-compare]
43:21.08 trustdomain.c: In function 'NSSTrustDomain_TraverseCertificates':
43:21.08 trustdomain.c:998:14: warning: variable 'status' set but not used [-Wunused-but-set-variable]
43:21.58 tdcache.c: In function 'add_cert_to_cache':
43:21.58 tdcache.c:773:9: warning: variable 'handle' set but not used [-Wunused-but-set-variable]
43:21.58 tdcache.c: In function 'nssTrustDomain_RemoveCertFromCacheLOCKED':
43:21.58 tdcache.c:272:16: warning: 'nickname' may be used uninitialized in this function [-Wmaybe-uninitialized]
43:21.58 tdcache.c:332:14: note: 'nickname' was declared here
43:21.99 pk11obj.c: In function 'PK11_MatchItem':
43:21.99 pk11obj.c:1799:72: warning: comparison between signed and unsigned integer expressions [-Wsign-compare]
43:21.99 pk11obj.c:1784:22: warning: variable 'parent' set but not used [-Wunused-but-set-variable]
43:22.58 pk11pars.c: In function 'secmod_ParseModuleSpecForTokens':
43:22.58 pk11pars.c:364:47: warning: suggest braces around empty body in an 'else' statement [-Wempty-body]
43:22.58 pk11pars.c:366:47: warning: suggest braces around empty body in an 'else' statement [-Wempty-body]
43:22.58 pk11pars.c:375:6: warning: suggest braces around empty body in an 'else' statement [-Wempty-body]
43:22.58 pk11pars.c:384:7: warning: suggest braces around empty body in an 'else' statement [-Wempty-body]
43:22.58 pk11pars.c:393:7: warning: suggest braces around empty body in an 'else' statement [-Wempty-body]
43:22.58 pk11pars.c:402:7: warning: suggest braces around empty body in an 'else' statement [-Wempty-body]
43:22.58 pk11pars.c: In function 'secmod_MkAppendTokensList':
43:22.58 pk11pars.c:767:13: warning: comparison between signed and unsigned integer expressions [-Wsign-compare]
43:22.58 pk11pars.c:804:13: warning: comparison between signed and unsigned integer expressions [-Wsign-compare]
43:22.62 list.c: In function 'nssList_Add':
43:22.62 list.c:220:14: warning: variable 'nssrv' set but not used [-Wunused-but-set-variable]
43:22.68 pkibase.c: In function 'nssPKIObjectCollection_Traverse':
43:22.69 pkibase.c:906:14: warning: variable 'status' set but not used [-Wunused-but-set-variable]
43:22.69 pkibase.c: In function 'nssCertificateCollection_Create':
43:22.69 pkibase.c:1060:14: warning: variable 'status' set but not used [-Wunused-but-set-variable]
43:22.69 pkibase.c: In function 'nssCRLCollection_Create':
43:22.69 pkibase.c:1167:14: warning: variable 'status' set but not used [-Wunused-but-set-variable]
43:23.30 pki3hack.c: In function 'DeleteCertTrustMatchingSlot':
43:23.30 pki3hack.c:1275:27: warning: comparison between signed and unsigned integer expressions [-Wsign-compare]
43:23.30 pki3hack.c: In function 'STAN_DeleteCertTrustMatchingSlot':
43:23.30 pki3hack.c:1333:19: warning: comparison between signed and unsigned integer expressions [-Wsign-compare]
43:23.37 pk11pk12.c: In function 'PK11_ImportPrivateKeyInfoAndReturnKey':
43:23.37 pk11pk12.c:425:17: warning: variable 'keyType' set but not used [-Wunused-but-set-variable]
43:23.82 pk11pqg.c: In function 'PK11_PQG_ParamGenSeedLen':
43:23.82 pk11pqg.c:230:56: warning: signed and unsigned type in conditional expression [-Wsign-compare]
43:23.82 pk11pqg.c: In function 'PK11_PQG_ParamGen':
43:23.82 pk11pqg.c:241:56: warning: signed and unsigned type in conditional expression [-Wsign-compare]
43:23.82 pk11pqg.c: In function 'PK11_PQG_VerifyParams':
43:23.82 pk11pqg.c:295:19: warning: comparison between signed and unsigned integer expressions [-Wsign-compare]
43:25.42 pk11skey.c: In function 'pk11_TokenKeyGenWithFlagsAndKeyType':
43:25.43 pk11skey.c:926:17: warning: comparison between signed and unsigned integer expressions [-Wsign-compare]
43:25.43 pk11skey.c: In function 'pk11_HandUnwrap':
43:25.43 pk11skey.c:2296:40: warning: signed and unsigned type in conditional expression [-Wsign-compare]
43:25.86 pkix_revocationchecker.c: In function 'PKIX_RevocationChecker_Check':
43:25.86 pkix_revocationchecker.c:347:25: warning: comparison between signed and unsigned integer expressions [-Wsign-compare]
43:26.35 pk11slot.c: In function 'PK11_InitToken':
43:26.35 pk11slot.c:1108:11: warning: variable 'tmp' set but not used [-Wunused-but-set-variable]
43:26.35 pk11slot.c: In function 'PK11_InitSlot':
43:26.35 pk11slot.c:1352:11: warning: variable 'tmp' set but not used [-Wunused-but-set-variable]
43:26.35 pk11slot.c: In function 'PK11_GetBestSlotMultipleWithAttributes':
43:26.35 pk11slot.c:2076:17: warning: comparison between signed and unsigned integer expressions [-Wsign-compare]
43:26.35 pk11slot.c:2094:18: warning: comparison between signed and unsigned integer expressions [-Wsign-compare]
43:26.35 pk11slot.c: In function 'PK11_ResetToken':
43:26.35 pk11slot.c:2317:22: warning: comparison between signed and unsigned integer expressions [-Wsign-compare]
43:26.35 pk11slot.c:2322:22: warning: comparison between signed and unsigned integer expressions [-Wsign-compare]
43:26.74 pk11util.c: In function 'SECMOD_UpdateSlotList':
43:26.74 pk11util.c:931:15: warning: comparison between signed and unsigned integer expressions [-Wsign-compare]
43:27.66 pkix_tools.c: In function 'pkix_i2hex':
43:27.66 pkix_tools.c:482:9: warning: comparison is always true due to limited range of data type [-Wtype-limits]
43:29.12 pkix_errpaths.c: In function 'PKIX_DoReturn':
43:29.12 pkix_errpaths.c:58:2: warning: suggest braces around empty body in an 'if' statement [-Wempty-body]
43:29.24 pkix_build.c: In function 'pkix_Build_SelectCertsFromTrustAnchors':
43:29.24 pkix_build.c:1541:38: warning: comparison between signed and unsigned integer expressions [-Wsign-compare]
43:30.97 pkix_pl_crl.c: In function 'pkix_pl_CRL_ToString':
43:30.97 pkix_pl_crl.c:455:58: warning: 'crlVersion' may be used uninitialized in this function [-Wmaybe-uninitialized]
43:30.97 pkix_pl_crl.c:354:21: note: 'crlVersion' was declared here
43:31.96 pkix_pl_cert.c: In function 'PKIX_PL_Cert_Create':
43:31.96 pkix_pl_cert.c:1518:22: warning: variable 'copyDER' set but not used [-Wunused-but-set-variable]
43:33.23 pkix_pl_lifecycle.c: In function 'pkix_pl_lifecycle_ObjectLeakCheck':
43:33.23 pkix_pl_lifecycle.c:87:55: warning: comparison between signed and unsigned integer expressions [-Wsign-compare]
43:33.23 pkix_pl_lifecycle.c: In function 'PKIX_PL_Shutdown':
43:33.23 pkix_pl_lifecycle.c:248:21: warning: variable 'numLeakedObjects' set but not used [-Wunused-but-set-variable]
43:33.54 nssinit.c: In function 'NSS_VersionCheck':
43:33.54 nssinit.c:1250:19: warning: variable 'c' set but not used [-Wunused-but-set-variable]
43:34.43 pkix_pl_publickey.c: In function 'pkix_pl_PublicKey_Hashcode':
43:34.43 pkix_pl_publickey.c:214:21: warning: variable 'fullHash' set but not used [-Wunused-but-set-variable]
43:34.89 pkix_pl_x500name.c:37:1: warning: 'pkix_pl_X500Name_ToString_Helper' defined but not used [-Wunused-function]
43:34.90 pkix_pl_httpdefaultclient.c: In function 'pkix_pl_HttpDefaultClient_HdrCheckComplete':
43:34.91 pkix_pl_httpdefaultclient.c:268:32: warning: comparison between signed and unsigned integer expressions [-Wsign-compare]
43:34.91 pkix_pl_httpdefaultclient.c:285:41: warning: comparison between signed and unsigned integer expressions [-Wsign-compare]
43:34.91 pkix_pl_httpdefaultclient.c:293:40: warning: comparison between signed and unsigned integer expressions [-Wsign-compare]
43:34.91 pkix_pl_httpdefaultclient.c: In function 'pkix_pl_HttpDefaultClient_RecvBody':
43:34.91 pkix_pl_httpdefaultclient.c:925:39: warning: comparison between signed and unsigned integer expressions [-Wsign-compare]
43:34.91 pkix_pl_httpdefaultclient.c:940:31: warning: comparison between signed and unsigned integer expressions [-Wsign-compare]
43:34.91 pkix_pl_httpdefaultclient.c:945:31: warning: comparison between signed and unsigned integer expressions [-Wsign-compare]
43:34.91 pkix_pl_httpdefaultclient.c:951:38: warning: comparison between signed and unsigned integer expressions [-Wsign-compare]
43:34.91 pkix_pl_httpdefaultclient.c:995:39: warning: comparison between signed and unsigned integer expressions [-Wsign-compare]
43:34.91 pkix_pl_httpdefaultclient.c:1005:43: warning: comparison between signed and unsigned integer expressions [-Wsign-compare]
43:34.91 pkix_pl_httpdefaultclient.c: In function 'pkix_pl_HttpDefaultClient_KeepAliveSession':
43:34.91 pkix_pl_httpdefaultclient.c:1135:36: warning: variable 'client' set but not used [-Wunused-but-set-variable]
43:34.91 pkix_pl_httpdefaultclient.c: In function 'pkix_pl_HttpDefaultClient_TrySendAndReceive':
43:34.91 pkix_pl_httpdefaultclient.c:1429:63: warning: comparison between signed and unsigned integer expressions [-Wsign-compare]
43:34.91 pkix_pl_httpdefaultclient.c: In function 'pkix_pl_HttpDefaultClient_Cancel':
43:34.91 pkix_pl_httpdefaultclient.c:1487:36: warning: variable 'client' set but not used [-Wunused-but-set-variable]
43:35.27 dtlscon.c: In function 'ssl3_DisableNonDTLSSuites':
43:35.27 dtlscon.c:107:19: warning: unused variable 'rv' [-Wunused-variable]
43:35.27 dtlscon.c: In function 'dtls_HandleHandshake':
43:35.27 dtlscon.c:399:37: warning: comparison between signed and unsigned integer expressions [-Wsign-compare]
43:35.27 dtlscon.c:428:48: warning: comparison between signed and unsigned integer expressions [-Wsign-compare]
43:35.27 dtlscon.c: In function 'dtls_TransmitMessageFlight':
43:35.27 dtlscon.c:679:60: warning: comparison between signed and unsigned integer expressions [-Wsign-compare]
43:35.27 dtlscon.c:679:120: warning: signed and unsigned type in conditional expression [-Wsign-compare]
43:35.27 dtlscon.c:717:26: warning: comparison between signed and unsigned integer expressions [-Wsign-compare]
43:35.27 dtlscon.c: In function 'dtls_SetMTU':
43:35.27 dtlscon.c:952:19: warning: comparison between signed and unsigned integer expressions [-Wsign-compare]
43:35.32 pkix_pl_object.c: In function 'pkix_pl_Object_GetHeader':
43:35.32 pkix_pl_object.c:115:34: warning: comparison between signed and unsigned integer expressions [-Wsign-compare]
43:37.49 pkix_pl_ldaprequest.c: In function 'pkix_pl_LdapRequest_Destroy':
43:37.49 pkix_pl_ldaprequest.c:266:30: warning: variable 'ldapRq' set but not used [-Wunused-but-set-variable]
43:38.23 ssl3gthr.c: In function 'ssl3_GatherData':
43:38.23 ssl3gthr.c:75:9: warning: comparison between signed and unsigned integer expressions [-Wsign-compare]
43:38.46 p12e.c: In function 'sec_PKCS12CreateSafeBag':
43:38.46 p12e.c:698:12: warning: variable 'setName' set but not used [-Wunused-but-set-variable]
43:38.47 p12e.c: In function 'sec_pkcs12_encoder_start_context':
43:38.47 p12e.c:1535:12: warning: variable 'rv' set but not used [-Wunused-but-set-variable]
43:38.61 sslauth.c: In function 'SSL_AuthCertificate':
43:38.61 sslauth.c:267:18: warning: unused variable 'error' [-Wunused-variable]
43:38.80 pkix_pl_ldapdefaultclient.c: In function 'pkix_pl_LdapDefaultClient_VerifyBindResponse':
43:38.80 pkix_pl_ldapdefaultclient.c:371:21: warning: '*((void *)&msg+16).resultCode.data' may be used uninitialized in this function [-Wmaybe-uninitialized]
43:38.80 pkix_pl_ldapdefaultclient.c:354:21: note: '*((void *)&msg+16).resultCode.data' was declared here
43:39.13 ssl3con.c: In function 'ssl3_CompressMACEncryptRecord':
43:39.13 ssl3con.c:2559:12: warning: comparison between signed and unsigned integer expressions [-Wsign-compare]
43:39.13 ssl3con.c: In function 'ssl3_FlushHandshakeMessages':
43:39.13 ssl3con.c:3122:19: warning: comparison between signed and unsigned integer expressions [-Wsign-compare]
43:39.13 ssl3con.c: In function 'ssl3_HandleClientHello':
43:39.13 ssl3con.c:7782:23: warning: comparison between signed and unsigned integer expressions [-Wsign-compare]
43:39.13 ssl3con.c:8286:28: warning: comparison between signed and unsigned integer expressions [-Wsign-compare]
43:39.13 ssl3con.c: In function 'ssl3_HandleRSAClientKeyExchange':
43:39.13 ssl3con.c:9211:13: warning: variable 'pmsItem' set but not used [-Wunused-but-set-variable]
43:39.13 ssl3con.c:9207:12: warning: variable 'isTLS' set but not used [-Wunused-but-set-variable]
43:39.13 ssl3con.c: In function 'ssl3_HandleCertificateStatus':
43:39.13 ssl3con.c:9779:13: warning: comparison between signed and unsigned integer expressions [-Wsign-compare]
43:39.13 ssl3con.c: In function 'ssl3_HandleHandshakeMessage':
43:39.13 ssl3con.c:6951:22: warning: 'preferSha1' may be used uninitialized in this function [-Wmaybe-uninitialized]
43:39.13 ssl3con.c:6917:12: note: 'preferSha1' was declared here
43:39.13 ssl3con.c: In function 'ssl3_HandleRecord':
43:39.13 ssl3con.c:11589:21: warning: 'dtls_seq_num' may be used uninitialized in this function [-Wmaybe-uninitialized]
43:39.13 ssl3con.c:11309:14: note: 'dtls_seq_num' was declared here
43:39.70 sslcon.c: In function 'ssl2_SendClear':
43:39.70 sslcon.c:865:17: warning: comparison between signed and unsigned integer expressions [-Wsign-compare]
43:39.70 sslcon.c:894:19: warning: comparison between signed and unsigned integer expressions [-Wsign-compare]
43:39.70 sslcon.c: In function 'ssl2_SendStream':
43:39.70 sslcon.c:944:13: warning: comparison between signed and unsigned integer expressions [-Wsign-compare]
43:39.70 sslcon.c:991:19: warning: comparison between signed and unsigned integer expressions [-Wsign-compare]
43:39.70 sslcon.c: In function 'ssl2_SendBlock':
43:39.70 sslcon.c:1058:13: warning: comparison between signed and unsigned integer expressions [-Wsign-compare]
43:39.70 sslcon.c: In function 'ssl2_ServerSetupSessionCypher':
43:39.70 sslcon.c:1624:15: warning: comparison between signed and unsigned integer expressions [-Wsign-compare]
43:39.70 sslcon.c:1648:20: warning: comparison between signed and unsigned integer expressions [-Wsign-compare]
43:39.70 sslcon.c: In function 'ssl2_HandleMessage':
43:39.70 sslcon.c:2498:9: warning: variable 'rv2' set but not used [-Wunused-but-set-variable]
43:39.70 sslcon.c: In function 'ssl2_HandleServerHelloMessage':
43:39.70 sslcon.c:2802:51: warning: comparison between signed and unsigned integer expressions [-Wsign-compare]
43:39.70 sslcon.c:2813:16: warning: comparison between signed and unsigned integer expressions [-Wsign-compare]
43:39.70 sslcon.c:2815:23: warning: comparison between signed and unsigned integer expressions [-Wsign-compare]
43:39.70 sslcon.c:2815:65: warning: signed and unsigned type in conditional expression [-Wsign-compare]
43:39.70 sslcon.c: In function 'NSSSSL_VersionCheck':
43:39.70 sslcon.c:3687:19: warning: variable 'c' set but not used [-Wunused-but-set-variable]
43:39.70 certread.c: In function 'CERT_DecodeCertPackage':
43:39.70 certread.c:419:16: warning: comparison between signed and unsigned integer expressions [-Wsign-compare]
43:39.70 certread.c:447:13: warning: comparison between signed and unsigned integer expressions [-Wsign-compare]
43:40.10 pkix_pl_pk11certstore.c: In function 'NameCacheHasFetchedCrlInfo':
43:40.10 pkix_pl_pk11certstore.c:382:22: warning: variable 'cert' set but not used [-Wunused-but-set-variable]
43:40.10 pkix_pl_pk11certstore.c: In function 'RemovePartitionedDpsFromList':
43:40.10 pkix_pl_pk11certstore.c:701:20: warning: comparison between signed and unsigned integer expressions [-Wsign-compare]
43:40.10 pkix_pl_pk11certstore.c: In function 'DownloadCrl':
43:40.10 pkix_pl_pk11certstore.c:782:16: warning: variable 'savedError' set but not used [-Wunused-but-set-variable]
43:40.91 cmscipher.c: In function 'NSS_CMSCipherContext_Decrypt':
43:40.91 cmscipher.c:525:28: warning: comparison between signed and unsigned integer expressions [-Wsign-compare]
43:40.97 p7decode.c: In function 'sec_pkcs7_verify_signature':
43:40.97 p7decode.c:1293:21: warning: variable 'crls' set but not used [-Wunused-but-set-variable]
43:41.31 p7encode.c: In function 'sec_pkcs7_encoder_start_encrypt':
43:41.31 p7encode.c:62:18: warning: variable 'wincx' set but not used [-Wunused-but-set-variable]
43:41.65 p7local.c: In function 'sec_PKCS7Decrypt':
43:41.65 p7local.c:556:28: warning: comparison between signed and unsigned integer expressions [-Wsign-compare]
43:42.01 ssl3ext.c: In function 'arrayContainsExtension':
43:42.01 ssl3ext.c:310:19: warning: comparison between signed and unsigned integer expressions [-Wsign-compare]
43:42.01 ssl3ext.c: In function 'ssl3_HandleServerNameXtn':
43:42.01 ssl3ext.c:417:43: warning: comparison between signed and unsigned integer expressions [-Wsign-compare]
43:42.01 ssl3ext.c:425:17: warning: variable 'type' set but not used [-Wunused-but-set-variable]
43:42.01 ssl3ext.c:457:22: warning: comparison between signed and unsigned integer expressions [-Wsign-compare]
43:42.01 ssl3ext.c:458:31: warning: comparison between signed and unsigned integer expressions [-Wsign-compare]
43:42.01 ssl3ext.c: In function 'ssl3_SendSessionTicketXtn':
43:42.01 ssl3ext.c:538:28: warning: comparison between signed and unsigned integer expressions [-Wsign-compare]
43:42.01 ssl3ext.c:561:25: warning: comparison between signed and unsigned integer expressions [-Wsign-compare]
43:42.01 ssl3ext.c: In function 'ssl3_ServerHandleAppProtoXtn':
43:42.01 ssl3ext.c:681:15: warning: comparison between signed and unsigned integer expressions [-Wsign-compare]
43:42.01 ssl3ext.c: In function 'ssl3_ClientSendNextProtoNegoXtn':
43:42.01 ssl3ext.c:782:28: warning: comparison between signed and unsigned integer expressions [-Wsign-compare]
43:42.01 ssl3ext.c:792:25: warning: comparison between signed and unsigned integer expressions [-Wsign-compare]
43:42.01 ssl3ext.c: In function 'ssl3_ClientSendAppProtoXtn':
43:42.01 ssl3ext.c:817:28: warning: comparison between signed and unsigned integer expressions [-Wsign-compare]
43:42.01 ssl3ext.c:857:25: warning: comparison between signed and unsigned integer expressions [-Wsign-compare]
43:42.01 ssl3ext.c: In function 'ssl3_ServerSendAppProtoXtn':
43:42.01 ssl3ext.c:886:28: warning: comparison between signed and unsigned integer expressions [-Wsign-compare]
43:42.01 ssl3ext.c:905:25: warning: comparison between signed and unsigned integer expressions [-Wsign-compare]
43:42.01 ssl3ext.c: In function 'ssl3_ServerSendStatusRequestXtn':
43:42.01 ssl3ext.c:952:28: warning: comparison between signed and unsigned integer expressions [-Wsign-compare]
43:42.01 ssl3ext.c: In function 'ssl3_ClientSendStatusRequestXtn':
43:42.01 ssl3ext.c:985:28: warning: comparison between signed and unsigned integer expressions [-Wsign-compare]
43:42.01 ssl3ext.c:1013:25: warning: comparison between signed and unsigned integer expressions [-Wsign-compare]
43:42.01 ssl3ext.c: In function 'ssl3_SendNewSessionTicket':
43:42.01 ssl3ext.c:1249:19: warning: comparison between signed and unsigned integer expressions [-Wsign-compare]
43:42.01 ssl3ext.c: In function 'ssl3_ServerHandleSessionTicketXtn':
43:42.01 ssl3ext.c:1587:23: warning: comparison between signed and unsigned integer expressions [-Wsign-compare]
43:42.01 ssl3ext.c: In function 'ssl3_SendRenegotiationInfoXtn':
43:42.01 ssl3ext.c:1981:28: warning: comparison between signed and unsigned integer expressions [-Wsign-compare]
43:42.01 ssl3ext.c: In function 'ssl3_ClientSendSigAlgsXtn':
43:42.01 ssl3ext.c:2355:28: warning: comparison between signed and unsigned integer expressions [-Wsign-compare]
43:42.01 ssl3ext.c:2369:25: warning: comparison between signed and unsigned integer expressions [-Wsign-compare]
43:42.01 ssl3ext.c: In function 'ssl3_ClientSendDraftVersionXtn':
43:42.01 ssl3ext.c:2445:28: warning: comparison between signed and unsigned integer expressions [-Wsign-compare]
43:42.01 ssl3ext.c:2458:25: warning: comparison between signed and unsigned integer expressions [-Wsign-compare]
43:42.26 cmsencode.c: In function 'nss_cms_encoder_notify':
43:42.26 cmsencode.c:125:18: warning: variable 'poolp' set but not used [-Wunused-but-set-variable]
43:42.26 cmsencode.c: In function 'nss_cms_before_data':
43:42.26 cmsencode.c:204:18: warning: variable 'poolp' set but not used [-Wunused-but-set-variable]
43:42.66 sslsecur.c: In function 'SSL_ConfigSecureServerWithCertChain':
43:42.66 sslsecur.c:847:5: warning: comparison of unsigned expression < 0 is always false [-Wtype-limits]
43:42.66 sslsecur.c: In function 'ssl_SecureRecv':
43:42.66 sslsecur.c:1180:22: warning: variable 'sec' set but not used [-Wunused-but-set-variable]
43:43.04 crmfpop.c: In function 'CRMF_CertReqMsgSetRAVerifiedPOP':
43:43.04 crmfpop.c:36:14: warning: variable 'dummy' set but not used [-Wunused-but-set-variable]
43:43.04 crmfpop.c: In function 'crmf_generic_encoder_callback':
43:43.04 crmfpop.c:119:38: warning: comparison between signed and unsigned integer expressions [-Wsign-compare]
43:43.04 crmfpop.c: In function 'crmf_encode_popoprivkey':
43:43.04 crmfpop.c:349:33: warning: comparison between signed and unsigned integer expressions [-Wsign-compare]
43:43.33 cmsrecinfo.c: In function 'NSS_CMSRecipientInfo_UnwrapBulkKey':
43:43.33 cmsrecinfo.c:529:21: warning: variable 'encalg' set but not used [-Wunused-but-set-variable]
43:43.38 basicutil.c: In function 'SECU_PrintPRandOSError':
43:43.38 basicutil.c:628:30: warning: comparison between signed and unsigned integer expressions [-Wsign-compare]
43:43.38 basicutil.c:632:30: warning: comparison between signed and unsigned integer expressions [-Wsign-compare]
43:43.38 basicutil.c: In function 'SECU_SECItemHexStringToBinary':
43:43.38 basicutil.c:705:16: warning: comparison between signed and unsigned integer expressions [-Wsign-compare]
43:43.38 basicutil.c:716:16: warning: comparison between signed and unsigned integer expressions [-Wsign-compare]
43:43.38 basicutil.c: In function 'SECU_PrintAsHex':
43:43.38 basicutil.c:286:13: warning: 'column' may be used uninitialized in this function [-Wmaybe-uninitialized]
43:43.73 sslsock.c: In function 'ssl_WriteV':
43:43.73 sslsock.c:2524:30: warning: comparison between signed and unsigned integer expressions [-Wsign-compare]
43:43.73 sslsock.c:2537:68: warning: comparison between signed and unsigned integer expressions [-Wsign-compare]
43:43.73 sslsock.c:2556:28: warning: comparison between signed and unsigned integer expressions [-Wsign-compare]
43:43.73 sslsock.c:2556:59: warning: signed and unsigned type in conditional expression [-Wsign-compare]
43:43.73 sslsock.c:2559:23: warning: comparison between signed and unsigned integer expressions [-Wsign-compare]
43:43.73 sslsock.c:2565:56: warning: comparison between signed and unsigned integer expressions [-Wsign-compare]
43:43.86 crmfcont.c: In function 'CRMF_CreateEncryptedKeyWithEncryptedValue':
43:43.86 crmfcont.c:860:25: warning: variable 'dummy' set but not used [-Wunused-but-set-variable]
43:44.72 sslinfo.c: In function 'SSL_DisableDefaultExportCipherSuites':
43:44.72 sslinfo.c:247:15: warning: variable 'rv' set but not used [-Wunused-but-set-variable]
43:44.72 sslinfo.c: In function 'SSL_DisableExportCipherSuites':
43:44.72 sslinfo.c:268:15: warning: variable 'rv' set but not used [-Wunused-but-set-variable]
43:44.80 cmmfchal.c: In function 'cmmf_create_witness_and_challenge':
43:44.80 cmmfchal.c:33:22: warning: variable 'id' set but not used [-Wunused-but-set-variable]
43:44.90 secutil.c: In function 'SECU_ChangePW2':
43:44.90 secutil.c:333:15: warning: variable 'rv' set but not used [-Wunused-but-set-variable]
43:44.90 secutil.c: In function 'SECU_PrintDumpDerIssuerAndSerial':
43:44.90 secutil.c:1551:19: warning: comparison between signed and unsigned integer expressions [-Wsign-compare]
43:44.90 secutil.c: In function 'secu_PrintPKCS7Signed':
43:44.90 secutil.c:2703:11: warning: passing argument 5 of 'SECU_PrintSignedData' from incompatible pointer type [enabled by default]
43:44.90 In file included from secutil.c:19:0:
43:44.90 secutil.h:260:12: note: expected 'SECU_PPFunc' but argument is of type 'int (*)(struct FILE *, const struct SECItem *, const char *, int)'
43:44.90 secutil.c: In function 'secu_PrintPKCS7SignedAndEnveloped':
43:44.90 secutil.c:2822:11: warning: passing argument 5 of 'SECU_PrintSignedData' from incompatible pointer type [enabled by default]
43:44.90 In file included from secutil.c:19:0:
43:44.90 secutil.h:260:12: note: expected 'SECU_PPFunc' but argument is of type 'int (*)(struct FILE *, const struct SECItem *, const char *, int)'
43:44.90 secutil.c: In function 'SEC_PrintCertificateAndTrust':
43:44.90 secutil.c:3152:10: warning: passing argument 5 of 'SECU_PrintSignedData' from incompatible pointer type [enabled by default]
43:44.90 secutil.c:3125:5: note: expected 'SECU_PPFunc' but argument is of type 'int (*)(struct FILE *, const struct SECItem *, const char *, int)'
43:44.90 secutil.c: In function 'SECU_StoreCRL':
43:44.90 secutil.c:3324:62: warning: comparison between signed and unsigned integer expressions [-Wsign-compare]
43:45.29 ssl3ecc.c: In function 'ssl3_DisableECCSuites':
43:45.29 ssl3ecc.c:969:19: warning: unused variable 'rv' [-Wunused-variable]
43:45.29 ssl3ecc.c: In function 'ssl3_SendSupportedCurvesXtn':
43:45.29 ssl3ecc.c:1130:28: warning: comparison between signed and unsigned integer expressions [-Wsign-compare]
43:45.29 ssl3ecc.c: In function 'ssl3_HandleSupportedCurvesXtn':
43:45.29 ssl3ecc.c:1238:35: warning: comparison between signed and unsigned integer expressions [-Wsign-compare]
43:45.36 smimeutil.c: In function 'NSSSMIME_VersionCheck':
43:45.36 smimeutil.c:770:19: warning: variable 'c' set but not used [-Wunused-but-set-variable]
43:45.36 smimeutil.c: In function 'NSS_SMIMEUtil_FindBulkAlgForRecipients':
43:45.36 smimeutil.c:446:9: warning: 'key_type' may be used uninitialized in this function [-Wmaybe-uninitialized]
43:45.36 smimeutil.c:425:14: note: 'key_type' was declared here
43:45.37 derprint.c: In function 'prettyPrintLength':
43:45.37 derprint.c:454:20: warning: comparison between signed and unsigned integer expressions [-Wsign-compare]
43:45.93 libnss3.so
43:46.20 jarsign.c: In function 'jar_create_pk7':
43:46.20 jarsign.c:174:11: warning: variable 'errstring' set but not used [-Wunused-but-set-variable]
43:46.33 jar.c: In function 'JAR_find_next':
43:46.33 jar.c:423:30: warning: comparison between signed and unsigned integer expressions [-Wsign-compare]
43:46.33 jar.c: In function 'jar_find_first_cert':
43:46.33 jar.c:462:24: warning: comparison between signed and unsigned integer expressions [-Wsign-compare]
43:46.64 jarfile.c: In function 'jar_physical_inflate':
43:46.64 jarfile.c:341:32: warning: comparison between signed and unsigned integer expressions [-Wsign-compare]
43:46.64 jarfile.c:356:38: warning: comparison between signed and unsigned integer expressions [-Wsign-compare]
43:46.64 jarfile.c: In function 'jar_extract_mf':
43:46.64 jarfile.c:578:14: warning: comparison between signed and unsigned integer expressions [-Wsign-compare]
43:46.64 jarfile.c: In function 'jar_listzip':
43:46.64 jarfile.c:702:47: warning: comparison between signed and unsigned integer expressions [-Wsign-compare]
43:46.64 jarfile.c:768:43: warning: comparison between signed and unsigned integer expressions [-Wsign-compare]
43:46.64 jarfile.c: In function 'jar_listtar':
43:46.64 jarfile.c:830:45: warning: comparison between signed and unsigned integer expressions [-Wsign-compare]
43:46.64 jarfile.c:824:12: warning: variable 'when' set but not used [-Wunused-but-set-variable]
43:46.64 jarfile.c:823:14: warning: variable 'mode' set but not used [-Wunused-but-set-variable]
43:48.07 shlibsign.c: In function 'writeItem':
43:48.07 shlibsign.c:150:22: warning: comparison between signed and unsigned integer expressions [-Wsign-compare]
43:48.07 shlibsign.c: In function 'main':
43:48.07 shlibsign.c:908:40: warning: comparison between signed and unsigned integer expressions [-Wsign-compare]
43:48.09 cd mangle; /usr/bin/make libs
43:48.77 loader.c: In function 'freebl_LoadDSO':
43:48.77 loader.c:135:14: warning: variable 'status' set but not used [-Wunused-but-set-variable]
43:48.77 loader.c: In function 'BL_Unload':
43:48.77 loader.c:904:20: warning: unused variable 'status' [-Wunused-variable]
43:48.82 mkdir: kann Verzeichnis „/opt/FirefoxSource/mozilla-release/objdir-droid/security/nss/lib/freebl“ nicht anlegen: Die Datei existiert bereits
43:49.12 ldvector.c: In function 'FREEBL_GetVector':
43:49.12 ldvector.c:301:19: warning: variable 'c' set but not used [-Wunused-but-set-variable]
43:49.14 pk12util.c: In function 'p12u_InitContext':
43:49.14 pk12util.c:104:12: warning: variable 'fileExist' set but not used [-Wunused-but-set-variable]
43:49.14 pk12util.c: In function 'P12U_ListPKCS12File':
43:49.14 pk12util.c:762:30: warning: passing argument 5 of 'SECU_PrintSignedData' from incompatible pointer type [enabled by default]
43:49.14 In file included from pk12util.c:11:0:
43:49.14 /opt/FirefoxSource/mozilla-release/objdir-droid/dist/private/nss/secutil.h:260:12: note: expected 'SECU_PPFunc' but argument is of type 'int (*)(struct FILE *, const struct SECItem *, const char *, int)'
43:50.33 token.c: In function 'nssCKFWToken_GetUTCTime':
43:50.33 token.c:1261:27: warning: variable 'z' set but not used [-Wunused-but-set-variable]
43:50.47 keystuff.c: In function 'UpdateRNG':
43:50.47 keystuff.c:96:18: warning: comparison between signed and unsigned integer expressions [-Wsign-compare]
43:50.47 keystuff.c: In function 'CERTUTIL_GeneratePrivateKey':
43:50.47 keystuff.c:497:15: warning: variable 'algtag' set but not used [-Wunused-but-set-variable]
43:50.79 pk11.c: In function 'ListModule':
43:50.79 pk11.c:612:16: warning: comparison between signed and unsigned integer expressions [-Wsign-compare]
43:51.15 ytab.c: In function 'Pk11Install_yyparse':
43:51.15 ytab.c:219:5: warning: suggest parentheses around assignment used as truth value [-Wparentheses]
43:51.30 rawhash.c: In function 'HASH_GetRawHashObject':
43:51.30 rawhash.c:156:5: warning: comparison of unsigned expression < 0 is always false [-Wtype-limits]
43:51.82 cd builtins; /usr/bin/make libs
43:52.22 sha512.c: In function 'SHA512_Compress':
43:52.22 sha512.c:933:14: warning: unused variable 't1' [-Wunused-variable]
43:52.22 sha512.c:955:18: warning: unused variable 't2' [-Wunused-variable]
43:52.22 sha512.c:955:14: warning: unused variable 't1' [-Wunused-variable]
43:52.22 sha512.c: In function 'SHA512_End':
43:52.22 sha512.c:1229:14: warning: unused variable 't1' [-Wunused-variable]
43:52.22 sha512.c: In function 'SHA512_EndRaw':
43:52.22 sha512.c:1274:14: warning: unused variable 't1' [-Wunused-variable]
43:52.35 bfind.c: In function 'builtins_attrmatch':
43:52.35 bfind.c:122:11: warning: comparison between signed and unsigned integer expressions [-Wsign-compare]
43:52.42 lex.Pk11Install_yy.cpp:1060:13: warning: 'Pkcs11Install_yyunput' defined but not used [-Wunused-function]
43:52.42 lex.Pk11Install_yy.cpp:1106:12: warning: 'input' defined but not used [-Wunused-function]
43:52.57 binst.c: In function 'builtins_mdInstance_GetLibraryVersion':
43:52.57 binst.c:70:17: warning: variable 'c' set but not used [-Wunused-but-set-variable]
43:53.00 cts.c: In function 'CTS_DecryptUpdate':
43:53.00 cts.c:226:23: warning: comparison between signed and unsigned integer expressions [-Wsign-compare]
43:53.29 gcm.c: In function 'gcm_getX':
43:53.29 gcm.c:223:13: warning: comparison between signed and unsigned integer expressions [-Wsign-compare]
43:53.82 dh.c: In function 'DH_Derive':
43:53.82 dh.c:271:13: warning: comparison between signed and unsigned integer expressions [-Wsign-compare]
43:53.95 ecdecode.c: In function 'gf_populate_params':
43:53.95 ecdecode.c:120:5: warning: comparison of unsigned expression < 0 is always false [-Wtype-limits]
43:53.99 ec.c: In function 'ec_points_mul':
43:53.99 ec.c:89:17: warning: comparison between signed and unsigned integer expressions [-Wsign-compare]
43:53.99 ec.c: In function 'EC_ValidatePublicKey':
43:53.99 ec.c:450:33: warning: comparison between signed and unsigned integer expressions [-Wsign-compare]
43:54.33 dsa.c: In function 'DSA_VerifyDigest':
43:54.33 dsa.c:518:25: warning: comparison between signed and unsigned integer expressions [-Wsign-compare]
43:54.33 dsa.c:530:27: warning: comparison between signed and unsigned integer expressions [-Wsign-compare]
43:54.75 pqg.c: In function 'makePrimefromPrimesShaweTaylor':
43:54.75 pqg.c:617:34: warning: comparison between signed and unsigned integer expressions [-Wsign-compare]
43:54.75 pqg.c:687:28: warning: comparison between signed and unsigned integer expressions [-Wsign-compare]
43:54.75 pqg.c: In function 'makePrimefromSeedShaweTaylor':
43:54.75 pqg.c:849:28: warning: comparison between signed and unsigned integer expressions [-Wsign-compare]
43:54.75 pqg.c: In function 'pqg_ParamGen':
43:54.75 pqg.c:1232:18: warning: variable 'b' set but not used [-Wunused-but-set-variable]
43:54.75 pqg.c: In function 'PQG_VerifyParams':
43:54.75 pqg.c:1614:50: warning: comparison between signed and unsigned integer expressions [-Wsign-compare]
43:54.75 pqg.c:1672:25: warning: comparison between signed and unsigned integer expressions [-Wsign-compare]
43:54.75 pqg.c:1708:18: warning: comparison between signed and unsigned integer expressions [-Wsign-compare]
43:54.75 pqg.c:1709:25: warning: comparison between signed and unsigned integer expressions [-Wsign-compare]
43:54.75 pqg.c:1710:33: warning: comparison between signed and unsigned integer expressions [-Wsign-compare]
43:54.75 pqg.c:1733:29: warning: comparison between signed and unsigned integer expressions [-Wsign-compare]
43:54.75 pqg.c:1775:27: warning: 'type' may be used uninitialized in this function [-Wmaybe-uninitialized]
43:54.75 pqg.c:1595:16: note: 'type' was declared here
43:54.75 pqg.c:1777:5: warning: 'hashtype' may be used uninitialized in this function [-Wmaybe-uninitialized]
43:54.75 pqg.c:1594:19: note: 'hashtype' was declared here
43:54.78 rsa.c: In function 'RSA_NewKey':
43:54.78 rsa.c:251:29: warning: comparison between signed and unsigned integer expressions [-Wsign-compare]
43:54.78 rsa.c: In function 'rsa_get_primes_from_exponents':
43:54.78 rsa.c:482:52: warning: comparison between signed and unsigned integer expressions [-Wsign-compare]
43:54.88 shvfy.c: In function 'readItem':
43:54.88 shvfy.c:267:19: warning: comparison between signed and unsigned integer expressions [-Wsign-compare]
43:55.16 mpi/mpprime.c: In function 'mpp_make_prime':
43:55.16 mpi/mpprime.c:445:47: warning: comparison between signed and unsigned integer expressions [-Wsign-compare]
43:55.38 mpi/mplogic.c: In function 'mpl_num_set':
43:55.38 mpi/mplogic.c:230:20: warning: comparison between signed and unsigned integer expressions [-Wsign-compare]
43:55.38 mpi/mplogic.c: In function 'mpl_num_clear':
43:55.38 mpi/mplogic.c:260:20: warning: comparison between signed and unsigned integer expressions [-Wsign-compare]
43:56.81 mpi/mpi.c: In function 'mp_expt':
43:56.81 mpi/mpi.c:1114:20: warning: comparison between signed and unsigned integer expressions [-Wsign-compare]
43:56.81 mpi/mpi.c:1118:22: warning: comparison between signed and unsigned integer expressions [-Wsign-compare]
43:56.81 mpi/mpi.c: In function 's_mp_exptmod':
43:56.81 mpi/mpi.c:1497:20: warning: comparison between signed and unsigned integer expressions [-Wsign-compare]
43:56.81 mpi/mpi.c:1501:22: warning: comparison between signed and unsigned integer expressions [-Wsign-compare]
43:56.81 mpi/mpi.c: In function 'mp_trailing_zeros':
43:56.81 mpi/mpi.c:2012:45: warning: comparison between signed and unsigned integer expressions [-Wsign-compare]
43:56.81 mpi/mpi.c: In function 's_mp_fixup_reciprocal':
43:56.81 mpi/mpi.c:2164:19: warning: comparison between signed and unsigned integer expressions [-Wsign-compare]
43:56.81 mpi/mpi.c:2164:51: warning: signed and unsigned type in conditional expression [-Wsign-compare]
43:56.81 mpi/mpi.c:2166:11: warning: comparison between signed and unsigned integer expressions [-Wsign-compare]
43:56.81 mpi/mpi.c: In function 's_mp_lshd':
43:56.81 mpi/mpi.c:2938:18: warning: comparison between signed and unsigned integer expressions [-Wsign-compare]
43:56.81 mpi/mpi.c: In function 's_mp_mul_2':
43:56.81 mpi/mpi.c:3063:12: warning: comparison between signed and unsigned integer expressions [-Wsign-compare]
43:56.81 mpi/mpi.c: In function 's_mp_todigit':
43:56.81 mpi/mpi.c:4600:10: warning: comparison between signed and unsigned integer expressions [-Wsign-compare]
43:56.81 mpi/mpi.c: In function 'mp_to_unsigned_octets':
43:56.81 mpi/mpi.c:4720:29: warning: comparison between signed and unsigned integer expressions [-Wsign-compare]
43:56.81 mpi/mpi.c: In function 'mp_to_signed_octets':
43:56.81 mpi/mpi.c:4752:29: warning: comparison between signed and unsigned integer expressions [-Wsign-compare]
43:56.81 mpi/mpi.c:4766:20: warning: comparison between signed and unsigned integer expressions [-Wsign-compare]
43:56.81 mpi/mpi.c:4767:18: warning: comparison between signed and unsigned integer expressions [-Wsign-compare]
43:56.81 mpi/mpi.c: In function 'mp_to_fixlen_octets':
43:56.81 mpi/mpi.c:4792:29: warning: comparison between signed and unsigned integer expressions [-Wsign-compare]
43:56.81 mpi/mpi.c:4795:16: warning: comparison between signed and unsigned integer expressions [-Wsign-compare]
43:56.90 ecl/ecp_521.c: In function 'ec_GFp_nistp521_mod':
43:56.90 ecl/ecp_521.c:42:73: warning: comparison between signed and unsigned integer expressions [-Wsign-compare]
43:56.90 ecl/ecp_521.c:50:18: warning: comparison between signed and unsigned integer expressions [-Wsign-compare]
43:57.81 lgglue.c: In function 'sftkdb_resolvePath':
43:57.81 lgglue.c:44:24: warning: comparison between signed and unsigned integer expressions [-Wsign-compare]
43:58.32 lowpbe.c: In function 'nsspkcs5_PKCS12PBE':
43:58.32 lowpbe.c:519:22: warning: comparison between signed and unsigned integer expressions [-Wsign-compare]
43:59.20 sdb.c: In function 'sdb_FindObjectsInit':
43:59.20 sdb.c:702:28: warning: comparison between signed and unsigned integer expressions [-Wsign-compare]
43:59.20 sdb.c:727:32: warning: comparison between signed and unsigned integer expressions [-Wsign-compare]
43:59.20 sdb.c: In function 'sdb_GetAttributeValueNoLock':
43:59.20 sdb.c:848:17: warning: comparison between signed and unsigned integer expressions [-Wsign-compare]
43:59.20 sdb.c:900:34: warning: comparison between signed and unsigned integer expressions [-Wsign-compare]
43:59.20 sdb.c: In function 'sdb_SetAttributeValue':
43:59.20 sdb.c:978:27: warning: comparison between signed and unsigned integer expressions [-Wsign-compare]
43:59.20 sdb.c:1007:17: warning: comparison between signed and unsigned integer expressions [-Wsign-compare]
43:59.20 sdb.c: In function 'sdb_CreateObject':
43:59.20 sdb.c:1138:42: warning: comparison between signed and unsigned integer expressions [-Wsign-compare]
43:59.20 sdb.c:1168:17: warning: comparison between signed and unsigned integer expressions [-Wsign-compare]
43:59.29 pkcs11u.c: In function 'sftk_DeleteObject':
43:59.30 pkcs11u.c:1177:22: warning: unused variable 'to' [-Wunused-variable]
43:59.30 pkcs11u.c: In function 'sftk_NewTokenObject':
43:59.30 pkcs11u.c:1902:22: warning: variable 'tokObject' set but not used [-Wunused-but-set-variable]
43:59.50 pkcs11.c: In function 'sftk_GetPubKey':
43:59.50 pkcs11.c:1756:35: warning: comparison between signed and unsigned integer expressions [-Wsign-compare]
43:59.50 pkcs11.c:1764:35: warning: comparison between signed and unsigned integer expressions [-Wsign-compare]
43:59.50 pkcs11.c:1774:27: warning: comparison between signed and unsigned integer expressions [-Wsign-compare]
43:59.50 pkcs11.c: In function 'NSC_GetInfo':
43:59.50 pkcs11.c:3144:19: warning: variable 'c' set but not used [-Wunused-but-set-variable]
43:59.50 pkcs11.c: In function 'NSC_GetAttributeValue':
43:59.50 pkcs11.c:4314:58: warning: comparison between signed and unsigned integer expressions [-Wsign-compare]
43:59.50 pkcs11.c: In function 'sftk_emailhack':
43:59.50 pkcs11.c:4527:17: warning: comparison between signed and unsigned integer expressions [-Wsign-compare]
43:59.50 pkcs11.c: In function 'NSC_FindObjects':
43:59.50 pkcs11.c:4743:54: warning: signed and unsigned type in conditional expression [-Wsign-compare]
43:59.50 pkcs11.c: In function 'NSC_CreateObject':
43:59.50 pkcs11.c:4085:21: warning: 'moduleIndex' may be used uninitialized in this function [-Wmaybe-uninitialized]
43:59.50 pkcs11.c:4005:19: note: 'moduleIndex' was declared here
43:59.55 sftkhmac.c: In function 'sftk_HMACConstantTime_Update':
43:59.55 sftkhmac.c:149:15: warning: unused variable 'rv' [-Wunused-variable]
43:59.55 sftkhmac.c: In function 'sftk_SSLv3MACConstantTime_Update':
43:59.55 sftkhmac.c:163:15: warning: unused variable 'rv' [-Wunused-variable]
44:00.06 sftkdb.c: In function 'sftkdb_fixupTemplateOut':
44:00.06 sftkdb.c:328:22: warning: variable 'data' set but not used [-Wunused-but-set-variable]
44:00.06 sftkdb.c:345:69: warning: comparison between signed and unsigned integer expressions [-Wsign-compare]
44:00.06 sftkdb.c: In function 'sftk_signTemplate':
44:00.06 sftkdb.c:520:17: warning: comparison between signed and unsigned integer expressions [-Wsign-compare]
44:00.06 sftkdb.c: In function 'sftkdb_CreateObject':
44:00.06 sftkdb.c:576:12: warning: variable 'inTransaction' set but not used [-Wunused-but-set-variable]
44:00.06 sftkdb.c: In function 'sftk_ExtractTemplate':
44:00.06 sftkdb.c:619:17: warning: comparison between signed and unsigned integer expressions [-Wsign-compare]
44:00.06 sftkdb.c:632:17: warning: comparison between signed and unsigned integer expressions [-Wsign-compare]
44:00.06 sftkdb.c: In function 'sftkdb_resolveConflicts':
44:00.06 sftkdb.c:1045:13: warning: comparison between signed and unsigned integer expressions [-Wsign-compare]
44:00.06 sftkdb.c: In function 'sftkdb_FindObjects':
44:00.06 sftkdb.c:1261:14: warning: comparison between signed and unsigned integer expressions [-Wsign-compare]
44:00.06 sftkdb.c: In function 'sftkdb_GetObjectTemplate':
44:00.06 sftkdb.c:1613:14: warning: comparison between signed and unsigned integer expressions [-Wsign-compare]
44:00.06 sftkdb.c:1631:63: warning: comparison between signed and unsigned integer expressions [-Wsign-compare]
44:00.06 sftkdb.c: In function 'sftkdb_handleIDAndName':
44:00.06 sftkdb.c:2014:11: warning: variable 'crv' set but not used [-Wunused-but-set-variable]
44:00.06 sftkdb.c: In function 'sftkdb_mergeObject':
44:00.06 sftkdb.c:2196:17: warning: comparison between signed and unsigned integer expressions [-Wsign-compare]
44:00.06 sftkdb.c: In function 'sftkdb_Update':
44:00.06 sftkdb.c:2301:38: warning: comparison between signed and unsigned integer expressions [-Wsign-compare]
44:00.13 sftkpwd.c: In function 'sftk_updateMacs':
44:00.13 sftkpwd.c:908:17: warning: comparison between signed and unsigned integer expressions [-Wsign-compare]
44:00.13 sftkpwd.c:909:31: warning: comparison between signed and unsigned integer expressions [-Wsign-compare]
44:00.13 sftkpwd.c:930:17: warning: comparison between signed and unsigned integer expressions [-Wsign-compare]
44:00.13 sftkpwd.c:935:31: warning: comparison between signed and unsigned integer expressions [-Wsign-compare]
44:00.13 sftkpwd.c:868:11: warning: variable 'crv2' set but not used [-Wunused-but-set-variable]
44:00.13 sftkpwd.c:867:11: warning: variable 'crv' set but not used [-Wunused-but-set-variable]
44:00.13 sftkpwd.c: In function 'sftk_updateEncrypted':
44:00.13 sftkpwd.c:986:17: warning: comparison between signed and unsigned integer expressions [-Wsign-compare]
44:00.13 sftkpwd.c:993:31: warning: comparison between signed and unsigned integer expressions [-Wsign-compare]
44:00.13 sftkpwd.c: In function 'sftkdb_convertObjects':
44:00.13 sftkpwd.c:1125:38: warning: comparison between signed and unsigned integer expressions [-Wsign-compare]
44:00.93 pkcs11c.c: In function 'NSC_GenerateKeyPair':
44:00.93 pkcs11c.c:4340:9: warning: variable 'private_value_bits' set but not used [-Wunused-but-set-variable]
44:00.93 pkcs11c.c: In function 'sftk_PackagePrivateKey':
44:00.93 pkcs11c.c:4862:14: warning: variable 'fordebug' set but not used [-Wunused-but-set-variable]
44:00.93 pkcs11c.c: In function 'NSC_DeriveKey':
44:00.93 pkcs11c.c:6764:18: warning: comparison between signed and unsigned integer expressions [-Wsign-compare]
44:00.93 pkcs11c.c:6769:18: warning: comparison between signed and unsigned integer expressions [-Wsign-compare]
44:00.93 pkcs11c.c:6850:20: warning: comparison between signed and unsigned integer expressions [-Wsign-compare]
44:00.93 pkcs11c.c: In function 'NSC_GenerateKeyPair':
44:00.93 pkcs11c.c:4260:6: warning: 'subPrimeLen' may be used uninitialized in this function [-Wmaybe-uninitialized]
44:00.93 pkcs11c.c:4042:14: note: 'subPrimeLen' was declared here
44:00.93 pkcs11c.c:4212:23: warning: 'modulusLen' may be used uninitialized in this function [-Wmaybe-uninitialized]
44:00.93 pkcs11c.c:4041:14: note: 'modulusLen' was declared here
44:00.93 pkcs11c.c: In function 'NSC_GenerateKey':
44:00.93 pkcs11c.c:3968:13: warning: 'hashType' may be used uninitialized in this function [-Wmaybe-uninitialized]
44:01.48 libjs_static.a
44:43.00 libjs_static.a.desc
44:43.59 libeditline.a.desc
44:43.67 js
44:48.03 jsapi-tests
44:53.36 gdb-tests
44:57.45 libcertverifier.a.desc
44:57.53 libmozillapkix.a.desc
44:57.63 libmozillapkix_gtest.a.desc
44:57.72 libpkixtestutil.a.desc
44:57.81 libsecurity_apps.a.desc
44:58.08 libxpt.a
44:58.69 libxpt.a.desc
44:58.95 libxpcom_string.a.desc
44:59.19 libxpcomglue_s.a
44:59.99 libxpcomglue_s.a.desc
45:00.13 libxpcomglue.a
45:00.18 libxpcomglue.a.desc
45:00.32 libxpcomglue_s_nomozalloc.a
45:00.38 libxpcomglue_s_nomozalloc.a.desc
45:00.51 libxpcom_glue_gtest.a.desc
45:00.72 libxpcom_base.a.desc
45:01.23 libxpcom_ds.a.desc
45:01.50 libxpcom_io.a.desc
45:01.69 libxpcom_components.a.desc
45:01.95 libxpcom_threads.a.desc
45:02.12 libxpcom_reflect_xptinfo.a.desc
45:02.30 libxpcom_reflect_xptcall.a.desc
45:02.39 libxpcom_reflect_xptcall_md_unix.a.desc
45:02.78 libchrome_src.a.desc
45:03.18 libxpcom_core.a.desc
45:03.46 libmodules_libpref_src.a.desc
45:03.53 /opt/FirefoxSource/mozilla-release/netwerk/base/public/security-prefs.js: WARNING: no preprocessor directives found
45:03.66 libintl_hyphenation_src.a.desc
45:03.89 libintl_locale_src.a.desc
45:03.97 libintl_locale_src_unix.a.desc
45:04.29 libintl_lwbrk_src.a.desc
45:04.51 libintl_strres_src.a.desc
45:04.74 libunicharutil_external_s.a
45:04.94 libunicharutil_external_s.a.desc
45:05.02 libintl_unicharutil_util_internal.a
45:05.06 libintl_unicharutil_util_internal.a.desc
45:05.16 libintl_unicharutil_src.a.desc
45:06.34 libintl_uconv_src.a.desc
45:06.61 libi18n.a.desc
45:07.40 libnetwerk_base_src.a.desc
45:07.68 libnetwerk_cookie.a.desc
45:07.89 libnetwerk_dns.a.desc
45:08.16 libnetwerk_socket.a.desc
45:08.34 libnetwerk_mime.a.desc
45:08.61 libnetwerk_streamconv_src.a.desc
45:08.83 libnetwerk_streamconv_converters.a.desc
45:09.01 libnetwerk_cache.a.desc
45:09.31 libnetwerk_cache2.a.desc
45:09.65 libnetwerk_protocol_about.a.desc
45:09.80 libnetwerk_protocol_app.a.desc
45:09.92 libnetwerk_protocol_data.a.desc
45:10.07 libnetwerk_protocol_device.a.desc
45:10.19 libnetwerk_protocol_file.a.desc
45:10.42 libnetwerk_protocol_ftp.a.desc
45:10.98 libnetwerk_protocol_http.a.desc
45:11.31 libnetwerk_protocol_res.a.desc
45:11.46 libnetwerk_protocol_viewsource.a.desc
45:11.66 libnetwerk_protocol_websocket.a.desc
45:11.83 libnetwerk_protocol_wyciwyg.a.desc
45:12.06 libnetwerk_system_android.a.desc
45:12.31 libnetwerk_ipc.a.desc
45:12.72 libnecko.a.desc
45:12.89 libextensions_auth.a.desc
45:13.80 libipc_chromium.a.desc
45:14.33 libipc_glue.a.desc
45:14.83 libipc_ipdl.a.desc
45:15.04 libipc_testshell.a.desc
45:15.18 libjs_ipc.a.desc
45:15.53 libhal.a.desc
45:15.93 libjs_xpconnect_wrappers.a.desc
45:16.06 libjs_xpconnect_loader.a.desc
45:16.87 libxpconnect_s.a.desc
45:17.11 libintl_chardet_src.a.desc
45:17.21 libyuv_neon.a.desc
45:17.37 libyuv.a.desc
45:17.56 libjar.a.desc
45:17.83 libmodules_libjar_zipwriter_src.a.desc
45:18.22 libstorage_src.a.desc
45:18.34 libstoragecomps.a.desc
45:18.48 libextensions_cookie.a.desc
45:18.66 libextensions_permissions.a.desc
45:18.93 librdf_base_src.a.desc
45:19.04 librdfutil_external_s.a
45:19.11 librdfutil_external_s.a.desc
45:19.18 librdf_util_src_internal.a.desc
45:19.30 librdf_datasource_src.a.desc
45:19.38 librdf.a.desc
45:19.46 libutils.so
45:19.61 libstagefright.so
45:19.74 libvideoeditorplayer.so
45:19.88 libutils.so
45:20.01 libstagefright.so
45:20.13 libstagefright_color_conversion.so
45:20.25 libstagefright.so
45:20.40 libstagefright.so
45:20.53 libomxplugin.so
45:20.66 libomxplugingb.so
45:20.80 libomxplugingb235.so
45:20.94 libomxpluginfroyo.so
45:21.07 libstagefright.so
45:21.21 libomxpluginhc.so
45:21.35 libomxpluginkk.so
45:21.83 libgtest.a.desc
45:21.91 liburiloader_base.a.desc
45:22.08 liburiloader_exthandler.a.desc
45:22.26 WriteArgument
45:22.39 liburiloader_prefetch.a.desc
45:22.56 libcaps.a.desc
45:22.71 libparser_expat_lib.a.desc
45:22.92 libparser_xml_src.a.desc
45:23.16 libhtmlpars.a.desc
45:23.33 libparser_html.a.desc
45:23.64 libgfx_cairo_cairo_src.a.desc
45:23.82 libgfx_cairo_libpixman_src.a.desc
45:23.95 libgfx_2d.a.desc
45:24.10 libgfx_ycbcr.a.desc
45:24.26 libgfx_angle.a.desc
45:24.46 libgfx_src.a.desc
45:24.62 libgfx_qcms.a.desc
45:24.75 libgfx_gl.a.desc
45:25.14 libgfx_layers.a.desc
45:25.59 libgfx_graphite2_src.a.desc
45:25.71 libgfx_harfbuzz_src.a.desc
45:25.84 libgfx_ots_src.a.desc
45:26.04 libthebes.a.desc
45:26.23 libgfx_ipc.a.desc
45:26.76 libgfx_skia.a.desc
45:27.47 libgfxtest.a.desc
45:27.77 libimage_src.a.desc
45:27.95 libimage_decoders.a.desc
45:28.06 libimage_decoders_icon_android.a.desc
45:28.14 libimgicon.a.desc
45:28.28 libimage_encoders_ico.a.desc
45:28.38 libimage_encoders_png.a.desc
45:28.45 libimage_encoders_jpeg.a.desc
45:28.53 libimage_encoders_bmp.a.desc
45:28.61 libimglib2.a.desc
45:31.42 libdom_animation.a.desc
45:31.50 libdom_apps_src.a.desc
45:31.82 libdom_base.a.desc
45:32.30 libdom_activities_src.a.desc
45:32.42 libdom_archivereader.a.desc
45:32.74 libdom_bindings.a.desc
45:33.16 libdombindings_test_s.a.desc
45:33.29 libdom_battery.a.desc
45:33.38 libdom_browser-element.a.desc
45:33.61 libdom_crypto.a.desc
45:33.84 libdom_alarm.a.desc
45:34.01 libdom_datastore.a.desc
45:34.20 libdom_devicestorage.a.desc
45:34.30 libdom_encoding.a.desc
45:34.50 libdom_events.a.desc
45:34.84 libdom_filehandle.a.desc
45:34.97 libdom_filesystem.a.desc
45:35.10 libdom_asmjscache.a.desc
45:35.20 libdom_media.a.desc
45:35.58 libdom_power.a.desc
45:35.85 libdom_quota.a.desc
45:36.26 libdom_mobilemessage_src.a.desc
45:36.54 libdom_src_jsurl.a.desc
45:36.64 libdom_src_storage.a.desc
45:36.73 libdom_src_offline.a.desc
45:36.82 libdom_src_json.a.desc
45:36.90 libdom_src_geolocation.a.desc
45:36.99 libdom_src_notification.a.desc
45:37.12 libdom_time.a.desc
45:37.62 libdom_network_src.a.desc
45:37.89 libdom_plugins_base.a.desc
45:38.11 libdom_plugins_base_android.a.desc
45:38.28 libdom_plugins_ipc.a.desc
45:38.52 libdom_indexedDB.a.desc
45:38.73 libdom_indexedDB_ipc.a.desc
45:38.98 /opt/FirefoxSource/mozilla-release/dom/indexedDB/test/extensions/bootstrap.js: WARNING: no preprocessor directives found
45:39.24 libdom_system.a.desc
45:39.40 libdom_system_android.a.desc
45:39.58 libdom_ipc.a.desc
45:40.64 libdom_workers.a.desc
45:40.88 /opt/FirefoxSource/mozilla-release/dom/workers/test/extensions/bootstrap/worker.js: WARNING: no preprocessor directives found
45:40.89 /opt/FirefoxSource/mozilla-release/dom/workers/test/extensions/bootstrap/bootstrap.js: WARNING: no preprocessor directives found
45:40.99 /opt/FirefoxSource/mozilla-release/dom/workers/test/extensions/traditional/worker.js: WARNING: no preprocessor directives found
45:41.14 libdom_camera.a.desc
45:41.27 libdom_audiochannel.a.desc
45:41.42 libdom_promise.a.desc
45:41.55 libdom_smil.a.desc
45:41.71 libdom_telephony.a.desc
45:42.11 libdom_xbl.a.desc
45:42.57 libdom_xslt_base.a.desc
45:42.66 libdom_xslt_xml.a.desc
45:42.81 libdom_xslt_xpath.a.desc
45:43.05 libdom_xslt_xslt.a.desc
45:43.53 libdom_resourcestats.a.desc
45:43.88 libdom_gamepad.a.desc
45:44.07 libnptest.so
45:44.28 libnpsecondtest.so
45:44.40 libnptestjava.so
45:44.58   adding: install.rdf (deflated 52%)
45:44.62   adding: plugins/libnptest.so (deflated 60%)
45:44.66   adding: plugins/libnpsecondtest.so (deflated 60%)
45:44.73 libview_src.a.desc
45:44.94 libwidget_shared.a.desc
45:45.09 libxpwidgets_s.a.desc
45:45.32 libwidget_android.a.desc
45:45.93 libcontent_base_src.a.desc
45:46.71 libcontent_canvas_src.a.desc
45:47.49 libcontent_html_content_src.a.desc
45:48.07 libcontent_html_document_src.a.desc
45:48.19 libcontent_mathml_content_src.a.desc
45:48.40 libcontent_media.a.desc
45:48.66 libcontent_media_encoder.a.desc
45:48.78 libmozgmp.a.desc
45:48.98 libcontent_media_mediasource.a.desc
45:49.10 libcontent_media_ogg.a.desc
45:49.27 libcontent_media_webaudio.a.desc
45:49.51 libcontent_media_webaudio_blink.a.desc
45:49.79 libcontent_media_raw.a.desc
45:49.88 libcontent_media_wave.a.desc
45:49.98 libcontent_media_webm.a.desc
45:50.07 libcontent_media_android.a.desc
45:50.17 libcontent_media_webrtc.a.desc
45:50.33 libcontent_media_webspeech_synth.a.desc
45:50.52 libcontent_media_webspeech_recognition.a.desc
45:50.70 libcontent_media_eme.a.desc
45:50.80 libmedia_gtest.a.desc
45:50.89 libcontent_svg_document_src.a.desc
45:51.37 libcontent_svg_content_src.a.desc
45:52.06 libcontent_xml_content_src.a.desc
45:52.34 libcontent_xml_document_src.a.desc
45:52.56 libcontent_xul_document_src.a.desc
45:52.77 libcontent_xul_content_src.a.desc
45:53.04 libcontent_xul_templates_src.a.desc
45:53.31 libeditor_txtsvc.a.desc
45:53.49 libeditor_libeditor_base.a.desc
45:53.66 libeditor_libeditor_text.a.desc
45:53.82 libeditor_libeditor_html.a.desc
45:53.97 libeditor_txmgr.a.desc
45:54.11 libeditor_composer.a.desc
45:54.38 liblayout_style.a.desc
45:55.06 liblayout_base.a.desc
45:55.53 liblayout_generic.a.desc
45:55.99 liblayout_forms.a.desc
45:56.20 liblayout_tables.a.desc
45:56.43 liblayout_svg.a.desc
45:56.78 liblayout_xul.a.desc
45:57.13 liblayout_xul_tree.a.desc
45:57.33 liblayout_xul_grid.a.desc
45:57.44 liblayout_ipc.a.desc
45:57.66 liblayout_mathml.a.desc
45:57.94 liblayout_inspector.a.desc
45:58.28 liblayout_printing.a.desc
45:58.46 libgklayout.a.desc
45:58.68 libgkmedias.a.desc
45:58.87 libdocshell_base.a.desc
45:59.18 libdocshell_shistory_src.a.desc
45:59.27 libdocshell_build.a.desc
45:59.72 libembedding_components_windowwatcher_src.a.desc
45:59.81 libembedding_components_appstartup_src.a.desc
46:00.01 libembedding_components_find_src.a.desc
46:00.19 libembedding_components_webbrowserpersist_src.a.desc
46:00.39 libembedding_components_commandhandler_src.a.desc
46:00.47 libembedding_components_printingui_src_unixshared.a.desc
46:00.56 libembedcomponents.a.desc
46:00.66 libembedding_browser_webBrowser.a.desc
46:00.81 libwebbrwsr.a.desc
46:01.12 libxpfe_appshell_src.a.desc
46:01.23 libother-licenses_skia-npapi.a.desc
46:01.33 libextensions_universalchardet_src_base.a.desc
46:01.42 libuniversalchardet.a.desc
46:01.50 libaccessible_other.a.desc
46:01.65 libaccessible_base.a.desc
46:01.88 libaccessible_generic.a.desc
46:02.04 libaccessible_html.a.desc
46:02.42 libaccessible_xpcom.a.desc
46:02.56 libaccessible_xul.a.desc
46:02.82 libprofdirserviceprovidersa_s.a.desc
46:02.94 libtools_profiler.a.desc
46:03.13 libsps_test.a.desc
46:03.21 libxpfe_components_windowds.a.desc
46:03.37 libxpfe_components_directory.a.desc
46:03.50 libappcomps.a.desc
46:03.76 libextensions_spellcheck_hunspell_src.a.desc
46:03.89 libspellchecker.a.desc
46:04.12 libsecurity_manager_boot_src.a.desc
46:04.32 libsecurity_manager_ssl_src.a.desc
46:04.66 libtlsserver.a.desc
46:04.74 BadCertServer
46:04.74 GenerateOCSPResponse
46:04.74 OCSPStaplingServer
46:04.88 libssltest.a.desc
46:05.45 libsecurity_manager_pki_src.a.desc
46:05.93 libtoolkit_components_alerts.a.desc
46:06.24 libtoolkit_components_commandlines.a.desc
46:06.80 libtoolkit_components_diskspacewatcher.a.desc
46:07.07 libtoolkit_components_downloads.a.desc
46:07.46 libtoolkit_components_finalizationwitness.a.desc
46:07.79 libtoolkit_components_find.a.desc
46:08.02 libtoolkit_components_jsdownloads_src.a.desc
46:08.22 libtoolkit_components_mediasniffer.a.desc
46:08.40 libtoolkit_components_osfile.a.desc
46:08.57 libtoolkit_components_parentalcontrols.a.desc
46:09.35 libtoolkit_components_perf.a.desc
46:10.20 libtoolkit_components_protobuf.a.desc
46:10.28 libtoolkit_components_reflect.a.desc
46:10.43 libtoolkit_components_startup.a.desc
46:10.65 libtoolkit_components_statusfilter.a.desc
46:10.73 libtoolkit_components_telemetry.a.desc
46:11.20 libtoolkit_components_typeaheadfind.a.desc
46:11.82 libtoolkit_components_workerlz4.a.desc
46:11.89 libtoolkit_components_ctypes.a.desc
46:11.96 libjsctypes-test.so
46:12.38 libtoolkit_components_autocomplete.a.desc
46:12.51 libtoolkit_components_satchel.a.desc
46:12.95 libtoolkit_components_url-classifier.a.desc
46:13.15 libtoolkitcomps.a.desc
46:14.23 libtoolkit_devtools_server.a.desc
46:15.30 libtoolkit_identity.a.desc
46:16.12 libtoolkit_mozapps_extensions.a.desc
46:18.13 BadPlugin
46:18.13 GoodPlugin
46:18.39 libtoolkit_profile.a.desc
46:19.56 TestWebappRT
46:19.67 libtoolkit_system_androidproxy.a.desc
46:19.77 libbreakpad_common_s.a.desc
46:19.94 libtoolkit_crashreporter_google-breakpad_src_processor.a.desc
46:20.04 libbreakpad_linux_common_s.a.desc
46:20.47 libxulapp_s.a.desc
46:20.75 libextensions_pref_autoconfig_src.a.desc
46:21.08 libservices_crypto_component.a.desc
46:21.39 libstartupcache.a.desc
46:21.52 libjs_ductwork_debugger.a.desc
46:21.65 libother-licenses_snappy.a.desc
46:21.74 libbrowsercomps.a.desc
46:21.88 libxul.a.desc
46:22.20 libStaticXULComponentsEnd.a.desc
46:22.28 libxul.so
50:37.10 /opt/FirefoxSource/mozilla-release/tools/quitter/chrome.manifest: WARNING: no preprocessor directives found
50:39.19 ssltunnel
50:42.88 /opt/FirefoxSource/mozilla-release/mobile/android/thirdparty/jap/branding/locales/en-US/brand.properties: WARNING: no useful preprocessor directives found
50:44.08 /opt/FirefoxSource/mozilla-release/mobile/locales/en-US/overrides/netError.dtd: WARNING: no preprocessor directives found
50:44.08 /opt/FirefoxSource/mozilla-release/mobile/locales/en-US/overrides/appstrings.properties: WARNING: no useful preprocessor directives found
50:44.08 /opt/FirefoxSource/mozilla-release/mobile/locales/en-US/overrides/passwordmgr.properties: WARNING: no useful preprocessor directives found
50:45.46 /opt/FirefoxSource/mozilla-release/mobile/android/base/WebappManifestFragment.xml.frag.in: WARNING: no preprocessor directives found
50:46.55 gecko-mozglue.jar
50:46.59 squareup-picasso.jar
50:46.90 sync-thirdparty.jar
50:46.91 websockets.jar
50:47.60 Reading 0 suggested sites: []
50:47.61 /opt/FirefoxSource/mozilla-release/objdir-droid/mobile/android/base/res/raw/suggestedsites.json updated
50:47.73 make[5]: *** Keine Regel vorhanden, um das Target »/opt/FirefoxSource/mozilla-release/mobile/android/thirdparty/jap/jar_dependencies/anonlib-00.19.006-SNAPSHOT.jar«,
50:47.73   benötigt von »gecko-browser.jar«, zu erstellen.  Schluss.
50:47.73 make[5]: *** Warte auf noch nicht beendete Prozesse...
50:50.27 generated/org/mozilla/gecko/mozglue/GeckoLoader.java:284: warning: [deprecation] CPU_ABI in Build has been deprecated
50:50.27         final String abi = android.os.Build.CPU_ABI;
50:50.27                                            ^
50:50.32 generated/org/mozilla/gecko/mozglue/GeckoLoader.java:346: warning: [deprecation] CPU_ABI in Build has been deprecated
50:50.32         message.append(": ABI: " + MOZ_APP_ABI + ", " + android.os.Build.CPU_ABI);
50:50.32                                                                         ^
50:50.49 2 warnings
50:51.45 Note: /opt/FirefoxSource/mozilla-release/mobile/android/thirdparty/com/squareup/picasso/Utils.java uses or overrides a deprecated API.
50:51.45 Note: Recompile with -Xlint:deprecation for details.
50:54.43 Note: Some input files use or override a deprecated API.
50:54.43 Note: Recompile with -Xlint:deprecation for details.
50:54.43 Note: Some input files use unchecked or unsafe operations.
50:54.43 Note: Recompile with -Xlint:unchecked for details.
50:54.72 make[4]: *** [mobile/android/base/libs] Fehler 2
50:54.72 make[3]: *** [libs] Fehler 2
50:54.72 make[2]: *** [default] Fehler 2
50:54.72 make[1]: *** [realbuild] Fehler 2
50:54.73 make: *** [build] Fehler 2
50:54.75 452 compiler warnings present.
Build step 'Shell ausführen' marked build as failure
[PostBuildScript] - Execution post build scripts.
[PostBuildScript] Build is not success : do not execute script
Finished: FAILURE