Console Output

Gestartet durch Benutzer sk13
[EnvInject] - Loading node environment variables.
Baue in Arbeitsbereich /var/lib/jenkins/jobs/AN.ON Fennec/workspace
Updating https://anon.inf.tu-dresden.de/svn/ANONFennec/ANONFennec/trunk at revision '2015-03-12T23:16:21.400 +0100'
U         util/maven-dl
U         build
U         fennec_diff/mobile/android/base/Makefile.in
At revision 52
[EnvInject] - Executing scripts and injecting environment variables after the SCM step.
[EnvInject] - Injecting as environment variables the properties content 
FENNEC_BRANCH=FENNEC_33_1_RELEASE
FENNEC_FOLDER=/opt/FirefoxSource/mozilla-release
OBJDIR=/opt/FirefoxSource/mozilla-release/objdir-droid
JAVA7_HOME=/opt/java/jdk1.7
ANDROID_SDK_ROOT=/opt/android-sdk-linux
ANDROID_NDK=/opt/android-ndk-r8e
ADDON_SDK=/opt/FirefoxAddonSDK/addon-sdk-1.17
ANDROID_PLATFORM_VERSION=21
PYTHON2=/usr/bin/python2
M2_HOME=/opt/maven

[EnvInject] - Variables injected successfully.
[workspace] $ /bin/sh -xe /tmp/tomcat6-tomcat6-tmp/hudson3104902578631409624.sh
+ /var/lib/jenkins/jobs/AN.ON Fennec/workspace/build
Warning: 'conf' configuration file not found and not read...
Reset fennec source tree state
setze zurück: config/android-common.mk
setze zurück: mobile/android/base/AndroidManifest.xml.in
setze zurück: mobile/android/base/BrowserApp.java
setze zurück: mobile/android/base/Makefile.in
setze zurück: mobile/android/base/fxa/FirefoxAccounts.java
setze zurück: mobile/android/base/moz.build
setze zurück: mobile/android/base/resources/layout/fxaccount_custom_server_view.xml
setze zurück: mobile/android/base/sync/setup/SyncAccounts.java
setze zurück: mobile/android/chrome/content/browser.js
setze zurück: mobile/android/components/MobileComponents.manifest
setze zurück: mobile/android/components/Snippets.js
setze zurück: mobile/android/config/proguard.cfg
setze zurück: mobile/android/confvars.sh
setze zurück: mobile/locales/Makefile.in
setze zurück: mobile/locales/en-US/chrome/region.properties
setze zurück: mobile/locales/en-US/searchplugins/list.txt
setze zurück: xpcom/base/nsMemoryInfoDumper.cpp
0 Dateien aktualisiert, 0 Dateien zusammengeführt, 0 Dateien entfernt, 0 Dateien ungelöst
Apply changes to source tree
Copy and update mozconfig
download java library dependencies
[INFO] Scanning for projects...
[INFO]                                                                         
[INFO] ------------------------------------------------------------------------
[INFO] Building Maven Stub Project (No POM) 1
[INFO] ------------------------------------------------------------------------
[INFO] 
[INFO] --- maven-dependency-plugin:2.1:get (default-cli) @ standalone-pom ---
[INFO] ------------------------------------------------------------------------
[INFO] BUILD FAILURE
[INFO] ------------------------------------------------------------------------
[INFO] Total time: 2.940s
[INFO] Finished at: Thu Mar 12 23:17:40 CET 2015
[INFO] Final Memory: 5M/108M
[INFO] ------------------------------------------------------------------------
[ERROR] Failed to execute goal org.apache.maven.plugins:maven-dependency-plugin:2.1:get (default-cli) on project standalone-pom: The parameters 'repositoryUrl' for goal org.apache.maven.plugins:maven-dependency-plugin:2.1:get are missing or invalid -> [Help 1]
[ERROR] 
[ERROR] To see the full stack trace of the errors, re-run Maven with the -e switch.
[ERROR] Re-run Maven using the -X switch to enable full debug logging.
[ERROR] 
[ERROR] For more information about the errors and possible solutions, please read the following articles:
[ERROR] [Help 1] http://cwiki.apache.org/confluence/display/MAVEN/PluginParameterException
Build step 'Shell ausführen' marked build as failure
[PostBuildScript] - Execution post build scripts.
[PostBuildScript] Build is not success : do not execute script
Finished: FAILURE