Console Output

Skipping 544 KB.. Full Log
25:27.17 MediaDecoderStateMachine.o
25:27.20 nsDOMBlobBuilder.o
25:28.58 WebGLExtensionCompressedTextureS3TC.o
25:28.72 MediaDecoderStateMachineScheduler.o
25:28.82 HTMLMenuElement.o
25:29.38 nsDOMCaretPosition.o
25:31.43 nsDOMFile.o
25:31.59 WebGLExtensionDebugRendererInfo.o
25:33.34 MediaRecorder.o
25:33.83 nsDOMFileReader.o
25:34.01 MediaResource.o
25:34.71 WebGLExtensionDebugShaders.o
25:37.03 nsDOMMutationObserver.o
25:37.59 HTMLMenuItemElement.o
25:37.63 MediaShutdownManager.o
25:37.76 WebGLExtensionDepthTexture.o
25:39.80 nsDOMSerializer.o
25:40.50 HTMLMetaElement.o
25:40.86 WebGLExtensionDrawBuffers.o
25:42.22 MediaStreamGraph.o
25:43.27 HTMLMeterElement.o
25:43.56 nsDOMSettableTokenList.o
25:43.78 MediaStreamTrack.o
25:43.94 WebGLExtensionElementIndexUint.o
25:45.16 nsDOMTokenList.o
25:46.05 HTMLModElement.o
25:47.00 nsDataDocumentContentPolicy.o
25:47.52 WebGLExtensionFragDepth.o
25:48.59 HTMLObjectElement.o
25:49.18 nsDocumentEncoder.o
25:49.41 MediaTaskQueue.o
25:50.58 WebGLExtensionInstancedArrays.o
25:50.88 nsElementFrameLoaderOwner.o
25:51.04 HTMLOptGroupElement.o
25:51.29 MediaTrack.o
25:51.93 MediaTrackList.o
25:53.68 RtspMediaResource.o
25:54.02 WebGLExtensionLoseContext.o
25:55.67 HTMLOptionElement.o
25:55.88 nsFormData.o
25:57.43 WebGLExtensionSRGB.o
25:57.73 SharedThreadPool.o
25:58.10 nsFrameLoader.o
26:00.15 HTMLOptionsCollection.o
26:00.55 nsFrameMessageManager.o
26:00.56 WebGLExtensionStandardDerivatives.o
26:01.59 StreamBuffer.o
26:02.35 TextTrack.o
26:02.78 TextTrackCue.o
26:03.93 HTMLOutputElement.o
26:03.96 WebGLExtensionTextureFilterAnisotropic.o
26:06.70 TextTrackCueList.o
26:07.06 WebGLExtensionTextureFloat.o
26:08.11 HTMLParagraphElement.o
26:09.86 nsGenConImageContent.o
26:10.07 WebGLExtensionTextureFloatLinear.o
26:10.71 TextTrackList.o
26:11.10 HTMLPictureElement.o
26:13.09 WebGLExtensionTextureHalfFloat.o
26:13.89 HTMLPreElement.o
26:13.92 TextTrackRegion.o
26:15.82 In file included from ../../../dist/include/nsDataHashtable.h:11:0,
26:15.82                  from /opt/FirefoxSource/mozilla-release/content/base/src/nsFrameMessageManager.h:21,
26:15.82                  from /opt/FirefoxSource/mozilla-release/content/base/src/nsFrameMessageManager.cpp:8:
26:15.82 ../../../dist/include/nsBaseHashtable.h: In member function 'void nsFrameScriptExecutor::TryCacheLoadAndCompileScript(const nsAString_internal&, bool, bool, JS::MutableHandle<JSScript*>)':
26:15.82 Warning: -Wmaybe-uninitialized in /opt/FirefoxSource/mozilla-release/objdir-droid/dist/include/nsBaseHashtable.h: 'holder' may be used uninitialized in this function
26:15.82 ../../../dist/include/nsBaseHashtable.h:138:5: warning: 'holder' may be used uninitialized in this function [-Wmaybe-uninitialized]
26:15.82 /opt/FirefoxSource/mozilla-release/content/base/src/nsFrameMessageManager.cpp:1550:44: note: 'holder' was declared here
26:15.83 nsGenericDOMDataNode.o
26:16.15 WebGLExtensionTextureHalfFloatLinear.o
26:16.50 HTMLProgressElement.o
26:17.28 VideoFrameContainer.o
26:18.08 nsGkAtoms.o
26:19.11 VideoPlaybackQuality.o
26:19.25 HTMLPropertiesCollection.o
26:19.30 WebGLExtensionVertexArray.o
26:21.76 HTMLScriptElement.o
26:21.95 nsHTMLContentSerializer.o
26:22.35 WebGLFramebuffer.o
26:22.75 nsHostObjectProtocolHandler.o
26:23.81 VideoSegment.o
26:24.66 HTMLSelectElement.o
26:25.17 nsHostObjectURI.o
26:25.81 WebGLFramebufferAttachable.o
26:27.11 VideoStreamTrack.o
26:27.93 HTMLShadowElement.o
26:28.54 VideoTrack.o
26:28.65 nsINode.o
26:29.17 nsInProcessTabChildGlobal.o
26:30.14 WebGLObjectModel.o
26:30.32 VideoTrackList.o
26:33.26 WebGLProgram.o
26:33.53 VideoUtils.o
26:33.76 HTMLSharedElement.o
26:35.23 WebVTTListener.o
26:36.26 WebGLQuery.o
26:37.18 nsLineBreaker.o
26:37.94 HTMLSharedListElement.o
26:40.23 WebGLRenderbuffer.o
26:40.64 /opt/FirefoxSource/mozilla-release/content/media/WebVTTListener.cpp: In member function 'virtual nsresult mozilla::dom::WebVTTListener::OnCue(JS::Handle<JS::Value>, JSContext*)':
26:40.64 Warning: -Wmaybe-uninitialized in /opt/FirefoxSource/mozilla-release/content/media/WebVTTListener.cpp: 'cue' may be used uninitialized in this function
26:40.64 /opt/FirefoxSource/mozilla-release/content/media/WebVTTListener.cpp:173:33: warning: 'cue' may be used uninitialized in this function [-Wmaybe-uninitialized]
26:40.66 SVGDocument.o
26:40.77 nsMappedAttributeElement.o
26:40.89 HTMLSharedObjectElement.o
26:42.72 nsMappedAttributes.o
26:43.70 HTMLSourceElement.o
26:43.77 WebGLShader.o
26:44.43 nsMixedContentBlocker.o
26:44.46 DOMSVGAnimatedLengthList.o
26:44.46 DOMSVGAnimatedNumberList.o
26:46.43 DOMSVGLength.o
26:46.64 nsNameSpaceManager.o
26:47.32 WebGLShaderPrecisionFormat.o
26:47.36 HTMLSpanElement.o
26:48.41 DOMSVGLengthList.o
26:48.59 nsNoDataProtocolContentPolicy.o
26:50.68 nsNodeUtils.o
26:50.81 WebGLTexelConversions.o
26:50.92 DOMSVGNumber.o
26:51.53 nsPlainTextSerializer.o
26:51.61 HTMLStyleElement.o
26:53.14 DOMSVGNumberList.o
26:53.89 WebGLTexture.o
26:54.42 HTMLTableCaptionElement.o
26:55.19 DOMSVGPathSeg.o
26:57.11 nsPropertyTable.o
26:57.40 DOMSVGPathSegList.o
26:57.45 HTMLTableCellElement.o
26:59.66 nsRange.o
27:00.01 nsReferencedElement.o
27:00.18 HTMLTableColElement.o
27:00.68 DOMSVGPoint.o
27:02.44 WebGLUniformLocation.o
27:03.26 DOMSVGPointList.o
27:03.51 HTMLTableElement.o
27:05.60 DOMSVGStringList.o
27:06.19 HTMLTableRowElement.o
27:06.84 WebGLVertexArray.o
27:06.90 nsScriptElement.o
27:07.99 DOMSVGTransformList.o
27:09.14 nsScriptLoader.o
27:10.00 WebGLVertexArrayFake.o
27:10.12 SVGAElement.o
27:10.57 HTMLTableSectionElement.o
27:11.09 nsStubDocumentObserver.o
27:12.42 SVGAltGlyphElement.o
27:13.68 WebGLVertexArrayGL.o
27:14.07 HTMLTemplateElement.o
27:14.84 nsStubMutationObserver.o
27:15.00 nsStyleLinkElement.o
27:15.08 SVGAngle.o
27:15.14 nsStyledElement.o
27:17.53 HTMLTextAreaElement.o
27:18.03 SVGAnimateElement.o
27:18.84 nsSyncLoadService.o
27:19.93 SVGAnimateMotionElement.o
27:20.27 HTMLTimeElement.o
27:21.02 SVGAnimateTransformElement.o
27:21.46 nsTextFragment.o
27:22.26 nsTextNode.o
27:22.81 nsTraversal.o
27:23.37 SVGAnimatedAngle.o
27:23.47 SVGAnimatedBoolean.o
27:25.07 nsTreeSanitizer.o
27:25.11 HTMLTitleElement.o
27:25.56 CDATASection.o
27:25.57 ProcessingInstruction.o
27:25.87 SVGAnimatedEnumeration.o
27:27.03 nsViewportInfo.o
27:27.55 XMLStylesheetProcessingInstruction.o
27:27.75 SVGAnimatedInteger.o
27:27.75 HTMLTrackElement.o
27:29.66 nsXMLElement.o
27:29.80 SVGAnimatedLength.o
27:29.92 nsXHTMLContentSerializer.o
27:30.46 nsXMLContentSerializer.o
27:30.67 HTMLUnknownElement.o
27:31.70 SVGAnimatedLengthList.o
27:32.68 nsXMLHttpRequest.o
27:34.02 SVGAnimatedNumber.o
27:34.22 nsXMLNameSpaceMap.o
27:35.31 XMLDocument.o
27:35.31 nsXMLContentSink.o
27:36.07 SVGAnimatedNumberList.o
27:36.94 HTMLVideoElement.o
27:38.03 SVGAnimatedPathSegList.o
27:39.97 nsXMLFragmentContentSink.o
27:40.36 SVGAnimatedPointList.o
27:40.79 MediaError.o
27:41.59 XULDocument.o
27:41.59 nsXULCommandDispatcher.o
27:42.48 SVGAnimatedPreserveAspectRatio.o
27:44.51 SVGAnimatedRect.o
27:44.59 nsXMLPrettyPrinter.o
27:45.22 RadioNodeList.o
27:47.04 SVGAnimatedString.o
27:48.58 TextTrackManager.o
27:48.98 SVGAnimatedTransformList.o
27:49.29 TimeRanges.o
27:50.35 nsXULContentSink.o
27:50.87 SVGAnimationElement.o
27:51.27 nsXULContextMenuBuilder.o
27:51.27 nsXULElement.o
27:52.53 nsXULControllers.o
27:52.85 SVGAttrValueWrapper.o
27:53.18 nsXULPopupListener.o
27:54.79 UndoManager.o
27:56.00 SVGCircleElement.o
27:56.10 nsXULPrototypeCache.o
27:56.76 nsXULPrototypeDocument.o
27:58.21 ValidityState.o
27:58.31 SVGClipPathElement.o
28:00.91 SVGContentUtils.o
28:01.83 nsDOMStringMap.o
28:02.39 nsFormSubmission.o
28:03.23 SVGDefsElement.o
28:03.77 nsContentSupportMap.o
28:03.77 nsContentTestNode.o
28:03.92 nsGenericHTMLElement.o
28:04.85 nsGenericHTMLFrameElement.o
28:06.04 nsInstantiationNode.o
28:06.61 nsRDFBinding.o
28:06.74 nsRDFConInstanceTestNode.o
28:07.33 nsRDFConMemberTestNode.o
28:07.45 SVGDescElement.o
28:07.55 SVGElementFactory.o
28:08.02 nsRDFPropertyTestNode.o
28:08.86 nsRDFQuery.o
28:09.74 SVGEllipseElement.o
28:09.75 nsFilteredContentIterator.o
28:09.75 nsTextServicesDocument.o
28:09.80 nsResourceSet.o
28:10.43 nsRuleNetwork.o
28:10.96 nsTemplateMatch.o
28:11.60 SVGFEBlendElement.o
28:11.85 nsTemplateRule.o
28:12.65 nsTreeRows.o
28:13.27 nsHTMLDNSPrefetch.o
28:13.74 nsXMLBinding.o
28:14.31 SVGFEColorMatrixElement.o
28:14.95 nsXULContentBuilder.o
28:16.15 /opt/FirefoxSource/mozilla-release/editor/txtsvc/nsTextServicesDocument.cpp: In member function 'nsresult nsTextServicesDocument::GetUncollapsedSelection(nsITextServicesDocument::TSDBlockSelectionStatus*, int32_t*, int32_t*)':
28:16.15 Warning: -Wmaybe-uninitialized in /opt/FirefoxSource/mozilla-release/editor/txtsvc/nsTextServicesDocument.cpp: 'e2s1' may be used uninitialized in this function
28:16.15 /opt/FirefoxSource/mozilla-release/editor/txtsvc/nsTextServicesDocument.cpp:2826:3: warning: 'e2s1' may be used uninitialized in this function [-Wmaybe-uninitialized]
28:16.15 Warning: -Wmaybe-uninitialized in /opt/FirefoxSource/mozilla-release/editor/txtsvc/nsTextServicesDocument.cpp: 'e1s2' may be used uninitialized in this function
28:16.15 /opt/FirefoxSource/mozilla-release/editor/txtsvc/nsTextServicesDocument.cpp:2826:3: warning: 'e1s2' may be used uninitialized in this function [-Wmaybe-uninitialized]
28:16.15 nsIConstraintValidation.o
28:16.84 nsXULContentUtils.o
28:17.07 ChangeAttributeTxn.o
28:17.07 ChangeCSSInlineStyleTxn.o
28:17.45 SVGFEComponentTransferElement.o
28:17.54 CreateElementTxn.o
28:18.32 DeleteNodeTxn.o
28:18.85 nsRadioVisitor.o
28:20.30 DeleteRangeTxn.o
28:20.35 nsXULSortService.o
28:20.73 SVGFECompositeElement.o
28:21.27 nsTextEditorState.o
28:22.12 DeleteTextTxn.o
28:22.30 nsXULTemplateBuilder.o
28:23.60 nsXULTemplateQueryProcessorRDF.o
28:23.84 SVGFEConvolveMatrixElement.o
28:24.86 EditAggregateTxn.o
28:26.68 SVGFEDiffuseLightingElement.o
28:27.48 EditTxn.o
28:28.00 IMETextTxn.o
28:28.29 InsertElementTxn.o
28:28.31 nsXULTemplateQueryProcessorStorage.o
28:29.21 InsertTextTxn.o
28:30.38 SVGFEDisplacementMapElement.o
28:30.97 JoinElementTxn.o
28:31.26 nsXULTemplateQueryProcessorXML.o
28:31.33 PlaceholderTxn.o
28:31.65 SetDocTitleTxn.o
28:33.41 SplitElementTxn.o
28:33.76 nsXULTemplateResultRDF.o
28:34.67 SVGFEDistantLightElement.o
28:35.16 nsEditor.o
28:35.95 nsEditorCommands.o
28:37.22 nsXULTemplateResultSetRDF.o
28:37.69 nsEditorController.o
28:38.03 nsXULTemplateResultStorage.o
28:38.86 nsXULTemplateResultXML.o
28:38.87 SVGFEDropShadowElement.o
28:39.87 nsXULTreeBuilder.o
28:40.08 nsEditorEventListener.o
28:40.41 nsEditorUtils.o
28:43.15 SVGFEFloodElement.o
28:44.29 nsSelectionState.o
28:46.02 nsStyleSheetTxns.o
28:46.63 nsInternetCiter.o
28:46.63 nsPlaintextDataTransfer.o
28:47.47 nsPlaintextEditor.o
28:48.11 SVGFEGaussianBlurElement.o
28:49.53 nsTextEditRules.o
28:49.91 nsTextEditRulesBidi.o
28:50.65 TextEditorTest.o
28:50.65 TypeInState.o
28:50.81 nsEditProperty.o
28:52.55 SVGFEImageElement.o
28:53.66 nsHTMLAbsPosition.o
28:54.10 nsHTMLAnonymousUtils.o
28:54.93 nsTextEditUtils.o
28:55.20 nsTransactionItem.o
28:55.21 nsTransactionList.o
28:56.51 nsTransactionManager.o
28:57.41 SVGFEMergeElement.o
28:57.56 nsTransactionManagerFactory.o
28:58.75 nsTransactionStack.o
28:59.04 nsHTMLCSSUtils.o
28:60.00 nsComposeTxtSrvFilter.o
29:00.02 nsComposerCommands.o
29:01.06 nsComposerCommandsUpdater.o
29:01.12 nsComposerController.o
29:02.11 SVGFEMergeNodeElement.o
29:02.27 nsHTMLDataTransfer.o
29:02.33 nsComposerDocumentCommands.o
29:02.74 nsComposerRegistration.o
29:02.98 nsEditingSession.o
29:03.52 nsEditorSpellCheck.o
29:05.07 SVGFEMorphologyElement.o
29:05.85 nsHTMLEditRules.o
29:05.89 nsHTMLEditUtils.o
29:07.44 nsCSSRuleProcessor.o
29:07.44 nsFontFaceLoader.o
29:07.93 SVGFEOffsetElement.o
29:10.90 AnimationCommon.o
29:11.55 SVGFEPointLightElement.o
29:12.39 /opt/FirefoxSource/mozilla-release/layout/style/nsCSSRuleProcessor.cpp: In member function 'nsRestyleHint nsCSSRuleProcessor::HasStateDependentStyle(ElementDependentRuleProcessorData*, mozilla::dom::Element*, nsCSSPseudoElements::Type, mozilla::EventStates)':
29:12.39 Warning: -Wmaybe-uninitialized in /opt/FirefoxSource/mozilla-release/layout/style/nsCSSRuleProcessor.cpp: 'selectorForPseudo' may be used uninitialized in this function
29:12.39 /opt/FirefoxSource/mozilla-release/layout/style/nsCSSRuleProcessor.cpp:2682:52: warning: 'selectorForPseudo' may be used uninitialized in this function [-Wmaybe-uninitialized]
29:12.39 /opt/FirefoxSource/mozilla-release/layout/style/nsCSSRuleProcessor.cpp:2643:22: note: 'selectorForPseudo' was declared here
29:12.39 nsHTMLEditor.o
29:14.49 nsDocumentViewer.o
29:14.49 nsPresArena.o
29:14.52 nsHTMLEditorEventListener.o
29:14.90 SVGFESpecularLightingElement.o
29:15.06 CSS.o
29:18.34 SVGFESpotLightElement.o
29:20.05 CSSRuleList.o
29:22.47 SVGFETileElement.o
29:22.83 CSSStyleSheet.o
29:22.91 nsHTMLEditorStyle.o
29:23.44 CSSVariableDeclarations.o
29:24.37 nsPresShell.o
29:24.92 nsRefreshDriver.o
29:25.02 nsHTMLInlineTableEditor.o
29:26.28 SVGFETurbulenceElement.o
29:28.85 /opt/FirefoxSource/mozilla-release/layout/style/CSSStyleSheet.cpp: In member function 'bool nsMediaExpression::Matches(nsPresContext*, const nsCSSValue&) const':
29:28.85 Warning: -Wmaybe-uninitialized in /opt/FirefoxSource/mozilla-release/layout/style/CSSStyleSheet.cpp: 'cmp' may be used uninitialized in this function
29:28.85 /opt/FirefoxSource/mozilla-release/layout/style/CSSStyleSheet.cpp:277:21: warning: 'cmp' may be used uninitialized in this function [-Wmaybe-uninitialized]
29:28.86 CSSVariableResolver.o
29:29.47 nsHTMLObjectResizer.o
29:29.97 SVGFilterElement.o
29:30.02 CSSVariableValues.o
29:30.73 CounterStyleManager.o
29:31.31 Declaration.o
29:31.56 nsHTMLURIRefObject.o
29:33.82 SVGForeignObjectElement.o
29:34.47 nsTableEditor.o
29:34.82 ErrorReporter.o
29:34.91 nsWSRunObject.o
29:36.64 ImageLoader.o
29:37.29 SVGFragmentIdentifier.o
29:38.77 Loader.o
29:41.48 ActiveLayerTracker.o
29:41.72 SVGGElement.o
29:43.01 MediaQueryList.o
29:44.46 SVGGradientElement.o
29:45.51 DisplayItemClip.o
29:46.87 SVGGraphicsElement.o
29:47.24 nsLineLayout.o
29:47.24 nsObjectFrame.o
29:48.80 StyleAnimationValue.o
29:49.28 DisplayListClipState.o
29:49.83 SVGIFrameElement.o
29:51.34 StyleRule.o
29:51.90 FrameLayerBuilder.o
29:52.29 FrameChildList.o
29:52.32 SVGImageElement.o
29:55.29 FramePropertyTable.o
29:55.69 /opt/FirefoxSource/mozilla-release/layout/style/StyleAnimationValue.cpp: In function 'void ExtractBorderColor(nsStyleContext*, const void*, mozilla::css::Side, mozilla::StyleAnimationValue&)':
29:55.69 Warning: -Wmaybe-uninitialized in /opt/FirefoxSource/mozilla-release/layout/style/StyleAnimationValue.cpp: 'color' may be used uninitialized in this function
29:55.69 /opt/FirefoxSource/mozilla-release/layout/style/StyleAnimationValue.cpp:3702:25: warning: 'color' may be used uninitialized in this function [-Wmaybe-uninitialized]
29:55.69 /opt/FirefoxSource/mozilla-release/layout/style/StyleAnimationValue.cpp:2726:11: note: 'color' was declared here
29:55.69 /opt/FirefoxSource/mozilla-release/layout/style/StyleAnimationValue.cpp: In static member function 'static bool mozilla::StyleAnimationValue::ExtractComputedValue(nsCSSProperty, nsStyleContext*, mozilla::StyleAnimationValue&)':
29:55.70 Warning: -Wmaybe-uninitialized in /opt/FirefoxSource/mozilla-release/layout/style/StyleAnimationValue.cpp: 'color' may be used uninitialized in this function
29:55.70 /opt/FirefoxSource/mozilla-release/layout/style/StyleAnimationValue.cpp:3702:25: warning: 'color' may be used uninitialized in this function [-Wmaybe-uninitialized]
29:55.70 /opt/FirefoxSource/mozilla-release/layout/style/StyleAnimationValue.cpp:2959:19: note: 'color' was declared here
29:55.71 nsAnimationManager.o
29:56.34 SVGIntegerPairSMILType.o
29:58.39 MathMLTextRunFactory.o
29:58.99 nsCSSAnonBoxes.o
30:00.32 SVGLength.o
30:00.55 ScrollbarActivity.o
30:00.59 SVGLengthList.o
30:02.51 GeometryUtils.o
30:03.02 MaskLayerImageCache.o
30:03.12 SVGLengthListSMILType.o
30:03.27 /opt/FirefoxSource/mozilla-release/layout/generic/MathMLTextRunFactory.cpp: In member function 'virtual void MathMLTextRunFactory::RebuildTextRun(nsTransformedTextRun*, gfxContext*)':
30:03.27 Warning: -Wmaybe-uninitialized in /opt/FirefoxSource/mozilla-release/layout/generic/MathMLTextRunFactory.cpp: 'mathVar' may be used uninitialized in this function
30:03.27 /opt/FirefoxSource/mozilla-release/layout/generic/MathMLTextRunFactory.cpp:692:10: warning: 'mathVar' may be used uninitialized in this function [-Wmaybe-uninitialized]
30:03.27 /opt/FirefoxSource/mozilla-release/layout/generic/MathMLTextRunFactory.cpp:590:11: note: 'mathVar' was declared here
30:03.28 StickyScrollContainer.o
30:03.61 nsCSSDataBlock.o
30:03.89 nsCSSKeywords.o
30:05.47 SVGLineElement.o
30:05.95 TextOverflow.o
30:06.45 nsCSSParser.o
30:06.71 nsCSSProps.o
30:07.19 PaintTracker.o
30:07.90 SVGMPathElement.o
30:08.67 PositionedEventTargeting.o
30:08.77 RestyleManager.o
30:09.02 nsAbsoluteContainingBlock.o
30:10.63 SVGMarkerElement.o
30:12.47 RestyleTracker.o
30:13.50 nsBRFrame.o
30:13.87 SVGMaskElement.o
30:15.69 /opt/FirefoxSource/mozilla-release/layout/style/nsCSSParser.cpp: In member function 'bool {anonymous}::CSSParserImpl::ParseGridLine(nsCSSValue&)':
30:15.69 Warning: -Wmaybe-uninitialized in /opt/FirefoxSource/mozilla-release/layout/style/nsCSSParser.cpp: 'integer' may be used uninitialized in this function
30:15.69 /opt/FirefoxSource/mozilla-release/layout/style/nsCSSParser.cpp:8583:56: warning: 'integer' may be used uninitialized in this function [-Wmaybe-uninitialized]
30:15.69 /opt/FirefoxSource/mozilla-release/layout/style/nsCSSParser.cpp:8525:11: note: 'integer' was declared here
30:15.70 nsCSSPseudoClasses.o
30:16.45 nsBlockFrame.o
30:16.79 SVGMatrix.o
30:18.43 /opt/FirefoxSource/mozilla-release/layout/base/RestyleManager.cpp: In member function 'void mozilla::ElementRestyler::RestyleChildren(nsRestyleHint)':
30:18.43 Warning: -Wmaybe-uninitialized in /opt/FirefoxSource/mozilla-release/layout/base/RestyleManager.cpp: 'lastContinuation' may be used uninitialized in this function
30:18.43 /opt/FirefoxSource/mozilla-release/layout/base/RestyleManager.cpp:2622:41: warning: 'lastContinuation' may be used uninitialized in this function [-Wmaybe-uninitialized]
30:18.43 /opt/FirefoxSource/mozilla-release/layout/base/RestyleManager.cpp:2605:13: note: 'lastContinuation' was declared here
30:18.44 SelectionCarets.o
30:18.48 nsCSSPseudoElements.o
30:18.82 nsCSSRules.o
30:19.09 nsCSSScanner.o
30:19.28 nsBlockReflowContext.o
30:19.46 SVGMetadataElement.o
30:21.42 StackArena.o
30:21.64 SVGMotionSMILAnimationFunction.o
30:23.54 nsCSSValue.o
30:23.86 SVGMotionSMILAttr.o
30:24.23 nsComputedDOMStyle.o
30:26.22 TouchCaret.o
30:26.46 /opt/FirefoxSource/mozilla-release/layout/generic/nsBlockFrame.cpp: In member function 'void nsBlockFrame::AddFrames(nsFrameList&, nsIFrame*)':
30:26.46 Warning: -Wmaybe-uninitialized in /opt/FirefoxSource/mozilla-release/layout/generic/nsBlockFrame.cpp: 'overflowLines' may be used uninitialized in this function
30:26.46 /opt/FirefoxSource/mozilla-release/layout/generic/nsBlockFrame.cpp:4959:72: warning: 'overflowLines' may be used uninitialized in this function [-Wmaybe-uninitialized]
30:26.56 nsBlockReflowState.o
30:26.62 nsBidi.o
30:26.67 SVGMotionSMILPathUtils.o
30:27.74 nsDOMCSSAttrDeclaration.o
30:28.94 SVGMotionSMILType.o
30:29.57 nsBulletFrame.o
30:30.26 SVGNumberList.o
30:31.31 nsBidiPresUtils.o
30:31.44 SVGNumberListSMILType.o
30:32.01 nsCSSColorUtils.o
30:32.73 nsCanvasFrame.o
30:33.85 SVGNumberPairSMILType.o
30:34.03 /opt/FirefoxSource/mozilla-release/layout/style/nsComputedDOMStyle.cpp: In member function 'mozilla::dom::CSSValue* nsComputedDOMStyle::DoGetOutlineWidth()':
30:34.03 Warning: -Wmaybe-uninitialized in /opt/FirefoxSource/mozilla-release/layout/style/nsComputedDOMStyle.cpp: 'width' may be used uninitialized in this function
30:34.03 /opt/FirefoxSource/mozilla-release/layout/style/nsComputedDOMStyle.cpp:2696:26: warning: 'width' may be used uninitialized in this function [-Wmaybe-uninitialized]
30:34.03 /opt/FirefoxSource/mozilla-release/layout/style/nsComputedDOMStyle.cpp: In member function 'mozilla::dom::CSSValue* nsComputedDOMStyle::DoGetTextDecorationColor()':
30:34.03 Warning: -Wmaybe-uninitialized in /opt/FirefoxSource/mozilla-release/layout/style/nsComputedDOMStyle.cpp: 'color' may be used uninitialized in this function
30:34.03 /opt/FirefoxSource/mozilla-release/layout/style/nsComputedDOMStyle.cpp:3121:29: warning: 'color' may be used uninitialized in this function [-Wmaybe-uninitialized]
30:34.03 /opt/FirefoxSource/mozilla-release/layout/style/nsComputedDOMStyle.cpp: In member function 'mozilla::dom::CSSValue* nsComputedDOMStyle::GetBorderColorFor(mozilla::css::Side)':
30:34.03 Warning: -Wmaybe-uninitialized in /opt/FirefoxSource/mozilla-release/layout/style/nsComputedDOMStyle.cpp: 'color' may be used uninitialized in this function
30:34.03 /opt/FirefoxSource/mozilla-release/layout/style/nsComputedDOMStyle.cpp:4426:29: warning: 'color' may be used uninitialized in this function [-Wmaybe-uninitialized]
30:34.06 nsDOMCSSDeclaration.o
30:35.95 SVGOrientSMILType.o
30:36.10 SVGPathData.o
30:36.97 nsCSSFrameConstructor.o
30:37.17 nsCSSRendering.o
30:37.30 nsColumnSetFrame.o
30:37.61 nsDOMCSSRGBColor.o
30:38.59 SVGPathElement.o
30:40.35 nsDOMCSSRect.o
30:40.95 nsDOMCSSValueList.o
30:41.60 nsHTMLCSSStyleSheet.o
30:41.89 SVGPathSegListSMILType.o
30:41.94 nsContainerFrame.o
30:42.44 nsHTMLStyleSheet.o
30:44.60 nsLayoutStylesheetCache.o
30:45.54 nsFirstLetterFrame.o
30:45.91 SVGPathSegUtils.o
30:46.89 nsCSSRenderingBorders.o
30:47.77 nsMediaFeatures.o
30:48.02 SVGPatternElement.o
30:49.22 SVGPointList.o
30:49.80 nsFlexContainerFrame.o
30:50.06 nsNthIndexCache.o
30:52.01 SVGPointListSMILType.o
30:52.21 nsROCSSPrimitiveValue.o
30:53.00 nsFloatManager.o
30:53.40 /opt/FirefoxSource/mozilla-release/layout/base/nsCSSRendering.cpp: In function 'bool _ZL14IsOpaqueBorderRK13nsStyleBorder.part.39(const nsStyleBorder&)':
30:53.40 Warning: -Wmaybe-uninitialized in /opt/FirefoxSource/mozilla-release/layout/base/nsCSSRendering.cpp: 'color' may be used uninitialized in this function
30:53.40 /opt/FirefoxSource/mozilla-release/layout/base/nsCSSRendering.cpp:1667:50: warning: 'color' may be used uninitialized in this function [-Wmaybe-uninitialized]
30:53.40 /opt/FirefoxSource/mozilla-release/layout/base/nsCSSRendering.cpp:1658:11: note: 'color' was declared here
30:53.40 /opt/FirefoxSource/mozilla-release/layout/base/nsCSSRendering.cpp: In static member function 'static void nsCSSRendering::PaintOutline(nsPresContext*, nsRenderingContext&, nsIFrame*, const nsRect&, const nsRect&, nsStyleContext*)':
30:53.40 Warning: -Wmaybe-uninitialized in /opt/FirefoxSource/mozilla-release/layout/base/nsCSSRendering.cpp: 'width' may be used uninitialized in this function
30:53.40 /opt/FirefoxSource/mozilla-release/layout/base/nsCSSRendering.cpp:852:65: warning: 'width' may be used uninitialized in this function [-Wmaybe-uninitialized]
30:53.40 /opt/FirefoxSource/mozilla-release/layout/base/nsCSSRendering.cpp: In static member function 'static void nsCSSRendering::PaintGradient(nsPresContext*, nsRenderingContext&, nsStyleGradient*, const nsRect&, const nsRect&, const nsRect&, const CSSIntRect&, const nsSize&)':
30:53.40 Warning: -Wmaybe-uninitialized in /opt/FirefoxSource/mozilla-release/layout/base/nsCSSRendering.cpp: 'position' may be used uninitialized in this function
30:53.40 /opt/FirefoxSource/mozilla-release/layout/base/nsCSSRendering.cpp:353:40: warning: 'position' may be used uninitialized in this function [-Wmaybe-uninitialized]
30:53.40 /opt/FirefoxSource/mozilla-release/layout/base/nsCSSRendering.cpp:2287:12: note: 'position' was declared here
30:53.40 /opt/FirefoxSource/mozilla-release/layout/base/nsCSSRendering.cpp: In static member function 'static void nsCSSRendering::PaintBackgroundWithSC(nsPresContext*, nsRenderingContext&, nsIFrame*, const nsRect&, const nsRect&, nsStyleContext*, const nsStyleBorder&, uint32_t, nsRect*, int32_t)':
30:53.40 Warning: -Wmaybe-uninitialized in /opt/FirefoxSource/mozilla-release/layout/base/nsCSSRendering.cpp: 'isSolidBorder' may be used uninitialized in this function
30:53.40 /opt/FirefoxSource/mozilla-release/layout/base/nsCSSRendering.cpp:2805:9: warning: 'isSolidBorder' may be used uninitialized in this function [-Wmaybe-uninitialized]
30:53.40 /opt/FirefoxSource/mozilla-release/layout/base/nsCSSRendering.cpp:2718:8: note: 'isSolidBorder' was declared here
30:53.41 Warning: -Wmaybe-uninitialized in /opt/FirefoxSource/mozilla-release/layout/base/nsCSSRendering.cpp: 'currentBackgroundClip' may be used uninitialized in this function
30:53.41 /opt/FirefoxSource/mozilla-release/layout/base/nsCSSRendering.cpp:2809:9: warning: 'currentBackgroundClip' may be used uninitialized in this function [-Wmaybe-uninitialized]
30:53.41 /opt/FirefoxSource/mozilla-release/layout/base/nsCSSRendering.cpp:2717:11: note: 'currentBackgroundClip' was declared here
30:53.41 nsCaret.o
30:54.13 nsRuleData.o
30:54.55 SVGPolygonElement.o
30:55.73 nsRuleNode.o
30:56.62 SVGPolylineElement.o
30:56.62 nsCounterManager.o
30:56.64 nsStyleContext.o
30:57.19 /opt/FirefoxSource/mozilla-release/layout/generic/nsFlexContainerFrame.cpp: In member function 'void nsFlexContainerFrame::DoFlexLayout(nsPresContext*, nsHTMLReflowMetrics&, const nsHTMLReflowState&, nsReflowStatus&, nscoord, nscoord, nsTArray<nsFlexContainerFrame::StrutInfo>&, const nsFlexContainerFrame::FlexboxAxisTracker&)':
30:57.20 Warning: -Wmaybe-uninitialized in /opt/FirefoxSource/mozilla-release/layout/generic/nsFlexContainerFrame.cpp: 'flexContainerAscent' may be used uninitialized in this function
30:57.20 /opt/FirefoxSource/mozilla-release/layout/generic/nsFlexContainerFrame.cpp:3392:3: warning: 'flexContainerAscent' may be used uninitialized in this function [-Wmaybe-uninitialized]
30:57.20 /opt/FirefoxSource/mozilla-release/layout/generic/nsFlexContainerFrame.cpp:3214:11: note: 'flexContainerAscent' was declared here
30:57.20 nsFontInflationData.o
30:59.35 SVGPreserveAspectRatio.o
30:59.66 nsFrame.o
31:01.21 nsDisplayList.o
31:01.75 SVGRect.o
31:02.98 nsFrameList.o
31:03.68 SVGRectElement.o
31:04.25 In file included from ../../dist/include/nsAString.h:23:0,
31:04.25                  from ../../dist/include/nsSubstring.h:10,
31:04.25                  from ../../dist/include/nsString.h:12,
31:04.25                  from ../../dist/include/nsStringGlue.h:18,
31:04.25                  from ../../dist/include/nsHashKeys.h:18,
31:04.25                  from /opt/FirefoxSource/mozilla-release/layout/base/nsIPresShell.h:28,
31:04.25                  from /opt/FirefoxSource/mozilla-release/layout/base/nsPresContext.h:16,
31:04.25                  from /opt/FirefoxSource/mozilla-release/layout/base/../style/nsRuleNode.h:14,
31:04.25                  from /opt/FirefoxSource/mozilla-release/layout/base/../style/nsStyleContext.h:11,
31:04.25                  from /opt/FirefoxSource/mozilla-release/layout/base/../generic/nsIFrame.h:25,
31:04.25                  from /opt/FirefoxSource/mozilla-release/layout/base/nsGenConList.h:11,
31:04.25                  from /opt/FirefoxSource/mozilla-release/layout/base/nsCounterManager.h:13,
31:04.25                  from /opt/FirefoxSource/mozilla-release/layout/base/nsCounterManager.cpp:9:
31:04.25 ../../dist/include/nsTSubstring.h: In member function 'void nsCounterUseNode::GetText(nsString&)':
31:04.25 Warning: -Wmaybe-uninitialized in /opt/FirefoxSource/mozilla-release/objdir-droid/dist/include/nsTSubstring.h: 'separator' may be used uninitialized in this function
31:04.25 ../../dist/include/nsTSubstring.h:526:40: warning: 'separator' may be used uninitialized in this function [-Wmaybe-uninitialized]
31:04.25 /opt/FirefoxSource/mozilla-release/layout/base/nsCounterManager.cpp:94:21: note: 'separator' was declared here
31:04.25 nsDisplayListInvalidation.o
31:05.56 /opt/FirefoxSource/mozilla-release/layout/style/nsRuleNode.cpp: In static member function 'static nscoord nsRuleNode::CalcFontPointSize(int32_t, int32_t, nsPresContext*, nsFontSizeType)':
31:05.56 Warning: -Wmaybe-uninitialized in /opt/FirefoxSource/mozilla-release/layout/style/nsRuleNode.cpp: 'column' may be used uninitialized in this function
31:05.56 /opt/FirefoxSource/mozilla-release/layout/style/nsRuleNode.cpp:2884:55: warning: 'column' may be used uninitialized in this function [-Wmaybe-uninitialized]
31:05.56 /opt/FirefoxSource/mozilla-release/layout/style/nsRuleNode.cpp:2862:12: note: 'column' was declared here
31:05.56 /opt/FirefoxSource/mozilla-release/layout/style/nsRuleNode.cpp: In static member function 'static bool nsRuleNode::HasAuthorSpecifiedRules(nsStyleContext*, uint32_t, bool)':
31:05.56 Warning: -Wmaybe-uninitialized in /opt/FirefoxSource/mozilla-release/layout/style/nsRuleNode.cpp: 'textShadowOffset' may be used uninitialized in this function
31:05.56 /opt/FirefoxSource/mozilla-release/layout/style/nsRuleNode.cpp:9096:65: warning: 'textShadowOffset' may be used uninitialized in this function [-Wmaybe-uninitialized]
31:05.56 Warning: -Wmaybe-uninitialized in /opt/FirefoxSource/mozilla-release/layout/style/nsRuleNode.cpp: 'paddingOffset' may be used uninitialized in this function
31:05.56 /opt/FirefoxSource/mozilla-release/layout/style/nsRuleNode.cpp:9092:65: warning: 'paddingOffset' may be used uninitialized in this function [-Wmaybe-uninitialized]
31:05.56 Warning: -Wmaybe-uninitialized in /opt/FirefoxSource/mozilla-release/layout/style/nsRuleNode.cpp: 'borderOffset' may be used uninitialized in this function
31:05.56 /opt/FirefoxSource/mozilla-release/layout/style/nsRuleNode.cpp:9088:63: warning: 'borderOffset' may be used uninitialized in this function [-Wmaybe-uninitialized]
31:05.57 nsStyleCoord.o
31:05.62 SVGSVGElement.o
31:08.38 /opt/FirefoxSource/mozilla-release/layout/style/nsStyleContext.cpp: In member function 'nsChangeHint nsStyleContext::CalcStyleDifference(nsStyleContext*, nsChangeHint)':
31:08.38 Warning: -Wmaybe-uninitialized in /opt/FirefoxSource/mozilla-release/layout/style/nsStyleContext.cpp: 'otherVisDecColor' may be used uninitialized in this function
31:08.38 /opt/FirefoxSource/mozilla-release/layout/style/nsStyleContext.cpp:610:7: warning: 'otherVisDecColor' may be used uninitialized in this function [-Wmaybe-uninitialized]
31:08.38 /opt/FirefoxSource/mozilla-release/layout/style/nsStyleContext.cpp:604:32: note: 'otherVisDecColor' was declared here
31:08.38 Warning: -Wmaybe-uninitialized in /opt/FirefoxSource/mozilla-release/layout/style/nsStyleContext.cpp: 'thisVisDecColor' may be used uninitialized in this function
31:08.38 /opt/FirefoxSource/mozilla-release/layout/style/nsStyleContext.cpp:610:7: warning: 'thisVisDecColor' may be used uninitialized in this function [-Wmaybe-uninitialized]
31:08.38 /opt/FirefoxSource/mozilla-release/layout/style/nsStyleContext.cpp:604:15: note: 'thisVisDecColor' was declared here
31:08.38 Warning: -Wmaybe-uninitialized in /opt/FirefoxSource/mozilla-release/layout/style/nsStyleContext.cpp: 'otherColor' may be used uninitialized in this function
31:08.38 /opt/FirefoxSource/mozilla-release/layout/style/nsStyleContext.cpp:580:7: warning: 'otherColor' may be used uninitialized in this function [-Wmaybe-uninitialized]
31:08.38 /opt/FirefoxSource/mozilla-release/layout/style/nsStyleContext.cpp:579:26: note: 'otherColor' was declared here
31:08.38 Warning: -Wmaybe-uninitialized in /opt/FirefoxSource/mozilla-release/layout/style/nsStyleContext.cpp: 'otherColor' may be used uninitialized in this function
31:08.38 /opt/FirefoxSource/mozilla-release/layout/style/nsStyleContext.cpp:567:9: warning: 'otherColor' may be used uninitialized in this function [-Wmaybe-uninitialized]
31:08.38 /opt/FirefoxSource/mozilla-release/layout/style/nsStyleContext.cpp:564:28: note: 'otherColor' was declared here
31:08.38 Warning: -Wmaybe-uninitialized in /opt/FirefoxSource/mozilla-release/layout/style/nsStyleContext.cpp: 'thisColor' may be used uninitialized in this function
31:08.38 /opt/FirefoxSource/mozilla-release/layout/style/nsStyleContext.cpp:567:9: warning: 'thisColor' may be used uninitialized in this function [-Wmaybe-uninitialized]
31:08.38 /opt/FirefoxSource/mozilla-release/layout/style/nsStyleContext.cpp:564:17: note: 'thisColor' was declared here
31:08.41 nsStyleSet.o
31:08.49 SVGScriptElement.o
31:09.27 nsStyleStruct.o
31:12.73 /opt/FirefoxSource/mozilla-release/layout/generic/nsFrame.cpp: In static member function 'static int32_t nsFrame::GetLineNumber(nsIFrame*, bool, nsIFrame**)':
31:12.73 Warning: -Wmaybe-uninitialized in /opt/FirefoxSource/mozilla-release/layout/generic/nsFrame.cpp: 'thisBlock' may be used uninitialized in this function
31:12.73 /opt/FirefoxSource/mozilla-release/layout/generic/nsFrame.cpp:6747:42: warning: 'thisBlock' may be used uninitialized in this function [-Wmaybe-uninitialized]
31:12.73 /opt/FirefoxSource/mozilla-release/layout/generic/nsFrame.cpp: In member function 'nsresult nsIFrame::PeekOffsetParagraph(nsPeekOffsetStruct*)':
31:12.74 Warning: -Wmaybe-uninitialized in /opt/FirefoxSource/mozilla-release/layout/generic/nsFrame.cpp: 'blockFrameOrBR.nsContentAndOffset::mOffset' may be used uninitialized in this function
31:12.74 /opt/FirefoxSource/mozilla-release/layout/generic/nsFrame.cpp:6225:54: warning: 'blockFrameOrBR.nsContentAndOffset::mOffset' may be used uninitialized in this function [-Wmaybe-uninitialized]
31:12.74 /opt/FirefoxSource/mozilla-release/layout/generic/nsFrame.cpp: In member function 'bool nsIFrame::FinishAndStoreOverflow(nsOverflowAreas&, nsSize, nsSize*)':
31:12.74 Warning: -Wmaybe-uninitialized in /opt/FirefoxSource/mozilla-release/layout/generic/nsFrame.cpp: 'width' may be used uninitialized in this function
31:12.74 /opt/FirefoxSource/mozilla-release/layout/generic/nsFrame.cpp:7189:37: warning: 'width' may be used uninitialized in this function [-Wmaybe-uninitialized]
31:12.74 /opt/FirefoxSource/mozilla-release/layout/generic/nsFrame.cpp:7110:11: note: 'width' was declared here
31:12.75 nsFrameSetFrame.o
31:13.27 SVGSetElement.o
31:13.99 nsStyleTransformMatrix.o
31:14.96 nsFrameState.o
31:15.42 /opt/FirefoxSource/mozilla-release/layout/base/nsDisplayList.cpp: In static member function 'static bool nsDisplayBackgroundImage::AppendBackgroundItemsToTop(nsDisplayListBuilder*, nsIFrame*, nsDisplayList*)':
31:15.42 Warning: -Wmaybe-uninitialized in /opt/FirefoxSource/mozilla-release/layout/base/nsDisplayList.cpp: 'color' may be used uninitialized in this function
31:15.42 /opt/FirefoxSource/mozilla-release/layout/base/nsDisplayList.cpp:1880:3: warning: 'color' may be used uninitialized in this function [-Wmaybe-uninitialized]
31:15.42 nsFrameManager.o
31:15.99 SVGStopElement.o
31:18.39 SVGStringList.o
31:18.44 nsFrameTraversal.o
31:18.50 /opt/FirefoxSource/mozilla-release/layout/style/nsStyleStruct.cpp: In member function 'nsChangeHint nsStyleTextReset::CalcDifference(const nsStyleTextReset&) const':
31:18.50 Warning: -Wmaybe-uninitialized in /opt/FirefoxSource/mozilla-release/layout/style/nsStyleStruct.cpp: 'otherDecColor' may be used uninitialized in this function
31:18.50 /opt/FirefoxSource/mozilla-release/layout/style/nsStyleStruct.cpp:3037:5: warning: 'otherDecColor' may be used uninitialized in this function [-Wmaybe-uninitialized]
31:18.50 Warning: -Wmaybe-uninitialized in /opt/FirefoxSource/mozilla-release/layout/style/nsStyleStruct.cpp: 'decColor' may be used uninitialized in this function
31:18.50 /opt/FirefoxSource/mozilla-release/layout/style/nsStyleStruct.cpp:3037:5: warning: 'decColor' may be used uninitialized in this function [-Wmaybe-uninitialized]
31:18.51 nsStyleUtil.o
31:20.10 nsTransitionManager.o
31:20.42 nsFrameUtil.o
31:20.74 SVGStyleElement.o
31:21.43 nsGenConList.o
31:21.98 SVGSwitchElement.o
31:23.76 nsLayoutDebugger.o
31:24.10 nsGfxScrollFrame.o
31:24.39 SVGSymbolElement.o
31:26.16 nsGridContainerFrame.o
31:26.52 nsLayoutHistoryState.o
31:26.78 SVGTSpanElement.o
31:27.95 nsButtonFrameRenderer.o
31:27.95 nsColorControlFrame.o
31:29.11 SVGTests.o
31:29.46 nsLayoutUtils.o
31:29.98 nsPresContext.o
31:31.58 nsComboboxControlFrame.o
31:31.86 SVGTextContentElement.o
31:34.00 SVGTextElement.o
31:34.05 nsHTMLCanvasFrame.o
31:35.21 nsFieldSetFrame.o
31:36.26 nsHTMLReflowMetrics.o
31:37.28 SVGTextPathElement.o
31:40.14 SVGTextPositioningElement.o
31:40.34 nsHTMLReflowState.o
31:41.01 nsFileControlFrame.o
31:41.10 /opt/FirefoxSource/mozilla-release/layout/base/nsLayoutUtils.cpp: In static member function 'static nscoord nsLayoutUtils::ComputeWidthValue(nsRenderingContext*, nsIFrame*, nscoord, nscoord, nscoord, const nsStyleCoord&)':
31:41.10 Warning: -Wmaybe-uninitialized in /opt/FirefoxSource/mozilla-release/layout/base/nsLayoutUtils.cpp: 'result' may be used uninitialized in this function
31:41.10 /opt/FirefoxSource/mozilla-release/layout/base/nsLayoutUtils.cpp:3971:11: warning: 'result' may be used uninitialized in this function [-Wmaybe-uninitialized]
31:41.11 nsQuoteList.o
31:42.48 nsImageFrame.o
31:42.82 SVGTitleElement.o
31:44.98 nsFormControlFrame.o
31:45.49 SVGTransform.o
31:47.84 SVGTransformList.o
31:47.85 /opt/FirefoxSource/mozilla-release/layout/generic/nsHTMLReflowState.cpp: In member function 'void nsHTMLReflowState::InitConstraints(nsPresContext*, nscoord, nscoord, const nsMargin*, const nsMargin*, nsIAtom*)':
31:47.85 Warning: -Wmaybe-uninitialized in /opt/FirefoxSource/mozilla-release/layout/generic/nsHTMLReflowState.cpp: 'fType' may be used uninitialized in this function
31:47.85 /opt/FirefoxSource/mozilla-release/layout/generic/nsHTMLReflowState.cpp:1992:37: warning: 'fType' may be used uninitialized in this function [-Wmaybe-uninitialized]
31:47.86 nsImageMap.o
31:49.34 nsGfxButtonControlFrame.o
31:50.03 SVGTransformListParser.o
31:50.25 nsStyleChangeList.o
31:50.77 SVGTransformListSMILType.o
31:52.16 SVGTransformableElement.o
31:52.55 nsGfxCheckboxControlFrame.o
31:52.90 SVGUseElement.o
31:53.07 nsStyleSheetService.o
31:54.34 nsInlineFrame.o
31:55.97 nsGfxRadioControlFrame.o
31:56.65 SVGViewBoxSMILType.o
31:57.77 /opt/FirefoxSource/mozilla-release/layout/base/nsStyleSheetService.cpp: In member function 'virtual nsresult nsStyleSheetService::UnregisterSheet(nsIURI*, uint32_t)':
31:57.77 Warning: -Wmaybe-uninitialized in /opt/FirefoxSource/mozilla-release/layout/base/nsStyleSheetService.cpp: 'message' may be used uninitialized in this function
31:57.77 /opt/FirefoxSource/mozilla-release/layout/base/nsStyleSheetService.cpp:266:51: warning: 'message' may be used uninitialized in this function [-Wmaybe-uninitialized]
31:57.78 BasicTableLayoutStrategy.o
31:57.78 FixedTableLayoutStrategy.o
31:58.42 nsIntervalSet.o
31:59.74 nsHTMLButtonControlFrame.o
31:59.85 SVGViewElement.o
32:01.41 SpanningCellSorter.o
32:01.72 SVGZoomEvent.o
32:02.78 nsLeafFrame.o
32:03.02 nsLineBox.o
32:03.17 nsImageControlFrame.o
32:04.13 nsISVGPoint.o
32:04.67 nsCellMap.o
32:05.40 nsTableCellFrame.o
32:06.16 nsPageContentFrame.o
32:06.87 nsLegendFrame.o
32:07.40 nsSVGAngle.o
32:08.81 nsPageFrame.o
32:09.28 nsSVGAnimatedTransformList.o
32:09.82 nsTableColFrame.o
32:10.47 nsListControlFrame.o
32:11.83 nsPlaceholderFrame.o
32:11.88 nsSVGBoolean.o
32:14.12 nsMeterFrame.o
32:14.45 nsTableColGroupFrame.o
32:14.46 nsSVGClass.o
32:15.73 nsSelection.o
32:16.52 /opt/FirefoxSource/mozilla-release/content/svg/content/src/nsSVGBoolean.cpp: In member function 'nsresult nsSVGBoolean::SetBaseValueAtom(const nsIAtom*, nsSVGElement*)':
32:16.52 Warning: -Wmaybe-uninitialized in /opt/FirefoxSource/mozilla-release/content/svg/content/src/nsSVGBoolean.cpp: 'val' may be used uninitialized in this function
32:16.52 /opt/FirefoxSource/mozilla-release/content/svg/content/src/nsSVGBoolean.cpp:68:24: warning: 'val' may be used uninitialized in this function [-Wmaybe-uninitialized]
32:16.52 nsSVGDataParser.o
32:17.67 nsTableFrame.o
32:18.49 nsSVGElement.o
32:19.14 nsSimplePageSequenceFrame.o
32:19.52 nsSVGEnum.o
32:21.10 nsTableOuterFrame.o
32:21.16 nsNumberControlFrame.o
32:24.99 nsSVGFeatures.o
32:25.43 nsProgressFrame.o
32:27.03 nsSVGFilters.o
32:27.43 nsSplittableFrame.o
32:28.39 nsSVGInteger.o
32:28.52 /opt/FirefoxSource/mozilla-release/layout/tables/nsTableFrame.cpp: In member function 'void nsTableFrame::HomogenousInsertFrames(nsIFrame::ChildListID, nsIFrame*, nsFrameList&)':
32:28.52 Warning: -Wmaybe-uninitialized in /opt/FirefoxSource/mozilla-release/layout/tables/nsTableFrame.cpp: 'content' may be used uninitialized in this function
32:28.52 /opt/FirefoxSource/mozilla-release/layout/tables/nsTableFrame.cpp:2343:59: warning: 'content' may be used uninitialized in this function [-Wmaybe-uninitialized]
32:28.52 /opt/FirefoxSource/mozilla-release/layout/tables/nsTableFrame.cpp:2337:19: note: 'content' was declared here
32:28.53 nsTablePainter.o
32:30.36 nsRangeFrame.o
32:32.02 nsSubDocumentFrame.o
32:32.37 /opt/FirefoxSource/mozilla-release/layout/tables/nsTableOuterFrame.cpp: In member function 'virtual void nsTableOuterFrame::Reflow(nsPresContext*, nsHTMLReflowMetrics&, const nsHTMLReflowState&, nsReflowStatus&)':
32:32.37 Warning: -Wmaybe-uninitialized in /opt/FirefoxSource/mozilla-release/layout/tables/nsTableOuterFrame.cpp: 'captionFirstReflow' may be used uninitialized in this function
32:32.37 /opt/FirefoxSource/mozilla-release/layout/tables/nsTableOuterFrame.cpp:1036:59: warning: 'captionFirstReflow' may be used uninitialized in this function [-Wmaybe-uninitialized]
32:32.37 /opt/FirefoxSource/mozilla-release/layout/tables/nsTableOuterFrame.cpp:903:8: note: 'captionFirstReflow' was declared here
32:32.38 nsTableRowFrame.o
32:32.57 nsSVGIntegerPair.o
32:34.44 nsTextFrame.o
32:34.47 nsSelectsAreaFrame.o
32:34.86 nsSVGLength2.o
32:35.80 nsTableRowGroupFrame.o
32:37.20 nsSVGNumber2.o
32:39.53 nsTextFrameUtils.o
32:39.71 nsTextControlFrame.o
32:40.69 nsSVGNumberPair.o
32:43.00 nsSVGPathDataParser.o
32:44.49 nsSVGPathGeometryElement.o
32:45.34 SVGFEContainerFrame.o
32:45.34 SVGFEImageFrame.o
32:46.86 nsSVGPolyElement.o
32:48.44 SVGFELeafFrame.o
32:48.71 nsTextRunTransformations.o
32:48.74 nsSVGString.o
32:49.92 nsBox.o
32:49.92 nsBoxFrame.o
32:50.36 nsVideoFrame.o
32:51.45 nsSVGTransform.o
32:51.62 SVGFEUnstyledLeafFrame.o
32:53.01 nsBoxLayout.o
32:53.31 nsViewportFrame.o
32:53.66 nsSVGViewBox.o
32:54.77 SVGTextFrame.o
32:57.32 nsBoxLayoutState.o
32:57.56 RenderFrameChild.o
32:57.57 RenderFrameParent.o
32:57.98 SVGViewFrame.o
32:59.39 nsBoxObject.o
33:00.55 nsButtonBoxFrame.o
33:02.63 nsMathMLChar.o
33:02.63 nsMathMLContainerFrame.o
33:03.58 nsContainerBoxObject.o
33:05.46 nsFilterInstance.o
33:07.21 inCSSValueSearch.o
33:07.21 inDOMUtils.o
33:07.34 nsDeckFrame.o
33:07.69 nsMathMLFrame.o
33:08.78 nsSVGAFrame.o
33:09.61 inDOMView.o
33:10.65 nsDocElementBoxFrame.o
33:12.37 nsMathMLOperators.o
33:12.79 nsSVGClipPathFrame.o
33:13.89 nsGroupBoxFrame.o
33:13.93 inDeepTreeWalker.o
33:15.89 nsSVGContainerFrame.o
33:16.34 nsMathMLSelectedFrame.o
33:16.50 inFlasher.o
33:17.35 nsImageBoxFrame.o
33:17.36 nsMathMLTokenFrame.o
33:18.60 inLayoutUtils.o
33:19.58 nsSVGEffects.o
33:21.00 nsLeafBoxFrame.o
33:21.20 nsMathMLmactionFrame.o
33:21.30 inSearchLoop.o
33:23.16 nsSVGFilterFrame.o
33:23.89 nsFontFace.o
33:24.10 nsFontFaceList.o
33:25.03 nsMathMLmencloseFrame.o
33:25.08 nsListBoxBodyFrame.o
33:27.18 nsSVGFilterInstance.o
33:28.35 nsListBoxLayout.o
33:28.61 nsMathMLmfencedFrame.o
33:30.31 nsPrintData.o
33:30.31 nsPrintEngine.o
33:30.75 nsSVGForeignObjectFrame.o
33:32.59 nsPagePrintTimer.o
33:32.63 nsListBoxObject.o
33:33.06 nsMathMLmfracFrame.o
33:34.50 nsSVGGFrame.o
33:34.89 nsListItemFrame.o
33:36.66 nsMathMLmmultiscriptsFrame.o
33:37.19 nsMenuBarFrame.o
33:38.21 nsSVGGenericContainerFrame.o
33:38.38 nsPrintObject.o
33:40.49 nsMenuBarListener.o
33:41.12 nsPrintPreviewListener.o
33:41.23 nsMathMLmoFrame.o
33:41.35 nsSVGGradientFrame.o
33:43.75 nsMenuBoxObject.o
33:43.78 nsSVGImageFrame.o
33:44.89 nsMathMLmpaddedFrame.o
33:45.52 nsContentDLF.o
33:45.52 nsLayoutModule.o
33:46.32 nsMenuFrame.o
33:47.32 nsSVGInnerSVGFrame.o
33:48.23 nsLayoutStatics.o
33:48.71 nsMenuPopupFrame.o
33:48.82 nsMathMLmphantomFrame.o
33:51.23 nsSVGIntegrationUtils.o
33:52.30 nsMathMLmrootFrame.o
33:53.45 nsPopupBoxObject.o
33:54.86 nsSVGMarkerFrame.o
33:55.65 nsMathMLmrowFrame.o
33:58.73 nsPopupSetFrame.o
33:59.24 nsSVGMaskFrame.o
33:59.26 nsMathMLmspaceFrame.o
34:01.34 nsProgressMeterFrame.o
34:02.52 nsMathMLmsqrtFrame.o
34:02.85 nsSVGOuterSVGFrame.o
34:03.89 nsRepeatService.o
34:05.91 nsMathMLmtableFrame.o
34:06.39 nsResizerFrame.o
34:06.40 nsSVGPaintServerFrame.o
34:06.60 nsRootBoxFrame.o
34:06.75 nsMathMLmunderoverFrame.o
34:09.34 nsDocShell.o
34:09.34 LoadContext.o
34:10.31 nsScrollBoxFrame.o
34:11.18 nsSVGPathGeometryFrame.o
34:11.76 nsMathMLsemanticsFrame.o
34:12.75 nsScrollBoxObject.o
34:14.23 nsSVGPatternFrame.o
34:15.52 nsScrollbarButtonFrame.o
34:17.93 nsScrollbarFrame.o
34:18.92 nsSVGStopFrame.o
34:18.98 nsSHEntry.o
34:18.98 nsSHEntryShared.o
34:20.18 nsSHTransaction.o
34:20.84 nsSliderFrame.o
34:21.92 nsSHistory.o
34:22.83 nsSVGSwitchFrame.o
34:23.69 nsSplitterFrame.o
34:24.21 nsSVGUseFrame.o
34:24.70 LoadInfo.o
34:25.68 SerializedLoadContext.o
34:25.90 nsAboutRedirector.o
34:26.82 nsDSURIContentListener.o
34:27.25 nsSprocketLayout.o
34:27.47 nsSVGUtils.o
34:27.51 nsDefaultURIFixup.o
34:29.59 nsDocShellEditorData.o
34:30.81 nsDocShellEnumerator.o
34:31.41 nsDocShellLoadInfo.o
34:31.82 nsStackFrame.o
34:31.89 nsDocShellTransferableHooks.o
34:32.42 nsDownloadHistory.o
34:32.64 nsWebNavigationInfo.o
34:32.98 nsDocShellModule.o
34:33.22 nsAutoWindowStateHelper.o
34:33.22 nsDialogParamBlock.o
34:33.82 nsWindowWatcher.o
34:34.26 nsAppStartupNotifier.o
34:34.58 /opt/FirefoxSource/mozilla-release/layout/xul/nsSprocketLayout.cpp: In member function 'void nsSprocketLayout::AlignChildren(nsIFrame*, nsBoxLayoutState&)':
34:34.58 Warning: -Wmaybe-uninitialized in /opt/FirefoxSource/mozilla-release/layout/xul/nsSprocketLayout.cpp: 'y' may be used uninitialized in this function
34:34.58 /opt/FirefoxSource/mozilla-release/layout/xul/nsSprocketLayout.cpp:973:22: warning: 'y' may be used uninitialized in this function [-Wmaybe-uninitialized]
34:34.58 Warning: -Wmaybe-uninitialized in /opt/FirefoxSource/mozilla-release/layout/xul/nsSprocketLayout.cpp: 'x' may be used uninitialized in this function
34:34.58 /opt/FirefoxSource/mozilla-release/layout/xul/nsSprocketLayout.cpp:993:22: warning: 'x' may be used uninitialized in this function [-Wmaybe-uninitialized]
34:34.58 Warning: -Wmaybe-uninitialized in /opt/FirefoxSource/mozilla-release/layout/xul/nsSprocketLayout.cpp: 'isLTR' may be used uninitialized in this function
34:34.58 /opt/FirefoxSource/mozilla-release/layout/xul/nsSprocketLayout.cpp:989:45: warning: 'isLTR' may be used uninitialized in this function [-Wmaybe-uninitialized]
34:34.58 Warning: -Wmaybe-uninitialized in /opt/FirefoxSource/mozilla-release/layout/xul/nsSprocketLayout.cpp: 'maxAscent' may be used uninitialized in this function
34:34.58 /opt/FirefoxSource/mozilla-release/layout/xul/nsSprocketLayout.cpp:967:54: warning: 'maxAscent' may be used uninitialized in this function [-Wmaybe-uninitialized]
34:34.58 nsStackLayout.o
34:34.65 nsTextBoxFrame.o
34:34.76 nsFind.o
34:34.76 nsWebBrowserFind.o
34:37.13 nsTitleBarFrame.o
34:37.69 nsXULLabelFrame.o
34:37.73 nsWebBrowserPersist.o
34:41.21 nsXULPopupManager.o
34:41.40 nsBaseCommandController.o
34:41.40 nsCommandGroup.o
34:41.63 /opt/FirefoxSource/mozilla-release/layout/xul/nsTextBoxFrame.cpp: In member function 'void nsTextBoxFrame::DrawText(nsRenderingContext&, const nsRect&, const nsRect&, const nscolor*)':
34:41.63 Warning: -Wmaybe-uninitialized in /opt/FirefoxSource/mozilla-release/layout/xul/nsTextBoxFrame.cpp: 'underColor' may be used uninitialized in this function
34:41.63 /opt/FirefoxSource/mozilla-release/layout/xul/nsTextBoxFrame.cpp:488:43: warning: 'underColor' may be used uninitialized in this function [-Wmaybe-uninitialized]
34:41.63 Warning: -Wmaybe-uninitialized in /opt/FirefoxSource/mozilla-release/layout/xul/nsTextBoxFrame.cpp: 'overColor' may be used uninitialized in this function
34:41.63 /opt/FirefoxSource/mozilla-release/layout/xul/nsTextBoxFrame.cpp:495:42: warning: 'overColor' may be used uninitialized in this function [-Wmaybe-uninitialized]
34:41.63 Warning: -Wmaybe-uninitialized in /opt/FirefoxSource/mozilla-release/layout/xul/nsTextBoxFrame.cpp: 'strikeColor' may be used uninitialized in this function
34:41.63 /opt/FirefoxSource/mozilla-release/layout/xul/nsTextBoxFrame.cpp:573:37: warning: 'strikeColor' may be used uninitialized in this function [-Wmaybe-uninitialized]
34:41.63 Warning: -Wmaybe-uninitialized in /opt/FirefoxSource/mozilla-release/layout/xul/nsTextBoxFrame.cpp: 'strikeStyle' may be used uninitialized in this function
34:41.63 /opt/FirefoxSource/mozilla-release/layout/xul/nsTextBoxFrame.cpp:573:37: warning: 'strikeStyle' may be used uninitialized in this function [-Wmaybe-uninitialized]
34:41.63 Warning: -Wmaybe-uninitialized in /opt/FirefoxSource/mozilla-release/layout/xul/nsTextBoxFrame.cpp: 'underStyle' may be used uninitialized in this function
34:41.63 /opt/FirefoxSource/mozilla-release/layout/xul/nsTextBoxFrame.cpp:488:43: warning: 'underStyle' may be used uninitialized in this function [-Wmaybe-uninitialized]
34:41.63 Warning: -Wmaybe-uninitialized in /opt/FirefoxSource/mozilla-release/layout/xul/nsTextBoxFrame.cpp: 'overStyle' may be used uninitialized in this function
34:41.63 /opt/FirefoxSource/mozilla-release/layout/xul/nsTextBoxFrame.cpp:495:42: warning: 'overStyle' may be used uninitialized in this function [-Wmaybe-uninitialized]
34:41.63 nsCommandManager.o
34:41.79 nsCommandParams.o
34:42.29 nsControllerCommandTable.o
34:43.06 nsXULTooltipListener.o
34:43.14 nsPrintProgress.o
34:43.14 nsPrintProgressParams.o
34:43.87 nsPrintingPromptService.o
34:44.16 nsEmbeddingModule.o
34:44.24 nsCommandHandler.o
34:44.24 nsContextMenuInfo.o
34:44.98 nsWebBrowserModule.o
34:45.31 nsDocShellTreeOwner.o
34:45.88 nsEmbedStream.o
34:47.61 nsWebBrowser.o
34:47.96 nsAppShellFactory.o
34:47.96 nsAppShellService.o
34:48.06 nsWebBrowserContentPolicy.o
34:48.08 ANPCanvas.o
34:48.08 ANPPaint.o
34:48.58 ANPPath.o
34:48.81 nsAppShellWindowEnumerator.o
34:48.97 ANPTypeface.o
34:49.36 SkANP.o
34:49.71 /opt/FirefoxSource/mozilla-release/other-licenses/skia-npapi/ANPTypeface.cpp: In function 'int32_t anp_getFontPath(const ANPTypeface*, char*, int32_t, int32_t*)':
34:49.71 Warning: -Wunused-variable in /opt/FirefoxSource/mozilla-release/other-licenses/skia-npapi/ANPTypeface.cpp: unused variable 'stream'
34:49.71 /opt/FirefoxSource/mozilla-release/other-licenses/skia-npapi/ANPTypeface.cpp:63:15: warning: unused variable 'stream' [-Wunused-variable]
34:50.08 nsChromeTreeOwner.o
34:50.54 nsContentTreeOwner.o
34:50.66 nsWebShellWindow.o
34:51.62 nsWindowMediator.o
34:52.71 nsXULWindow.o
34:52.96 CharDistribution.o
34:52.97 JpCntx.o
34:53.35 LangBulgarianModel.o
34:53.49 LangCyrillicModel.o
34:53.63 LangGreekModel.o
34:53.73 LangHebrewModel.o
34:53.82 LangHungarianModel.o
34:53.92 LangThaiModel.o
34:54.02 nsBig5Prober.o
34:54.11 nsCharSetProber.o
34:54.26 nsEUCJPProber.o
34:54.31 nsUdetXPCOMWrapper.o
34:54.31 nsUniversalCharDetModule.o
34:54.37 nsEUCKRProber.o
34:54.59 nsEUCTWProber.o
34:54.76 nsEscCharsetProber.o
34:54.91 nsEscSM.o
34:55.06 nsGB2312Prober.o
34:55.10 AccessibleWrap.o
34:55.10 Platform.o
34:55.17 nsHebrewProber.o
34:55.33 nsLatin1Prober.o
34:55.46 nsMBCSGroupProber.o
34:55.58 ARIAMap.o
34:55.59 nsMBCSSM.o
34:55.59 ARIAStateMap.o
34:55.81 nsSBCSGroupProber.o
34:56.05 nsSBCharSetProber.o
34:56.10 nsSJISProber.o
34:56.30 nsUTF8Prober.o
34:56.33 ARIAGridAccessible.o
34:56.33 Accessible.o
34:56.50 nsUniversalDetector.o
34:56.87 HTMLCanvasAccessible.o
34:56.87 HTMLElementAccessibles.o
34:57.88 xpcAccEvents.o
34:57.88 nsAccessibleRelation.o
34:58.20 AccCollector.o
34:58.68 xpcAccessibleHyperText.o
34:59.40 HTMLFormControlAccessible.o
34:59.67 ApplicationAccessible.o
35:01.05 AccEvent.o
35:01.33 xpcAccessibleSelectable.o
35:02.03 AccGroupInfo.o
35:02.57 HTMLImageMapAccessible.o
35:04.27 xpcAccessibleTable.o
35:05.02 AccIterator.o
35:05.15 xpcAccessibleTableCell.o
35:06.23 xpcAccessibleTextRange.o
35:06.73 HTMLLinkAccessible.o
35:07.31 xpcAccessibleValue.o
35:07.49 Asserts.o
35:07.99 BaseAccessibles.o
35:10.34 HTMLListAccessible.o
35:10.57 DocManager.o
35:10.74 EventQueue.o
35:10.76 DocAccessible.o
35:10.79 HTMLSelectAccessible.o
35:13.25 XULAlertAccessible.o
35:13.25 XULColorPickerAccessible.o
35:13.37 FormControlAccessible.o
35:13.88 HTMLTableAccessible.o
35:14.15 XULComboboxAccessible.o
35:14.38 Filters.o
35:16.87 XULElementAccessibles.o
35:17.41 FocusManager.o
35:18.74 HyperTextAccessible.o
35:19.68 XULFormControlAccessible.o
35:19.80 Logging.o
35:21.39 ImageAccessible.o
35:22.46 NotificationController.o
35:23.07 nsProfileDirServiceProvider.o
35:23.07 nsProfileLock.o
35:23.73 XULListboxAccessible.o
35:24.00 SelectionManager.o
35:25.66 StyleInfo.o
35:25.69 OuterDocAccessible.o
35:27.12 XULMenuAccessible.o
35:27.50 local_debug_info_symbolizer.o
35:27.50 platform-linux.o
35:28.91 TextAttrs.o
35:28.95 RootAccessible.o
35:29.38 shared-libraries-linux.o
35:30.45 EHABIStackWalk.o
35:30.51 XULSelectControlAccessible.o
35:31.64 AutoObjectMapper.o
35:31.73 TableCellAccessible.o
35:31.76 TextRange.o
35:32.88 BreakpadSampler.o
35:33.56 JSStreamWriter.o
35:33.66 XULSliderAccessible.o
35:34.67 LulCommon.o
35:35.22 TextUpdater.o
35:35.34 TextLeafAccessible.o
35:35.45 LulDwarf.o
35:36.16 LulDwarfSummariser.o
35:36.54 XULTabAccessible.o
35:37.80 LulElf.o
35:37.93 TreeWalker.o
35:38.00 LulExidx.o
35:38.81 LulMain.o
35:39.18 nsAccUtils.o
35:39.21 LulRWLock.o
35:39.51 XULTreeAccessible.o
35:40.76 ProfileEntry.o
35:40.87 ProfilerBacktrace.o
35:40.91 nsWindowDataSource.o
35:41.94 nsDirectoryViewer.o
35:42.02 nsAccessibilityService.o
35:42.23 XULTreeGridAccessible.o
35:42.59 ProfilerIOInterposeObserver.o
35:43.03 ProfilerMarkers.o
35:43.87 SaveProfileTask.o
35:44.49 SyncProfile.o
35:44.74 nsModule.o
35:45.04 nsAccessiblePivot.o
35:45.31 TableTicker.o
35:45.82 ThreadResponsiveness.o
35:46.71 nsCoreUtils.o
35:48.49 UnwinderThread2.o
35:49.18 nsEventShell.o
35:49.20 nsProfiler.o
35:50.12 nsTextEquivUtils.o
35:50.23 nsProfilerFactory.o
35:50.57 mozHunspell.o
35:50.57 mozHunspellDirProvider.o
35:51.59 platform.o
35:53.63 mozEnglishWordUtils.o
35:53.63 mozGenericWordUtils.o
35:53.77 RemoteSpellCheckEngineChild.o
35:54.14 mozInlineSpellChecker.o
35:54.20 RemoteSpellCheckEngineParent.o
35:54.37 mozInlineSpellWordUtil.o
35:54.86 nsSecureBrowserUIImpl.o
35:54.87 PublicKeyPinningService.o
35:55.51 md4.o
35:55.51 CryptoTask.o
35:55.52 affentry.o
35:55.71 nsCertificatePrincipal.o
35:56.44 nsCertOverrideService.o
35:56.71 nsCertPicker.o
35:56.87 affixmgr.o
35:57.29 nsBOOTModule.o
35:57.56 csutil.o
35:57.87 nsEntropyCollector.o
35:58.21 nsCertVerificationThread.o
35:58.40 nsSecurityHeaderParser.o
35:58.51 mozPersonalDictionary.o
35:58.69 nsSecurityWarningDialogs.o
35:58.86 nsClientAuthRemember.o
35:59.03 nsSiteSecurityService.o
35:59.62 nsCrypto.o
36:00.49 dictmgr.o
36:00.81 nsDataSignatureVerifier.o
36:00.85 filemgr.o
36:01.20 hashmgr.o
36:01.30 mozSpellChecker.o
36:01.52 hunspell.o
36:01.53 nsKeygenHandler.o
36:01.70 hunzip.o
36:02.23 OCSPCommon.o
36:02.23 TLSServer.o
36:02.27 nsKeygenThread.o
36:02.53 mozSpellCheckerFactory.o
36:03.04 mozSpellI18NManager.o
36:03.30 phonet.o
36:03.59 nsKeyModule.o
36:03.73 replist.o
36:04.09 nsNSSASN1Object.o
36:04.11 suggestmgr.o
36:04.54 nsNSSCallbacks.o
36:05.00 /opt/FirefoxSource/mozilla-release/security/manager/ssl/src/nsNSSASN1Object.cpp: In function 'nsresult buildASN1ObjectFromDER(unsigned char*, unsigned char*, nsIASN1Sequence*)':
36:05.00 Warning: -Wmaybe-uninitialized in /opt/FirefoxSource/mozilla-release/security/manager/ssl/src/nsNSSASN1Object.cpp: 'bytesUsed' may be used uninitialized in this function
36:05.00 /opt/FirefoxSource/mozilla-release/security/manager/ssl/src/nsNSSASN1Object.cpp:131:22: warning: 'bytesUsed' may be used uninitialized in this function [-Wmaybe-uninitialized]
36:05.00 nsNSSCertCache.o
36:05.69 BadCertServer.o
36:05.69 GenerateOCSPResponse.o
36:05.84 OCSPCacheTest.o
36:05.84 TLSIntoleranceTest.o
36:06.00 OCSPStaplingServer.o
36:06.12 nsNSSCertHelper.o
36:06.63 nsNSSCertificate.o
36:07.14 nsNSSCertificateFakeTransport.o
36:08.16 nsNSSCertTrust.o
36:08.33 nsNSSCertValidity.o
36:08.57 TestCertDB.o
36:08.78 nsASN1Tree.o
36:08.78 nsFormSigningDialog.o
36:08.80 nsNSSCleaner.o
36:08.84 nsAlertsService.o
36:08.84 nsXULAlerts.o
36:08.95 nsNSSDialogHelper.o
36:09.28 nsNSSDialogs.o
36:09.28 nsNSSErrors.o
36:09.41 nsNSSIOLayer.o
36:09.42 nsPKIModule.o
36:10.08 nsNSSModule.o
36:10.15 nsPKIParamBlock.o
36:10.63 nsCommandLine.o
36:10.92 nsNSSShutDown.o
36:11.89 DiskSpaceWatcher.o
36:12.01 nsNTLMAuthModule.o
36:12.16 SQLFunctions.o
36:12.16 ApplicationReputation.o
36:12.38 nsPK11TokenDB.o
36:12.75 nsPKCS11Slot.o
36:12.84 csd.pb.o
36:12.99 nsPKCS12Blob.o
36:13.36 FinalizationWitnessService.o
36:13.58 nsProtectedAuthThread.o
36:13.72 nsPSMBackgroundThread.o
36:14.16 nsFindService.o
36:14.25 nsRandomGenerator.o
36:14.44 DownloadPlatform.o
36:14.75 nsSDR.o
36:14.82 NSSErrorsService.o
36:15.28 nsSSLSocketProvider.o
36:15.61 nsSSLStatus.o
36:15.94 nsStreamCipher.o
36:16.19 nsTLSSocketProvider.o
36:16.20 mp3sniff.o
36:16.20 nsMediaSniffer.o
36:16.29 nsMediaSnifferModule.o
36:16.38 nsDownloadManager.o
36:16.46 nsUsageArrayHelper.o
36:16.61 NativeOSFileInternals.o
36:16.90 nsParentalControlsServiceDefault.o
36:16.98 PSMRunnable.o
36:17.26 PerfMeasurement.o
36:17.62 SharedSSLState.o
36:18.01 SSLServerCertVerification.o
36:18.04 extension_set.o
36:18.04 generated_message_util.o
36:18.05 coded_stream.o
36:18.42 zero_copy_stream.o
36:18.73 TransportSecurityInfo.o
36:19.21 zero_copy_stream_impl_lite.o
36:19.53 message_lite.o
36:20.14 repeated_field.o
36:20.26 common.o
36:20.58 nsCryptoHash.o
36:20.69 once.o
36:20.76 wire_format_lite.o
36:21.31 reflect.o
36:21.82 StartupTimeline.o
36:21.82 nsAppStartup.o
36:21.82 nsNSSCertificateDB.o
36:21.94 nsUserInfoUnix.o
36:22.43 nsNSSComponent.o
36:22.65 nsBrowserStatusFilter.o
36:22.96 Telemetry.o
36:23.57 nsTypeAheadFind.o
36:24.01 lz4.o
36:24.40 ctypes.o
36:24.43 nsNSSVersion.o
36:25.34 nsAutoCompleteController.o
36:25.34 nsAutoCompleteSimpleResult.o
36:25.99 PSMContentListener.o
36:26.37 nsCertTree.o
36:27.22 nsFormFillController.o
36:27.99 nsUrlClassifierPrefixSet.o
36:27.99 nsUrlClassifierStreamUpdater.o
36:28.75 HashStore.o
36:28.91 nsToolkitCompsModule.o
36:29.60 ChunkSet.o
36:30.04 nsJSInspector.o
36:30.26 IdentityCryptoService.o
36:31.06 AddonPathService.o
36:31.06 BadPlugin.o
36:31.06 GoodPlugin.o
36:31.19 nsProfileLock.o
36:31.19 nsToolkitProfileService.o
36:31.65 Classifier.o
36:31.67 LookupCache.o
36:32.38 ProtocolParser.o
36:32.45 TestWebappRT.o
36:32.50 nsCheckSummedOutputStream.o
36:32.55 nsAndroidSystemProxySettings.o
36:33.16 nsUrlClassifierDBService.o
36:33.58 nsUrlClassifierProxies.o
36:33.77 nsUrlClassifierUtils.o
36:34.52 /opt/FirefoxSource/mozilla-release/toolkit/system/androidproxy/nsAndroidSystemProxySettings.cpp: In member function 'virtual MozExternalRefCountType nsAndroidSystemProxySettings::Release()':
36:34.53 Warning: -Wdelete-non-virtual-dtor in /opt/FirefoxSource/mozilla-release/toolkit/system/androidproxy/nsAndroidSystemProxySettings.cpp: deleting object of polymorphic class type 'nsAndroidSystemProxySettings' which has non-virtual destructor might cause undefined behaviour
36:34.53 /opt/FirefoxSource/mozilla-release/toolkit/system/androidproxy/nsAndroidSystemProxySettings.cpp:32:409: warning: deleting object of polymorphic class type 'nsAndroidSystemProxySettings' which has non-virtual destructor might cause undefined behaviour [-Wdelete-non-virtual-dtor]
36:34.54 convert_UTF.o
36:34.54 breakpad_getcontext.o
36:34.70 arm_ex_reader.o
36:34.71 arm_ex_to_module.o
36:34.74 bytereader.o
36:34.98 dwarf2diehandler.o
36:35.45 dwarf2reader.o
36:35.58 dwarf_cfi_to_module.o
36:35.81 dwarf_cu_to_module.o
36:36.15 basic_code_modules.o
36:36.15 basic_source_line_resolver.o
36:36.21 dwarf_line_to_module.o
36:37.01 call_stack.o
36:37.15 language.o
36:37.78 dump_symbols.o
36:38.27 elf_symbols_to_module.o
36:38.29 /opt/FirefoxSource/mozilla-release/toolkit/crashreporter/google-breakpad/src/common/dwarf_cu_to_module.cc: In member function 'std::string google_breakpad::DwarfCUToModule::GenericDIEHandler::ComputeQualifiedName()':
36:38.29 Warning: -Wmaybe-uninitialized in /opt/FirefoxSource/mozilla-release/toolkit/crashreporter/google-breakpad/src/common/dwarf_cu_to_module.cc: 'enclosing_name' may be used uninitialized in this function
36:38.29 /opt/FirefoxSource/mozilla-release/toolkit/crashreporter/google-breakpad/src/common/dwarf_cu_to_module.cc:386:68: warning: 'enclosing_name' may be used uninitialized in this function [-Wmaybe-uninitialized]
36:38.29 Warning: -Wmaybe-uninitialized in /opt/FirefoxSource/mozilla-release/toolkit/crashreporter/google-breakpad/src/common/dwarf_cu_to_module.cc: 'unqualified_name' may be used uninitialized in this function
36:38.29 /opt/FirefoxSource/mozilla-release/toolkit/crashreporter/google-breakpad/src/common/dwarf_cu_to_module.cc:386:68: warning: 'unqualified_name' may be used uninitialized in this function [-Wmaybe-uninitialized]
36:38.29 logging.o
36:38.30 md5.o
36:38.96 module.o
36:39.09 pathname_stripper.o
36:39.19 string_conversion.o
36:39.24 cfi_frame_info.o
36:39.59 minidump.o
36:39.61 unique_string.o
36:40.34 source_line_resolver_base.o
36:40.83 stack_frame_symbolizer.o
36:41.09 file_id.o
36:41.09 elfutils.o
36:41.41 guid_creator.o
36:41.55 linux_libc_support.o
36:41.64 memory_mapped_file.o
36:41.75 safe_readlink.o
36:42.15 stackwalker.o
36:42.17 nsAppRunner.o
36:42.19 nsEmbedFunctions.o
36:42.21 stackwalker_amd64.o
36:42.82 stackwalker_arm.o
36:43.07 stackwalker_ppc.o
36:43.82 stackwalker_sparc.o
36:44.10 stackwalker_x86.o
36:44.39 tokenize.o
36:44.96 CreateAppData.o
36:45.10 EventTracer.o
36:45.55 ProfileReset.o
36:45.97 nsAndroidStartup.o
36:46.42 nsAutoConfig.o
36:46.42 nsConfigFactory.o
36:46.60 nsConsoleWriter.o
36:47.41 /opt/FirefoxSource/mozilla-release/toolkit/xre/nsAppRunner.cpp: In member function 'int XREMain::XRE_mainStartup(bool*)':
36:47.41 Warning: -Wmaybe-uninitialized in /opt/FirefoxSource/mozilla-release/toolkit/xre/nsAppRunner.cpp: 'currentIsSelected' may be used uninitialized in this function
36:47.41 /opt/FirefoxSource/mozilla-release/toolkit/xre/nsAppRunner.cpp:2096:7: warning: 'currentIsSelected' may be used uninitialized in this function [-Wmaybe-uninitialized]
36:47.41 /opt/FirefoxSource/mozilla-release/toolkit/xre/nsAppRunner.cpp:2094:12: note: 'currentIsSelected' was declared here
36:47.42 nsNativeAppSupportBase.o
36:47.58 nsJSConfigTriggers.o
36:47.83 nsReadConfig.o
36:48.36 nsNativeAppSupportDefault.o
36:48.53 nsSigHandlers.o
36:48.67 nsXREDirProvider.o
36:49.04 nsSyncJPAKE.o
36:49.18 StartupCache.o
36:49.18 StartupCacheModule.o
36:49.25 JSDebugger.o
36:49.57 snappy-c.o
36:49.57 snappy-sinksource.o
36:49.91 snappy-stubs-internal.o
36:49.97 nsBrowserModule.o
36:49.97 nsShellService.o
36:49.99 snappy.o
36:50.34 nsAndroidHistory.o
36:50.36 StartupCacheUtils.o
36:51.31 StaticXULComponentsStart.o
36:51.39 ssltunnel.o
36:51.51 TestArrayUtils.o
36:51.51 TestAtomics.o
36:51.71 TestBinarySearch.o
36:52.02 /opt/FirefoxSource/mozilla-release/mobile/android/components/build/nsShellService.cpp: In member function 'virtual MozExternalRefCountType nsShellService::Release()':
36:52.02 Warning: -Wdelete-non-virtual-dtor in /opt/FirefoxSource/mozilla-release/mobile/android/components/build/nsShellService.cpp: deleting object of polymorphic class type 'nsShellService' which has non-virtual destructor might cause undefined behaviour
36:52.02 /opt/FirefoxSource/mozilla-release/mobile/android/components/build/nsShellService.cpp:13:381: warning: deleting object of polymorphic class type 'nsShellService' which has non-virtual destructor might cause undefined behaviour [-Wdelete-non-virtual-dtor]
36:52.05 TestVolatileBuffer.o
36:52.54 editline.o
36:52.54 sysunix.o
36:52.69 js.o
36:52.69 jsheaptools.o
36:53.14 /opt/FirefoxSource/mozilla-release/mobile/android/components/build/nsAndroidHistory.cpp: In member function 'virtual MozExternalRefCountType nsAndroidHistory::Release()':
36:53.14 Warning: -Wdelete-non-virtual-dtor in /opt/FirefoxSource/mozilla-release/mobile/android/components/build/nsAndroidHistory.cpp: deleting object of polymorphic class type 'nsAndroidHistory' which has non-virtual destructor might cause undefined behaviour
36:53.14 /opt/FirefoxSource/mozilla-release/mobile/android/components/build/nsAndroidHistory.cpp:18:385: warning: deleting object of polymorphic class type 'nsAndroidHistory' which has non-virtual destructor might cause undefined behaviour [-Wdelete-non-virtual-dtor]
36:53.16 selfTest.o
36:53.16 testAddPropertyPropcache.o
36:53.68 gdb-tests.o
36:53.68 test-JSObject.o
36:53.71 TestBloomFilter.o
36:54.06 TestCasting.o
36:54.18 test-JSString.o
36:54.20 TestCeilingFloor.o
36:54.32 TestCheckedInt.o
36:54.48 TestCountPopulation.o
36:54.58 test-JSSymbol.o
36:55.39 testArgumentsObject.o
36:55.99 test-Root.o
36:56.39 test-jsid.o
36:57.28 test-jsval.o
36:57.40 testArrayBuffer.o
36:57.71 test-prettyprinters.o
36:58.12 typedef-printers.o
36:58.57 pkixbind.o
36:58.57 pkixbuild.o
36:58.64 pkixcert.o
36:58.98 pkixcheck.o
36:59.21 pkixder.o
36:59.56 In file included from /opt/FirefoxSource/mozilla-release/security/pkix/lib/pkixutil.h:28:0,
36:59.57                  from /opt/FirefoxSource/mozilla-release/security/pkix/lib/pkixcheck.h:29,
36:59.57                  from /opt/FirefoxSource/mozilla-release/security/pkix/lib/pkixcheck.cpp:29:
36:59.57 /opt/FirefoxSource/mozilla-release/security/pkix/lib/pkixder.h: In function 'mozilla::pkix::Result mozilla::pkix::DecodeBasicConstraints(mozilla::pkix::Input&, bool&, long int&)':
36:59.57 Warning: -Wmaybe-uninitialized in /opt/FirefoxSource/mozilla-release/security/pkix/lib/pkixder.h: 'parsedValue' may be used uninitialized in this function
36:59.57 /opt/FirefoxSource/mozilla-release/security/pkix/lib/pkixder.h:396:22: warning: 'parsedValue' may be used uninitialized in this function [-Wmaybe-uninitialized]
36:59.57 /opt/FirefoxSource/mozilla-release/security/pkix/lib/pkixder.h:391:11: note: 'parsedValue' was declared here
36:59.57 pkixnss.o
36:59.89 pkixocsp.o
37:00.31 In file included from /opt/FirefoxSource/mozilla-release/js/src/shell/../jsweakmap.h:10:0,
37:00.31                  from /opt/FirefoxSource/mozilla-release/js/src/shell/../vm/ScopeObject.h:12,
37:00.31                  from /opt/FirefoxSource/mozilla-release/js/src/shell/../frontend/SharedContext.h:19,
37:00.31                  from /opt/FirefoxSource/mozilla-release/js/src/shell/../frontend/FullParseHandler.h:13,
37:00.31                  from /opt/FirefoxSource/mozilla-release/js/src/shell/../frontend/Parser.h:17,
37:00.31                  from /opt/FirefoxSource/mozilla-release/js/src/shell/js.cpp:58:
37:00.31 /opt/FirefoxSource/mozilla-release/js/src/shell/../jscompartment.h: In function 'bool EvalInFrame(JSContext*, unsigned int, jsval*)':
37:00.31 Warning: -Wmaybe-uninitialized in /opt/FirefoxSource/mozilla-release/js/src/jscompartment.h: 'ac.js::AutoCompartment::origin_' may be used uninitialized in this function
37:00.31 /opt/FirefoxSource/mozilla-release/js/src/shell/../jscompartment.h:157:31: warning: 'ac.js::AutoCompartment::origin_' may be used uninitialized in this function [-Wmaybe-uninitialized]
37:00.31 /opt/FirefoxSource/mozilla-release/js/src/shell/js.cpp:2775:37: note: 'ac.js::AutoCompartment::origin_' was declared here
37:00.31 In file included from /opt/FirefoxSource/mozilla-release/js/src/shell/../jscompartmentinlines.h:14:0,
37:00.31                  from /opt/FirefoxSource/mozilla-release/js/src/shell/js.cpp:73:
37:00.31 Warning: -Wmaybe-uninitialized in /opt/FirefoxSource/mozilla-release/js/src/jscntxtinlines.h: 'ac.js::AutoCompartment::cx_' may be used uninitialized in this function
37:00.31 /opt/FirefoxSource/mozilla-release/js/src/shell/../jscntxtinlines.h:413:29: warning: 'ac.js::AutoCompartment::cx_' may be used uninitialized in this function [-Wmaybe-uninitialized]
37:00.31 /opt/FirefoxSource/mozilla-release/js/src/shell/js.cpp:2775:37: note: 'ac.js::AutoCompartment::cx_' was declared here
37:00.31 In file included from /opt/FirefoxSource/mozilla-release/js/src/shell/../jsweakmap.h:10:0,
37:00.31                  from /opt/FirefoxSource/mozilla-release/js/src/shell/../vm/ScopeObject.h:12,
37:00.31                  from /opt/FirefoxSource/mozilla-release/js/src/shell/../frontend/SharedContext.h:19,
37:00.31                  from /opt/FirefoxSource/mozilla-release/js/src/shell/../frontend/FullParseHandler.h:13,
37:00.31                  from /opt/FirefoxSource/mozilla-release/js/src/shell/../frontend/Parser.h:17,
37:00.31                  from /opt/FirefoxSource/mozilla-release/js/src/shell/js.cpp:58:
37:00.31 /opt/FirefoxSource/mozilla-release/js/src/shell/../jscompartment.h: In function 'bool Evaluate(JSContext*, unsigned int, jsval*)':
37:00.31 Warning: -Wmaybe-uninitialized in /opt/FirefoxSource/mozilla-release/js/src/jscompartment.h: '*((void*)(& ancx)+24).js::AutoCompartment::origin_' may be used uninitialized in this function
37:00.31 /opt/FirefoxSource/mozilla-release/js/src/shell/../jscompartment.h:157:31: warning: '*((void*)(& ancx)+24).js::AutoCompartment::origin_' may be used uninitialized in this function [-Wmaybe-uninitialized]
37:00.31 /opt/FirefoxSource/mozilla-release/js/src/shell/js.cpp:1229:20: note: '*((void*)(& ancx)+24).js::AutoCompartment::origin_' was declared here
37:00.31 In file included from /opt/FirefoxSource/mozilla-release/js/src/shell/../jscompartmentinlines.h:14:0,
37:00.31                  from /opt/FirefoxSource/mozilla-release/js/src/shell/js.cpp:73:
37:00.31 Warning: -Wmaybe-uninitialized in /opt/FirefoxSource/mozilla-release/js/src/jscntxtinlines.h: '*((void*)(& ancx)+24).js::AutoCompartment::cx_' may be used uninitialized in this function
37:00.31 /opt/FirefoxSource/mozilla-release/js/src/shell/../jscntxtinlines.h:449:53: warning: '*((void*)(& ancx)+24).js::AutoCompartment::cx_' may be used uninitialized in this function [-Wmaybe-uninitialized]
37:00.31 /opt/FirefoxSource/mozilla-release/js/src/shell/js.cpp:1229:20: note: '*((void*)(& ancx)+24).js::AutoCompartment::cx_' was declared here
37:00.31 In file included from /opt/FirefoxSource/mozilla-release/js/src/shell/js.cpp:38:0:
37:00.31 Warning: -Wmaybe-uninitialized in /opt/FirefoxSource/mozilla-release/js/src/jsapi.h: '*((void*)(& ancx)+8).JSAutoRequest::mContext' may be used uninitialized in this function
37:00.31 /opt/FirefoxSource/mozilla-release/js/src/shell/../jsapi.h:1327:32: warning: '*((void*)(& ancx)+8).JSAutoRequest::mContext' may be used uninitialized in this function [-Wmaybe-uninitialized]
37:00.31 /opt/FirefoxSource/mozilla-release/js/src/shell/js.cpp:1229:20: note: '*((void*)(& ancx)+8).JSAutoRequest::mContext' was declared here
37:00.31 jsoptparse.o
37:00.65 /opt/FirefoxSource/mozilla-release/security/pkix/lib/pkixocsp.cpp: In function 'mozilla::pkix::Result mozilla::pkix::BasicResponse(mozilla::pkix::Input&, mozilla::pkix::Context&)':
37:00.65 Warning: -Wmaybe-uninitialized in /opt/FirefoxSource/mozilla-release/security/pkix/lib/pkixocsp.cpp: 'version' may be used uninitialized in this function
37:00.65 /opt/FirefoxSource/mozilla-release/security/pkix/lib/pkixocsp.cpp:470:3: warning: 'version' may be used uninitialized in this function [-Wmaybe-uninitialized]
37:00.65 /opt/FirefoxSource/mozilla-release/security/pkix/lib/pkixocsp.cpp:465:16: note: 'version' was declared here
37:00.68 AppData.o
37:00.69 FileUtils.o
37:01.02 nsArrayEnumerator.o
37:01.24 nsArrayUtils.o
37:01.57 nsCategoryCache.o
37:01.69 nsClassInfoImpl.o
37:02.18 nsCOMArray.o
37:02.31 nsComponentManagerUtils.o
37:02.82 nsCOMPtr.o
37:03.03 nsCRTGlue.o
37:03.20 nsCycleCollectionParticipant.o
37:03.36 nsDeque.o
37:03.97 nsEnumeratorUtils.o
37:04.07 testBindCallable.o
37:04.24 nsID.o
37:04.47 nsIInterfaceRequestorUtils.o
37:04.60 nsINIParser.o
37:04.74 nsISupportsImpl.o
37:04.82 testBug604087.o
37:05.17 nsMemory.o
37:05.27 nsQuickSort.o
37:05.66 nsTArray.o
37:05.83 nsTHashtable.o
37:06.00 nsThreadUtils.o
37:06.11 nsTObserverArray.o
37:06.45 nsVersionComparator.o
37:06.65 nsVoidArray.o
37:06.78 nsWeakReference.o
37:06.88 testCallNonGenericMethodOnProxy.o
37:07.16 pldhash.o
37:07.39 nsStringAPI.o
37:07.69 nsXPCOMGlue.o
37:08.81 TestCountZeroes.o
37:08.83 testChromeBuffer.o
37:08.92 TestEndian.o
37:08.93 GenericModule.o
37:08.93 nsStringAPI.o
37:08.96 testClassGetter.o
37:09.03 TestEnumSet.o
37:09.27 AppData.o
37:09.97 BlockingResourceBase.o
37:10.11 TestFloatingPoint.o
37:10.28 DeadlockDetector.o
37:10.39 FileUtils.o
37:10.40 TestIntegerPrintfMacros.o
37:10.56 GenericFactory.o
37:10.82 TestMacroArgs.o
37:10.85 nsArrayEnumerator.o
37:11.00 nsArrayUtils.o
37:11.19 testCloneScript.o
37:11.27 TestMacroForEach.o
37:11.30 nsCOMArray.o
37:11.33 TestPair.o
37:11.41 TestRollingMean.o
37:11.43 nsCOMPtr.o
37:11.53 TestSHA1.o
37:11.85 TestTypedEnum.o
37:11.85 testConservativeGC.o
37:11.94 TestTypeTraits.o
37:11.95 nsCRTGlue.o
37:12.13 nsCategoryCache.o
37:12.30 nsClassInfoImpl.o
37:12.83 nsComponentManagerUtils.o
37:12.96 nsCycleCollectionParticipant.o
37:13.18 nsDeque.o
37:13.59 testContexts.o
37:13.79 nsEnumeratorUtils.o
37:14.04 nsID.o
37:14.29 nsIInterfaceRequestorUtils.o
37:14.44 nsINIParser.o
37:14.58 nsISupportsImpl.o
37:14.99 nsMemory.o
37:15.13 nsProxyRelease.o
37:15.17 TestUniquePtr.o
37:15.31 TestWeakPtr.o
37:15.43 nsQuickSort.o
37:15.71 testCustomIterator.o
37:15.72 nsTArray.o
37:15.88 nsTHashtable.o
37:16.06 nsTObserverArray.o
37:16.13 nsTextFormatter.o
37:16.16 TestPoisonArea.o
37:16.30 nsThreadUtils.o
37:16.49 testDebugger.o
37:16.93 nsVersionComparator.o
37:17.35 nsVoidArray.o
37:17.45 nsWeakReference.o
37:17.55 pldhash.o
37:17.73 unused.o
37:17.94 testDeepFreeze.o
37:18.06 TestFileUtils.o
37:18.06 TestGCPostBarriers.o
37:19.26 testDefineGetterSetterNonEnumerable.o
37:21.22 testDefineProperty.o
37:21.26 xptcinvoke_arm.o
37:21.28 xptcstubs_arm.o
37:21.68 testEnclosingFunction.o
37:22.06 TestMinStringAPI.o
37:22.28 TestComponent.o
37:22.43 TestComponent.o
37:22.57 TestComponent.o
37:22.67 nsTestSample.o
37:22.73 nsCollationUnix.o
37:22.73 nsDateTimeFormatUnix.o
37:22.86 GreekCasing.o
37:22.87 IrishCasing.o
37:23.09 nsBidiUtils.o
37:23.16 nsPosixLocale.o
37:23.25 testErrorCopying.o
37:23.31 nsSpecialCasingData.o
37:23.52 nsUnicharUtils.o
37:23.62 nsAndroidCharset.o
37:23.62 nsUnicodeProperties.o
37:23.83 testException.o
37:24.18 StreamFunctions.o
37:24.18 ZipWriterModule.o
37:24.36 nsDeflateConverter.o
37:24.77 nsZipDataStream.o
37:24.94 nsRDFResource.o
37:25.03 nsZipHeader.o
37:25.33 testExternalStrings.o
37:25.41 WriteArgument.o
37:25.50 nsZipWriter.o
37:25.59 testFindSCCs.o
37:26.02 nsIconChannel.o
37:27.04 testFreshGlobalEvalRedefinition.o
37:27.37 testFuncCallback.o
37:27.73 nsIconModule.o
37:27.73 nsIconProtocolHandler.o
37:28.01 nsIconURI.o
37:29.03 testFunctionProperties.o
37:29.25 TestCodeGenBinding.o
37:29.25 TestDictionaryBinding.o
37:29.73 TestExampleGenBinding.o
37:30.58 testGCAllocator.o
37:31.25 TestJSImplGenBinding.o
37:31.30 TestJSImplInheritanceGenBinding.o
37:32.85 testGCExactRooting.o
37:36.25 testGCFinalizeCallback.o
37:37.81 testGCHeapPostBarriers.o
37:43.32 testGCOutOfMemory.o
37:43.38 testGCStoreBufferRemoval.o
37:45.60 testHashTable.o
37:45.65 testHashTableInit.o
37:50.78 testIndexToString.o
37:50.99 TestTypedefBinding.o
37:52.42 testIntString.o
37:54.42 testIntTypesABI.o
37:55.79 testIntern.o
37:56.56 testIsInsideNursery.o
37:57.67 ANPAudio.o
37:57.67 ANPBitmap.o
37:58.13 IndexedDBChild.o
37:58.14 IndexedDBParent.o
37:58.48 testJSEvaluateScript.o
37:59.57 ANPEvent.o
37:59.78 ANPLog.o
37:59.87 testJitFoldsTo.o
38:02.18 ANPMatrix.o
38:02.40 ANPNativeWindow.o
38:02.57 testJitMoveEmitterCycles.o
38:02.66 ANPOpenGL.o
38:04.68 ANPSurface.o
38:07.10 testJitRValueAlloc.o
38:07.13 ANPSystem.o
38:07.15 testLookup.o
38:07.41 ANPVideo.o
38:09.61 ANPWindow.o
38:09.61 In file included from ../../../dist/include/mozilla/dom/indexedDB/IndexedDatabase.h:14:0,
38:09.61                  from /opt/FirefoxSource/mozilla-release/dom/indexedDB/ipc/IndexedDBParent.h:11,
38:09.61                  from /opt/FirefoxSource/mozilla-release/dom/indexedDB/ipc/IndexedDBParent.cpp:6:
38:09.62 ../../../dist/include/nsAutoPtr.h: In member function 'nsresult mozilla::dom::indexedDB::IndexedDBDatabaseParent::HandleRequestEvent(nsIDOMEvent*, const nsAString_internal&)':
38:09.62 Warning: -Wmaybe-uninitialized in /opt/FirefoxSource/mozilla-release/objdir-droid/dist/include/nsAutoPtr.h: 'database' may be used uninitialized in this function
38:09.62 ../../../dist/include/nsAutoPtr.h:926:5: warning: 'database' may be used uninitialized in this function [-Wmaybe-uninitialized]
38:09.62 /opt/FirefoxSource/mozilla-release/dom/indexedDB/ipc/IndexedDBParent.cpp:417:16: note: 'database' was declared here
38:09.65 AndroidLocationProvider.o
38:09.65 nsHapticFeedback.o
38:10.02 testLooselyEqual.o
38:13.84 TestAudioChannelService.o
38:14.84 testMappedArrayBuffer.o
38:15.10 nptest.o
38:15.10 nptest_droid.o
38:15.34 nptest.o
38:15.34 nptest_droid.o
38:16.14 nptest_utils.o
38:16.53 MediaEncoder.o
38:16.53 OpusTrackEncoder.o
38:17.45 nptest_name.o
38:17.69 nptest_utils.o
38:17.90 TrackEncoder.o
38:18.10 nptest_name.o
38:18.55 GMPChild.o
38:18.55 GMPParent.o
38:19.95 testNewObject.o
38:20.17 MediaSource.o
38:20.17 MediaSourceDecoder.o
38:20.24 GMPPlatform.o
38:21.77 SourceBuffer.o
38:23.04 GMPProcessChild.o
38:23.90 SourceBufferList.o
38:23.91 GMPProcessParent.o
38:25.48 testNullRoot.o
38:25.55 GMPService.o
38:26.31 SourceBufferResource.o
38:26.64 GMPSharedMemManager.o
38:26.94 OggCodecState.o
38:26.94 OggDecoder.o
38:28.95 testOOM.o
38:29.03 GMPVideoDecoderChild.o
38:29.99 AnalyserNode.o
38:29.99 AudioBuffer.o
38:30.16 GMPVideoDecoderParent.o
38:30.78 testObjectEmulatingUndefined.o
38:31.65 GMPVideoEncodedFrameImpl.o
38:31.69 OggReader.o
38:32.33 testOps.o
38:32.96 AudioBufferSourceNode.o
38:33.35 GMPVideoEncoderChild.o
38:34.52 GMPVideoEncoderParent.o
38:34.57 testOriginPrincipals.o
38:35.09 OggWriter.o
38:35.78 AudioContext.o
38:35.99 GMPVideoHost.o
38:37.00 testParseJSON.o
38:37.88 GMPVideoPlaneImpl.o
38:38.98 AudioDestinationNode.o
38:39.00 GMPVideoi420FrameImpl.o
38:40.18 OpusParser.o
38:41.63 RawDecoder.o
38:41.63 RawReader.o
38:42.34 testPersistentRooted.o
38:42.78 WaveDecoder.o
38:42.78 WaveReader.o
38:43.83 AudioListener.o
38:46.12 testProfileStrings.o
38:46.18 testPropCache.o
38:46.88 AudioNode.o
38:47.09 AudioParam.o
38:48.84 testRegExp.o
38:49.07 AudioProcessingEvent.o
38:49.43 BiquadFilterNode.o
38:50.04 WebMBufferedParser.o
38:50.04 WebMDecoder.o
38:50.87 WebMReader.o
38:50.99 testResolveRecursion.o
38:51.82 ChannelMergerNode.o
38:51.90 AndroidMediaDecoder.o
38:51.90 AndroidMediaPluginHost.o
38:53.25 testSameValue.o
38:53.47 AndroidMediaReader.o
38:55.03 ChannelSplitterNode.o
38:56.52 testScriptInfo.o
38:56.90 testScriptObject.o
38:57.28 AndroidMediaResourceServer.o
38:57.74 ConvolverNode.o
38:58.25 MediaEngineDefault.o
38:58.25 PeerIdentity.o
38:59.20 testSetProperty.o
39:00.57 DelayBuffer.o
39:00.64 SpeechSynthesis.o
39:00.64 SpeechSynthesisUtterance.o
39:02.21 SpeechSynthesisVoice.o
39:03.91 DelayNode.o
39:03.91 testSetPropertyIgnoringNamedGetter.o
39:04.72 testSourcePolicy.o
39:05.47 SpeechSynthesisChild.o
39:06.41 SpeechSynthesisParent.o
39:07.16 DynamicsCompressorNode.o
39:07.60 testStringBuffer.o
39:08.71 nsSpeechTask.o
39:09.83 testStructuredClone.o
39:10.59 testSymbol.o
39:10.94 FFTBlock.o
39:12.16 nsSynthVoiceRegistry.o
39:12.83 SpeechGrammar.o
39:12.85 SpeechGrammarList.o
39:13.96 SpeechRecognition.o
39:14.65 SpeechRecognitionAlternative.o
39:14.80 GainNode.o
39:15.51 testToIntWidth.o
39:17.38 testTrap.o
39:18.92 MediaBufferDecoder.o
39:19.75 SpeechRecognitionResult.o
39:20.23 testTypedArrays.o
39:21.29 CDMProxy.o
39:21.30 EMELog.o
39:22.72 MediaElementAudioSourceNode.o
39:22.81 SpeechRecognitionResultList.o
39:23.77 testUTF8.o
39:24.08 MediaKeyError.o
39:24.23 MediaKeyMessageEvent.o
39:25.87 SpeechStreamListener.o
39:26.10 MediaKeyNeededEvent.o
39:26.64 /opt/FirefoxSource/mozilla-release/content/media/webaudio/MediaBufferDecoder.cpp: In member function 'void mozilla::WebAudioDecodeJob::OnFailure(mozilla::WebAudioDecodeJob::ErrorCode)':
39:26.64 Warning: -Wmaybe-uninitialized in /opt/FirefoxSource/mozilla-release/content/media/webaudio/MediaBufferDecoder.cpp: 'errorMessage' may be used uninitialized in this function
39:26.64 /opt/FirefoxSource/mozilla-release/content/media/webaudio/MediaBufferDecoder.cpp:583:48: warning: 'errorMessage' may be used uninitialized in this function [-Wmaybe-uninitialized]
39:26.66 MediaStreamAudioDestinationNode.o
39:27.65 MediaKeySession.o
39:29.13 endpointer.o
39:29.81 MediaStreamAudioSourceNode.o
39:30.07 testUncaughtError.o
39:31.00 MediaKeys.o
39:32.26 testWeakMap.o
39:32.41 energy_endpointer.o
39:33.45 energy_endpointer_params.o
39:34.41 FakeSpeechRecognitionService.o
39:34.51 testXDR.o
39:35.13 OfflineAudioCompletionEvent.o
39:36.18 tests.o
39:37.53 OscillatorNode.o
39:38.15 PannerNode.o
39:39.40 PeriodicWave.o
39:39.73 TestAudioCompactor.o
39:39.73 TestTrackEncoder.o
39:41.34 ScriptProcessorNode.o
39:42.32 TestVideoSegment.o
39:42.82 ThreeDPoint.o
39:44.88 TestAudioMixer.o
39:45.31 WaveShaperNode.o
39:45.37 TestTXMgr.o
39:45.69 WebAudioUtils.o
39:46.38 host_ListCSSProperties.o
39:47.30 nsTreeBodyFrame.o
39:47.31 nsTreeBoxObject.o
39:47.38 nsGrid.o
39:47.38 nsGridCell.o
39:48.52 nsGridLayout2.o
39:48.59 nsTreeColFrame.o
39:49.95 nsTreeColumns.o
39:50.62 nsGridRow.o
39:52.39 In file included from /opt/FirefoxSource/mozilla-release/layout/xul/tree/../nsBox.h:10:0,
39:52.39                  from /opt/FirefoxSource/mozilla-release/layout/xul/tree/../../generic/nsFrame.h:14,
39:52.39                  from /opt/FirefoxSource/mozilla-release/layout/xul/tree/../../generic/nsLeafFrame.h:12,
39:52.39                  from /opt/FirefoxSource/mozilla-release/layout/xul/tree/../nsLeafBoxFrame.h:9,
39:52.39                  from /opt/FirefoxSource/mozilla-release/layout/xul/tree/nsTreeBodyFrame.h:11,
39:52.39                  from /opt/FirefoxSource/mozilla-release/layout/xul/tree/nsTreeBoxObject.cpp:15:
39:52.39 /opt/FirefoxSource/mozilla-release/layout/xul/tree/../../generic/nsIFrame.h: In member function 'nsTreeBodyFrame* nsTreeBoxObject::GetTreeBody(bool)':
39:52.39 Warning: -Wmaybe-uninitialized in /opt/FirefoxSource/mozilla-release/layout/generic/nsIFrame.h: 'frame' may be used uninitialized in this function
39:52.39 /opt/FirefoxSource/mozilla-release/layout/xul/tree/../../generic/nsIFrame.h:487:43: warning: 'frame' may be used uninitialized in this function [-Wmaybe-uninitialized]
39:52.39 /opt/FirefoxSource/mozilla-release/layout/xul/tree/nsTreeBoxObject.cpp:87:13: note: 'frame' was declared here
39:52.39 nsTreeContentView.o
39:53.39 nsGridRowGroupFrame.o
39:53.63 nsTreeImageListener.o
39:55.28 /opt/FirefoxSource/mozilla-release/layout/xul/tree/nsTreeBodyFrame.cpp: In member function 'void nsTreeBodyFrame::PaintCell(int32_t, nsTreeColumn*, const nsRect&, nsPresContext*, nsRenderingContext&, const nsRect&, nscoord&, nsPoint)':
39:55.28 Warning: -Wmaybe-uninitialized in /opt/FirefoxSource/mozilla-release/layout/xul/tree/nsTreeBodyFrame.cpp: 'color' may be used uninitialized in this function
39:55.28 /opt/FirefoxSource/mozilla-release/layout/xul/tree/nsTreeBodyFrame.cpp:3209:40: warning: 'color' may be used uninitialized in this function [-Wmaybe-uninitialized]
39:55.29 nsTreeSelection.o
39:55.58 nsGridRowGroupLayout.o
39:56.17 nsTreeStyleCache.o
39:57.87 nsGridRowLayout.o
39:58.02 nsTreeUtils.o
39:58.40 nsGridRowLeafFrame.o
39:59.76 JSStreamWriterTest.o
39:59.76 LulTest.o
40:00.11 nsGridRowLeafLayout.o
40:00.24 jsctypes-test-errno.o
40:00.24 jsctypes-test-finalizer.o
40:00.33 jsctypes-test.o
40:01.13 TestStartupCache.o
40:01.56 ThreadProfileTest.o
40:02.03 StaticXULComponentsEnd.o
40:02.89 nssgtest.o
40:02.89 pkixbuild_tests.o
40:02.89 pkixtestutil.o
40:03.18 pkixcert_extension_tests.o
40:03.56 Biquad.o
40:03.56 DirectConvolver.o
40:03.91 DynamicsCompressor.o
40:04.11 DynamicsCompressorKernel.o
40:04.36 FFTConvolver.o
40:04.61 TestAudioEventTimeline.o
40:04.93 HRTFDatabase.o
40:05.16 pkixcert_signature_algorithm_tests.o
40:06.38 pkixcheck_CheckKeyUsage_tests.o
40:06.84 HRTFDatabaseLoader.o
40:06.95 HRTFElevation.o
40:07.55 HRTFKernel.o
40:08.86 pkixcheck_CheckValidity_tests.o
40:09.57 HRTFPanner.o
40:09.58 PeriodicWave.o
40:10.61 pkixder_input_tests.o
40:10.73 pkixder_pki_types_tests.o
40:12.18 Reverb.o
40:12.33 pkixder_universal_types_tests.o
40:12.40 ReverbAccumulationBuffer.o
40:14.89 ReverbConvolver.o
40:15.37 pkixocsp_CreateEncodedOCSPRequest_tests.o
40:15.40 ReverbConvolverStage.o
40:15.75 pkixocsp_VerifyEncodedOCSPResponse.o
40:17.48 ReverbInputBuffer.o
40:18.31 ZeroPole.o
40:25.04 libstlport_static.a
40:25.79 annotationProcessors.jar
40:27.47 Note: /opt/FirefoxSource/mozilla-release/build/annotationProcessors/utils/GeneratableElementIterator.java uses unchecked or unsafe operations.
40:27.47 Note: Recompile with -Xlint:unchecked for details.
40:28.07 libmfbt.a.desc
40:28.20 TestArrayUtils
40:28.20 TestAtomics
40:28.20 TestBinarySearch
40:28.21 TestBloomFilter
40:28.21 TestCasting
40:28.59 TestCeilingFloor
40:28.59 TestCheckedInt
40:28.59 TestCountPopulation
40:28.60 TestCountZeroes
40:28.71 TestEndian
40:28.71 TestEnumSet
40:28.71 TestFloatingPoint
40:28.72 TestIntegerPrintfMacros
40:28.83 TestMacroArgs
40:28.83 TestMacroForEach
40:28.83 TestPair
40:28.87 TestRollingMean
40:28.95 TestSHA1
40:28.96 TestTypedEnum
40:28.96 TestTypeTraits
40:29.04 TestUniquePtr
40:29.08 TestWeakPtr
40:29.09 TestPoisonArea
40:29.62 libother-licenses_android.a.desc
40:29.71 libjemalloc.a.desc
40:29.78 libmemory.a.desc
40:30.04 liblinker.a.desc
40:30.05 szip
40:30.30 libmozglue_android.a.desc
40:30.41 libmozglue.so
40:30.87 TestZip
40:30.99 libmozalloc.so
40:31.67 libmozsqlite3.a.desc
40:31.76 libmedia_libjpeg.a.desc
40:31.85 libmedia_libtremor_lib.a.desc
40:32.04 libmedia_libopus.a.desc
40:32.21 libmedia_libnestegg_src.a.desc
40:32.46 libmedia_libvpx.a.desc
40:32.68 libmozpng.a.desc
40:32.78 libmedia_kiss_fft.a.desc
40:32.87 libcubeb.a.desc
40:32.95 libmedia_libogg.a.desc
40:33.07 libmedia_libtheora_lib.a.desc
40:33.14 libspeex.a.desc
40:33.33 libmedia_libstagefright.a.desc
40:33.45 libmedia_libsoundtouch_src.a.desc
40:33.64 /opt/FirefoxSource/mozilla-release/security/build/nss.def: WARNING: no preprocessor directives found
40:33.69 /opt/FirefoxSource/mozilla-release/security/build/nspr-dummy.def: WARNING: no preprocessor directives found
40:33.90 quickder.c: In function 'DecodeItem':
40:33.90 quickder.c:611:12: warning: variable 'optional' set but not used [-Wunused-but-set-variable]
40:33.92 sechash.c: In function 'HASH_ResultLen':
40:33.92 sechash.c:263:5: warning: comparison of unsigned expression < 0 is always false [-Wtype-limits]
40:33.92 sechash.c: In function 'HASH_HashBuf':
40:33.92 sechash.c:288:5: warning: comparison of unsigned expression < 0 is always false [-Wtype-limits]
40:33.92 sechash.c: In function 'HASH_Create':
40:33.92 sechash.c:310:5: warning: comparison of unsigned expression < 0 is always false [-Wtype-limits]
40:34.11 derenc.c: In function 'der_encode':
40:34.11 derenc.c:282:22: warning: variable 'optional' set but not used [-Wunused-but-set-variable]
40:35.08 ocsp.c: In function 'ocsp_RemoveCacheItem':
40:35.08 ocsp.c:562:12: warning: variable 'couldRemoveFromHashTable' set but not used [-Wunused-but-set-variable]
40:35.41 nssb64e.c: In function 'NSSBase64_EncodeItem_Util':
40:35.41 nssb64e.c:684:15: warning: 'out_len' may be used uninitialized in this function [-Wmaybe-uninitialized]
40:35.58 certhigh.c: In function 'CERT_MatchNickname':
40:35.58 certhigh.c:28:9: warning: variable 'len' set but not used [-Wunused-but-set-variable]
40:35.67 pk11akey.c: In function 'pk11_get_Decoded_ECPoint':
40:35.67 pk11akey.c:406:26: warning: comparison between signed and unsigned integer expressions [-Wsign-compare]
40:35.67 pk11akey.c:420:63: warning: comparison between signed and unsigned integer expressions [-Wsign-compare]
40:35.69 alg1485.c: In function 'cert_AVAOidTagToMaxLen':
40:35.69 alg1485.c:162:57: warning: signed and unsigned type in conditional expression [-Wsign-compare]
40:35.69 alg1485.c: In function 'AppendAVA':
40:35.69 alg1485.c:963:40: warning: signed and unsigned type in conditional expression [-Wsign-compare]
40:36.42 certdb.c: In function 'cert_VerifySubjectAltName':
40:36.42 certdb.c:1428:18: warning: variable 'hnLen' set but not used [-Wunused-but-set-variable]
40:36.42 certdb.c: In function 'CERT_ImportCerts':
40:36.42 certdb.c:2440:15: warning: variable 'rv' set but not used [-Wunused-but-set-variable]
40:36.42 certdb.c: In function 'CERT_UnlockCertRefCount':
40:36.42 certdb.c:2890:14: warning: variable 'prstat' set but not used [-Wunused-but-set-variable]
40:36.42 certdb.c: In function 'CERT_UnlockCertTrust':
40:36.42 certdb.c:2970:14: warning: variable 'prstat' set but not used [-Wunused-but-set-variable]
40:36.71 pk11cert.c: In function 'pk11_fastCert':
40:36.71 pk11cert.c:231:14: warning: variable 'status' set but not used [-Wunused-but-set-variable]
40:36.71 pk11cert.c: In function 'PK11_MakeCertFromHandle':
40:36.71 pk11cert.c:297:12: warning: variable 'swapNickname' set but not used [-Wunused-but-set-variable]
40:36.71 pk11cert.c:296:12: warning: variable 'isFortezzaRootCA' set but not used [-Wunused-but-set-variable]
40:36.71 pk11cert.c: In function 'PK11_TraverseCertsForNicknameInSlot':
40:36.71 pk11cert.c:2012:28: warning: variable 'pk11cb' set but not used [-Wunused-but-set-variable]
40:36.71 pk11cert.c: In function 'PK11_FindCertFromDERCertItem':
40:36.71 pk11cert.c:2156:21: warning: unused variable 'td' [-Wunused-variable]
40:37.09 certvfypkix.c: In function 'setRevocationMethod':
40:37.09 certvfypkix.c:1422:17: warning: comparison between signed and unsigned integer expressions [-Wsign-compare]
40:37.47 crl.c: In function 'crl_storeCRL':
40:37.47 crl.c:630:15: warning: variable 'rv' set but not used [-Wunused-but-set-variable]
40:37.47 crl.c: In function 'cert_CheckCertRevocationStatus':
40:37.47 crl.c:2688:27: warning: unused variable 'rv2' [-Wunused-variable]
40:37.47 crl.c: In function 'cert_CacheCRLByGeneralName':
40:37.47 crl.c:3045:32: warning: variable 'rv2' set but not used [-Wunused-but-set-variable]
40:37.47 secoid.c: In function 'SECOID_Init':
40:37.47 secoid.c:1922:19: warning: variable 'c' set but not used [-Wunused-but-set-variable]
40:37.81 certificate.c: In function 'nssCertificateList_DoCallback':
40:37.81 certificate.c:898:14: warning: variable 'nssrv' set but not used [-Wunused-but-set-variable]
40:38.30 utilmod.c: In function 'nssutil_DeleteSecmodDBEntry.isra.1':
40:38.30 utilmod.c:545:12: warning: 'lib_len' may be used uninitialized in this function [-Wmaybe-uninitialized]
40:38.56 trustdomain.c: In function 'NSSTrustDomain_TraverseCertificates':
40:38.56 trustdomain.c:998:14: warning: variable 'status' set but not used [-Wunused-but-set-variable]
40:38.70 utilpars.c: In function 'nssutil_mkSlotFlags':
40:38.70 utilpars.c:679:17: warning: comparison between signed and unsigned integer expressions [-Wsign-compare]
40:38.70 utilpars.c: In function 'nssutil_mkCipherFlags':
40:38.70 utilpars.c:891:17: warning: comparison between signed and unsigned integer expressions [-Wsign-compare]
40:38.70 utilpars.c:910:17: warning: comparison between signed and unsigned integer expressions [-Wsign-compare]
40:38.74 In file included from pk11load.c:26:0:
40:38.74 debug_module.c: In function 'log_handle':
40:38.74 debug_module.c:339:28: warning: comparison between signed and unsigned integer expressions [-Wsign-compare]
40:38.74 debug_module.c:343:28: warning: comparison between signed and unsigned integer expressions [-Wsign-compare]
40:38.74 pk11load.c: In function 'SECMOD_UnloadModule':
40:38.74 pk11load.c:592:28: warning: unused variable 'status' [-Wunused-variable]
40:38.87 tdcache.c: In function 'add_cert_to_cache':
40:38.87 tdcache.c:773:9: warning: variable 'handle' set but not used [-Wunused-but-set-variable]
40:38.87 tdcache.c: In function 'nssTrustDomain_RemoveCertFromCacheLOCKED':
40:38.87 tdcache.c:272:16: warning: 'nickname' may be used uninitialized in this function [-Wmaybe-uninitialized]
40:38.87 tdcache.c:332:14: note: 'nickname' was declared here
40:39.16 pk11merge.c: In function 'pk11_matchAcrossTokens':
40:39.16 pk11merge.c:100:32: warning: comparison between signed and unsigned integer expressions [-Wsign-compare]
40:39.63 pkibase.c: In function 'nssPKIObjectCollection_Traverse':
40:39.63 pkibase.c:906:14: warning: variable 'status' set but not used [-Wunused-but-set-variable]
40:39.63 pkibase.c: In function 'nssCertificateCollection_Create':
40:39.63 pkibase.c:1060:14: warning: variable 'status' set but not used [-Wunused-but-set-variable]
40:39.63 pkibase.c: In function 'nssCRLCollection_Create':
40:39.63 pkibase.c:1167:14: warning: variable 'status' set but not used [-Wunused-but-set-variable]
40:39.85 devtoken.c: In function 'nssToken_TraverseCertificates':
40:39.85 devtoken.c:1469:14: warning: variable 'status' set but not used [-Wunused-but-set-variable]
40:40.09 pki3hack.c: In function 'DeleteCertTrustMatchingSlot':
40:40.09 pki3hack.c:1275:27: warning: comparison between signed and unsigned integer expressions [-Wsign-compare]
40:40.09 pki3hack.c: In function 'STAN_DeleteCertTrustMatchingSlot':
40:40.09 pki3hack.c:1333:19: warning: comparison between signed and unsigned integer expressions [-Wsign-compare]
40:40.12 list.c: In function 'nssList_Add':
40:40.12 list.c:220:14: warning: variable 'nssrv' set but not used [-Wunused-but-set-variable]
40:40.15 pk11obj.c: In function 'PK11_MatchItem':
40:40.15 pk11obj.c:1799:72: warning: comparison between signed and unsigned integer expressions [-Wsign-compare]
40:40.15 pk11obj.c:1784:22: warning: variable 'parent' set but not used [-Wunused-but-set-variable]
40:40.39 ckhelper.c: In function 'nssCKObject_GetAttributes':
40:40.39 ckhelper.c:139:36: warning: comparison between signed and unsigned integer expressions [-Wsign-compare]
40:40.39 ckhelper.c: In function 'nssCryptokiTrust_GetAttributes':
40:40.39 ckhelper.c:442:36: warning: comparison between signed and unsigned integer expressions [-Wsign-compare]
40:40.55 pk11pars.c: In function 'secmod_ParseModuleSpecForTokens':
40:40.55 pk11pars.c:364:47: warning: suggest braces around empty body in an 'else' statement [-Wempty-body]
40:40.55 pk11pars.c:366:47: warning: suggest braces around empty body in an 'else' statement [-Wempty-body]
40:40.55 pk11pars.c:375:6: warning: suggest braces around empty body in an 'else' statement [-Wempty-body]
40:40.55 pk11pars.c:384:7: warning: suggest braces around empty body in an 'else' statement [-Wempty-body]
40:40.55 pk11pars.c:393:7: warning: suggest braces around empty body in an 'else' statement [-Wempty-body]
40:40.55 pk11pars.c:402:7: warning: suggest braces around empty body in an 'else' statement [-Wempty-body]
40:40.55 pk11pars.c: In function 'secmod_MkAppendTokensList':
40:40.55 pk11pars.c:767:13: warning: comparison between signed and unsigned integer expressions [-Wsign-compare]
40:40.55 pk11pars.c:804:13: warning: comparison between signed and unsigned integer expressions [-Wsign-compare]
40:41.09 pk11pk12.c: In function 'PK11_ImportPrivateKeyInfoAndReturnKey':
40:41.09 pk11pk12.c:425:17: warning: variable 'keyType' set but not used [-Wunused-but-set-variable]
40:41.30 pk11pqg.c: In function 'PK11_PQG_ParamGenSeedLen':
40:41.30 pk11pqg.c:230:56: warning: signed and unsigned type in conditional expression [-Wsign-compare]
40:41.30 pk11pqg.c: In function 'PK11_PQG_ParamGen':
40:41.30 pk11pqg.c:241:56: warning: signed and unsigned type in conditional expression [-Wsign-compare]
40:41.30 pk11pqg.c: In function 'PK11_PQG_VerifyParams':
40:41.30 pk11pqg.c:295:19: warning: comparison between signed and unsigned integer expressions [-Wsign-compare]
40:42.13 pk11skey.c: In function 'pk11_TokenKeyGenWithFlagsAndKeyType':
40:42.13 pk11skey.c:926:17: warning: comparison between signed and unsigned integer expressions [-Wsign-compare]
40:42.13 pk11skey.c: In function 'pk11_HandUnwrap':
40:42.13 pk11skey.c:2296:40: warning: signed and unsigned type in conditional expression [-Wsign-compare]
40:42.16 pk11slot.c: In function 'PK11_InitToken':
40:42.16 pk11slot.c:1108:11: warning: variable 'tmp' set but not used [-Wunused-but-set-variable]
40:42.16 pk11slot.c: In function 'PK11_InitSlot':
40:42.16 pk11slot.c:1352:11: warning: variable 'tmp' set but not used [-Wunused-but-set-variable]
40:42.16 pk11slot.c: In function 'PK11_GetBestSlotMultipleWithAttributes':
40:42.16 pk11slot.c:2076:17: warning: comparison between signed and unsigned integer expressions [-Wsign-compare]
40:42.16 pk11slot.c:2094:18: warning: comparison between signed and unsigned integer expressions [-Wsign-compare]
40:42.16 pk11slot.c: In function 'PK11_ResetToken':
40:42.16 pk11slot.c:2317:22: warning: comparison between signed and unsigned integer expressions [-Wsign-compare]
40:42.16 pk11slot.c:2322:22: warning: comparison between signed and unsigned integer expressions [-Wsign-compare]
40:42.20 pkix_revocationchecker.c: In function 'PKIX_RevocationChecker_Check':
40:42.20 pkix_revocationchecker.c:347:25: warning: comparison between signed and unsigned integer expressions [-Wsign-compare]
40:42.65 pk11util.c: In function 'SECMOD_UpdateSlotList':
40:42.65 pk11util.c:931:15: warning: comparison between signed and unsigned integer expressions [-Wsign-compare]
40:43.35 pkix_tools.c: In function 'pkix_i2hex':
40:43.35 pkix_tools.c:482:9: warning: comparison is always true due to limited range of data type [-Wtype-limits]
40:44.18 pkix_errpaths.c: In function 'PKIX_DoReturn':
40:44.18 pkix_errpaths.c:58:2: warning: suggest braces around empty body in an 'if' statement [-Wempty-body]
40:44.90 pkix_build.c: In function 'pkix_Build_SelectCertsFromTrustAnchors':
40:44.90 pkix_build.c:1541:38: warning: comparison between signed and unsigned integer expressions [-Wsign-compare]
40:45.65 pkix_pl_crl.c: In function 'pkix_pl_CRL_ToString':
40:45.65 pkix_pl_crl.c:455:58: warning: 'crlVersion' may be used uninitialized in this function [-Wmaybe-uninitialized]
40:45.65 pkix_pl_crl.c:354:21: note: 'crlVersion' was declared here
40:45.96 pkix_pl_lifecycle.c: In function 'pkix_pl_lifecycle_ObjectLeakCheck':
40:45.96 pkix_pl_lifecycle.c:87:55: warning: comparison between signed and unsigned integer expressions [-Wsign-compare]
40:45.96 pkix_pl_lifecycle.c: In function 'PKIX_PL_Shutdown':
40:45.96 pkix_pl_lifecycle.c:248:21: warning: variable 'numLeakedObjects' set but not used [-Wunused-but-set-variable]
40:46.00 pkix_pl_cert.c: In function 'PKIX_PL_Cert_Create':
40:46.00 pkix_pl_cert.c:1518:22: warning: variable 'copyDER' set but not used [-Wunused-but-set-variable]
40:46.50 nssinit.c: In function 'NSS_VersionCheck':
40:46.50 nssinit.c:1250:19: warning: variable 'c' set but not used [-Wunused-but-set-variable]
40:46.99 pkix_pl_object.c: In function 'pkix_pl_Object_GetHeader':
40:46.99 pkix_pl_object.c:115:34: warning: comparison between signed and unsigned integer expressions [-Wsign-compare]
40:47.76 dtlscon.c: In function 'ssl3_DisableNonDTLSSuites':
40:47.76 dtlscon.c:107:19: warning: unused variable 'rv' [-Wunused-variable]
40:47.76 dtlscon.c: In function 'dtls_HandleHandshake':
40:47.76 dtlscon.c:399:37: warning: comparison between signed and unsigned integer expressions [-Wsign-compare]
40:47.76 dtlscon.c:428:48: warning: comparison between signed and unsigned integer expressions [-Wsign-compare]
40:47.76 dtlscon.c: In function 'dtls_TransmitMessageFlight':
40:47.77 dtlscon.c:679:60: warning: comparison between signed and unsigned integer expressions [-Wsign-compare]
40:47.77 dtlscon.c:679:120: warning: signed and unsigned type in conditional expression [-Wsign-compare]
40:47.77 dtlscon.c:717:26: warning: comparison between signed and unsigned integer expressions [-Wsign-compare]
40:47.77 dtlscon.c: In function 'dtls_SetMTU':
40:47.77 dtlscon.c:952:19: warning: comparison between signed and unsigned integer expressions [-Wsign-compare]
40:47.97 pkix_pl_httpdefaultclient.c: In function 'pkix_pl_HttpDefaultClient_HdrCheckComplete':
40:47.97 pkix_pl_httpdefaultclient.c:268:32: warning: comparison between signed and unsigned integer expressions [-Wsign-compare]
40:47.97 pkix_pl_httpdefaultclient.c:285:41: warning: comparison between signed and unsigned integer expressions [-Wsign-compare]
40:47.97 pkix_pl_httpdefaultclient.c:293:40: warning: comparison between signed and unsigned integer expressions [-Wsign-compare]
40:47.97 pkix_pl_httpdefaultclient.c: In function 'pkix_pl_HttpDefaultClient_RecvBody':
40:47.97 pkix_pl_httpdefaultclient.c:925:39: warning: comparison between signed and unsigned integer expressions [-Wsign-compare]
40:47.97 pkix_pl_httpdefaultclient.c:940:31: warning: comparison between signed and unsigned integer expressions [-Wsign-compare]
40:47.97 pkix_pl_httpdefaultclient.c:945:31: warning: comparison between signed and unsigned integer expressions [-Wsign-compare]
40:47.97 pkix_pl_httpdefaultclient.c:951:38: warning: comparison between signed and unsigned integer expressions [-Wsign-compare]
40:47.97 pkix_pl_httpdefaultclient.c:995:39: warning: comparison between signed and unsigned integer expressions [-Wsign-compare]
40:47.97 pkix_pl_httpdefaultclient.c:1005:43: warning: comparison between signed and unsigned integer expressions [-Wsign-compare]
40:47.97 pkix_pl_httpdefaultclient.c: In function 'pkix_pl_HttpDefaultClient_KeepAliveSession':
40:47.97 pkix_pl_httpdefaultclient.c:1135:36: warning: variable 'client' set but not used [-Wunused-but-set-variable]
40:47.97 pkix_pl_httpdefaultclient.c: In function 'pkix_pl_HttpDefaultClient_TrySendAndReceive':
40:47.97 pkix_pl_httpdefaultclient.c:1429:63: warning: comparison between signed and unsigned integer expressions [-Wsign-compare]
40:47.97 pkix_pl_httpdefaultclient.c: In function 'pkix_pl_HttpDefaultClient_Cancel':
40:47.97 pkix_pl_httpdefaultclient.c:1487:36: warning: variable 'client' set but not used [-Wunused-but-set-variable]
40:48.23 pkix_pl_publickey.c: In function 'pkix_pl_PublicKey_Hashcode':
40:48.23 pkix_pl_publickey.c:214:21: warning: variable 'fullHash' set but not used [-Wunused-but-set-variable]
40:48.26 pkix_pl_x500name.c:37:1: warning: 'pkix_pl_X500Name_ToString_Helper' defined but not used [-Wunused-function]
40:48.70 ssl3gthr.c: In function 'ssl3_GatherData':
40:48.70 ssl3gthr.c:75:9: warning: comparison between signed and unsigned integer expressions [-Wsign-compare]
40:48.83 pkix_pl_ldaprequest.c: In function 'pkix_pl_LdapRequest_Destroy':
40:48.83 pkix_pl_ldaprequest.c:266:30: warning: variable 'ldapRq' set but not used [-Wunused-but-set-variable]
40:49.15 sslauth.c: In function 'SSL_AuthCertificate':
40:49.15 sslauth.c:267:18: warning: unused variable 'error' [-Wunused-variable]
40:49.55 pkix_pl_ldapdefaultclient.c: In function 'pkix_pl_LdapDefaultClient_VerifyBindResponse':
40:49.55 pkix_pl_ldapdefaultclient.c:371:21: warning: '*((void *)&msg+16).resultCode.data' may be used uninitialized in this function [-Wmaybe-uninitialized]
40:49.55 pkix_pl_ldapdefaultclient.c:354:21: note: '*((void *)&msg+16).resultCode.data' was declared here
40:49.61 p12e.c: In function 'sec_PKCS12CreateSafeBag':
40:49.61 p12e.c:698:12: warning: variable 'setName' set but not used [-Wunused-but-set-variable]
40:49.61 p12e.c: In function 'sec_pkcs12_encoder_start_context':
40:49.61 p12e.c:1535:12: warning: variable 'rv' set but not used [-Wunused-but-set-variable]
40:49.94 sslcon.c: In function 'ssl2_SendClear':
40:49.94 sslcon.c:865:17: warning: comparison between signed and unsigned integer expressions [-Wsign-compare]
40:49.94 sslcon.c:894:19: warning: comparison between signed and unsigned integer expressions [-Wsign-compare]
40:49.94 sslcon.c: In function 'ssl2_SendStream':
40:49.94 sslcon.c:944:13: warning: comparison between signed and unsigned integer expressions [-Wsign-compare]
40:49.94 sslcon.c:991:19: warning: comparison between signed and unsigned integer expressions [-Wsign-compare]
40:49.94 sslcon.c: In function 'ssl2_SendBlock':
40:49.94 sslcon.c:1058:13: warning: comparison between signed and unsigned integer expressions [-Wsign-compare]
40:49.94 sslcon.c: In function 'ssl2_ServerSetupSessionCypher':
40:49.94 sslcon.c:1624:15: warning: comparison between signed and unsigned integer expressions [-Wsign-compare]
40:49.94 sslcon.c:1648:20: warning: comparison between signed and unsigned integer expressions [-Wsign-compare]
40:49.94 sslcon.c: In function 'ssl2_HandleMessage':
40:49.94 sslcon.c:2498:9: warning: variable 'rv2' set but not used [-Wunused-but-set-variable]
40:49.94 sslcon.c: In function 'ssl2_HandleServerHelloMessage':
40:49.94 sslcon.c:2802:51: warning: comparison between signed and unsigned integer expressions [-Wsign-compare]
40:49.94 sslcon.c:2813:16: warning: comparison between signed and unsigned integer expressions [-Wsign-compare]
40:49.94 sslcon.c:2815:23: warning: comparison between signed and unsigned integer expressions [-Wsign-compare]
40:49.94 sslcon.c:2815:65: warning: signed and unsigned type in conditional expression [-Wsign-compare]
40:49.94 sslcon.c: In function 'NSSSSL_VersionCheck':
40:49.94 sslcon.c:3687:19: warning: variable 'c' set but not used [-Wunused-but-set-variable]
40:50.37 pkix_pl_pk11certstore.c: In function 'NameCacheHasFetchedCrlInfo':
40:50.37 pkix_pl_pk11certstore.c:382:22: warning: variable 'cert' set but not used [-Wunused-but-set-variable]
40:50.37 pkix_pl_pk11certstore.c: In function 'RemovePartitionedDpsFromList':
40:50.37 pkix_pl_pk11certstore.c:701:20: warning: comparison between signed and unsigned integer expressions [-Wsign-compare]
40:50.37 pkix_pl_pk11certstore.c: In function 'DownloadCrl':
40:50.37 pkix_pl_pk11certstore.c:782:16: warning: variable 'savedError' set but not used [-Wunused-but-set-variable]
40:50.43 ssl3con.c: In function 'ssl3_CompressMACEncryptRecord':
40:50.43 ssl3con.c:2559:12: warning: comparison between signed and unsigned integer expressions [-Wsign-compare]
40:50.43 ssl3con.c: In function 'ssl3_FlushHandshakeMessages':
40:50.43 ssl3con.c:3122:19: warning: comparison between signed and unsigned integer expressions [-Wsign-compare]
40:50.43 ssl3con.c: In function 'ssl3_HandleClientHello':
40:50.43 ssl3con.c:7782:23: warning: comparison between signed and unsigned integer expressions [-Wsign-compare]
40:50.43 ssl3con.c:8286:28: warning: comparison between signed and unsigned integer expressions [-Wsign-compare]
40:50.43 ssl3con.c: In function 'ssl3_HandleRSAClientKeyExchange':
40:50.43 ssl3con.c:9211:13: warning: variable 'pmsItem' set but not used [-Wunused-but-set-variable]
40:50.43 ssl3con.c:9207:12: warning: variable 'isTLS' set but not used [-Wunused-but-set-variable]
40:50.43 ssl3con.c: In function 'ssl3_HandleCertificateStatus':
40:50.43 ssl3con.c:9779:13: warning: comparison between signed and unsigned integer expressions [-Wsign-compare]
40:50.43 ssl3con.c: In function 'ssl3_HandleHandshakeMessage':
40:50.43 ssl3con.c:6951:22: warning: 'preferSha1' may be used uninitialized in this function [-Wmaybe-uninitialized]
40:50.43 ssl3con.c:6917:12: note: 'preferSha1' was declared here
40:50.43 ssl3con.c: In function 'ssl3_HandleRecord':
40:50.43 ssl3con.c:11589:21: warning: 'dtls_seq_num' may be used uninitialized in this function [-Wmaybe-uninitialized]
40:50.43 ssl3con.c:11309:14: note: 'dtls_seq_num' was declared here
40:50.56 certread.c: In function 'CERT_DecodeCertPackage':
40:50.57 certread.c:419:16: warning: comparison between signed and unsigned integer expressions [-Wsign-compare]
40:50.57 certread.c:447:13: warning: comparison between signed and unsigned integer expressions [-Wsign-compare]
40:51.17 cmscipher.c: In function 'NSS_CMSCipherContext_Decrypt':
40:51.17 cmscipher.c:525:28: warning: comparison between signed and unsigned integer expressions [-Wsign-compare]
40:51.26 crmfpop.c: In function 'CRMF_CertReqMsgSetRAVerifiedPOP':
40:51.26 crmfpop.c:36:14: warning: variable 'dummy' set but not used [-Wunused-but-set-variable]
40:51.26 crmfpop.c: In function 'crmf_generic_encoder_callback':
40:51.26 crmfpop.c:119:38: warning: comparison between signed and unsigned integer expressions [-Wsign-compare]
40:51.26 crmfpop.c: In function 'crmf_encode_popoprivkey':
40:51.26 crmfpop.c:349:33: warning: comparison between signed and unsigned integer expressions [-Wsign-compare]
40:51.43 p7decode.c: In function 'sec_pkcs7_verify_signature':
40:51.43 p7decode.c:1293:21: warning: variable 'crls' set but not used [-Wunused-but-set-variable]
40:51.50 ssl3ext.c: In function 'arrayContainsExtension':
40:51.50 ssl3ext.c:310:19: warning: comparison between signed and unsigned integer expressions [-Wsign-compare]
40:51.50 ssl3ext.c: In function 'ssl3_HandleServerNameXtn':
40:51.50 ssl3ext.c:417:43: warning: comparison between signed and unsigned integer expressions [-Wsign-compare]
40:51.50 ssl3ext.c:425:17: warning: variable 'type' set but not used [-Wunused-but-set-variable]
40:51.50 ssl3ext.c:457:22: warning: comparison between signed and unsigned integer expressions [-Wsign-compare]
40:51.50 ssl3ext.c:458:31: warning: comparison between signed and unsigned integer expressions [-Wsign-compare]
40:51.50 ssl3ext.c: In function 'ssl3_SendSessionTicketXtn':
40:51.50 ssl3ext.c:538:28: warning: comparison between signed and unsigned integer expressions [-Wsign-compare]
40:51.50 ssl3ext.c:561:25: warning: comparison between signed and unsigned integer expressions [-Wsign-compare]
40:51.50 ssl3ext.c: In function 'ssl3_ServerHandleAppProtoXtn':
40:51.50 ssl3ext.c:681:15: warning: comparison between signed and unsigned integer expressions [-Wsign-compare]
40:51.50 ssl3ext.c: In function 'ssl3_ClientSendNextProtoNegoXtn':
40:51.50 ssl3ext.c:782:28: warning: comparison between signed and unsigned integer expressions [-Wsign-compare]
40:51.50 ssl3ext.c:792:25: warning: comparison between signed and unsigned integer expressions [-Wsign-compare]
40:51.50 ssl3ext.c: In function 'ssl3_ClientSendAppProtoXtn':
40:51.50 ssl3ext.c:817:28: warning: comparison between signed and unsigned integer expressions [-Wsign-compare]
40:51.50 ssl3ext.c:857:25: warning: comparison between signed and unsigned integer expressions [-Wsign-compare]
40:51.50 ssl3ext.c: In function 'ssl3_ServerSendAppProtoXtn':
40:51.50 ssl3ext.c:886:28: warning: comparison between signed and unsigned integer expressions [-Wsign-compare]
40:51.50 ssl3ext.c:905:25: warning: comparison between signed and unsigned integer expressions [-Wsign-compare]
40:51.50 ssl3ext.c: In function 'ssl3_ServerSendStatusRequestXtn':
40:51.50 ssl3ext.c:952:28: warning: comparison between signed and unsigned integer expressions [-Wsign-compare]
40:51.50 ssl3ext.c: In function 'ssl3_ClientSendStatusRequestXtn':
40:51.50 ssl3ext.c:985:28: warning: comparison between signed and unsigned integer expressions [-Wsign-compare]
40:51.50 ssl3ext.c:1013:25: warning: comparison between signed and unsigned integer expressions [-Wsign-compare]
40:51.50 ssl3ext.c: In function 'ssl3_SendNewSessionTicket':
40:51.50 ssl3ext.c:1249:19: warning: comparison between signed and unsigned integer expressions [-Wsign-compare]
40:51.50 ssl3ext.c: In function 'ssl3_ServerHandleSessionTicketXtn':
40:51.50 ssl3ext.c:1587:23: warning: comparison between signed and unsigned integer expressions [-Wsign-compare]
40:51.50 ssl3ext.c: In function 'ssl3_SendRenegotiationInfoXtn':
40:51.50 ssl3ext.c:1981:28: warning: comparison between signed and unsigned integer expressions [-Wsign-compare]
40:51.50 ssl3ext.c: In function 'ssl3_ClientSendSigAlgsXtn':
40:51.50 ssl3ext.c:2355:28: warning: comparison between signed and unsigned integer expressions [-Wsign-compare]
40:51.50 ssl3ext.c:2369:25: warning: comparison between signed and unsigned integer expressions [-Wsign-compare]
40:51.50 ssl3ext.c: In function 'ssl3_ClientSendDraftVersionXtn':
40:51.50 ssl3ext.c:2445:28: warning: comparison between signed and unsigned integer expressions [-Wsign-compare]
40:51.50 ssl3ext.c:2458:25: warning: comparison between signed and unsigned integer expressions [-Wsign-compare]
40:51.71 p7encode.c: In function 'sec_pkcs7_encoder_start_encrypt':
40:51.71 p7encode.c:62:18: warning: variable 'wincx' set but not used [-Wunused-but-set-variable]
40:51.90 crmfcont.c: In function 'CRMF_CreateEncryptedKeyWithEncryptedValue':
40:51.90 crmfcont.c:860:25: warning: variable 'dummy' set but not used [-Wunused-but-set-variable]
40:51.96 cmsencode.c: In function 'nss_cms_encoder_notify':
40:51.96 cmsencode.c:125:18: warning: variable 'poolp' set but not used [-Wunused-but-set-variable]
40:51.96 cmsencode.c: In function 'nss_cms_before_data':
40:51.96 cmsencode.c:204:18: warning: variable 'poolp' set but not used [-Wunused-but-set-variable]
40:51.97 p7local.c: In function 'sec_PKCS7Decrypt':
40:51.97 p7local.c:556:28: warning: comparison between signed and unsigned integer expressions [-Wsign-compare]
40:52.51 cmmfchal.c: In function 'cmmf_create_witness_and_challenge':
40:52.51 cmmfchal.c:33:22: warning: variable 'id' set but not used [-Wunused-but-set-variable]
40:52.60 cmsrecinfo.c: In function 'NSS_CMSRecipientInfo_UnwrapBulkKey':
40:52.60 cmsrecinfo.c:529:21: warning: variable 'encalg' set but not used [-Wunused-but-set-variable]
40:52.62 sslsecur.c: In function 'SSL_ConfigSecureServerWithCertChain':
40:52.62 sslsecur.c:847:5: warning: comparison of unsigned expression < 0 is always false [-Wtype-limits]
40:52.62 sslsecur.c: In function 'ssl_SecureRecv':
40:52.62 sslsecur.c:1180:22: warning: variable 'sec' set but not used [-Wunused-but-set-variable]
40:52.94 basicutil.c: In function 'SECU_PrintPRandOSError':
40:52.94 basicutil.c:628:30: warning: comparison between signed and unsigned integer expressions [-Wsign-compare]
40:52.94 basicutil.c:632:30: warning: comparison between signed and unsigned integer expressions [-Wsign-compare]
40:52.94 basicutil.c: In function 'SECU_SECItemHexStringToBinary':
40:52.94 basicutil.c:705:16: warning: comparison between signed and unsigned integer expressions [-Wsign-compare]
40:52.94 basicutil.c:716:16: warning: comparison between signed and unsigned integer expressions [-Wsign-compare]
40:52.94 basicutil.c: In function 'SECU_PrintAsHex':
40:52.94 basicutil.c:286:13: warning: 'column' may be used uninitialized in this function [-Wmaybe-uninitialized]
40:53.54 sslsock.c: In function 'ssl_WriteV':
40:53.54 sslsock.c:2524:30: warning: comparison between signed and unsigned integer expressions [-Wsign-compare]
40:53.54 sslsock.c:2537:68: warning: comparison between signed and unsigned integer expressions [-Wsign-compare]
40:53.54 sslsock.c:2556:28: warning: comparison between signed and unsigned integer expressions [-Wsign-compare]
40:53.54 sslsock.c:2556:59: warning: signed and unsigned type in conditional expression [-Wsign-compare]
40:53.54 sslsock.c:2559:23: warning: comparison between signed and unsigned integer expressions [-Wsign-compare]
40:53.54 sslsock.c:2565:56: warning: comparison between signed and unsigned integer expressions [-Wsign-compare]
40:53.81 derprint.c: In function 'prettyPrintLength':
40:53.81 derprint.c:454:20: warning: comparison between signed and unsigned integer expressions [-Wsign-compare]
40:54.00 smimeutil.c: In function 'NSSSMIME_VersionCheck':
40:54.00 smimeutil.c:770:19: warning: variable 'c' set but not used [-Wunused-but-set-variable]
40:54.00 smimeutil.c: In function 'NSS_SMIMEUtil_FindBulkAlgForRecipients':
40:54.00 smimeutil.c:446:9: warning: 'key_type' may be used uninitialized in this function [-Wmaybe-uninitialized]
40:54.00 smimeutil.c:425:14: note: 'key_type' was declared here
40:54.08 secutil.c: In function 'SECU_ChangePW2':
40:54.08 secutil.c:333:15: warning: variable 'rv' set but not used [-Wunused-but-set-variable]
40:54.08 secutil.c: In function 'SECU_PrintDumpDerIssuerAndSerial':
40:54.08 secutil.c:1551:19: warning: comparison between signed and unsigned integer expressions [-Wsign-compare]
40:54.08 secutil.c: In function 'secu_PrintPKCS7Signed':
40:54.08 secutil.c:2703:11: warning: passing argument 5 of 'SECU_PrintSignedData' from incompatible pointer type [enabled by default]
40:54.08 In file included from secutil.c:19:0:
40:54.08 secutil.h:260:12: note: expected 'SECU_PPFunc' but argument is of type 'int (*)(struct FILE *, const struct SECItem *, const char *, int)'
40:54.08 secutil.c: In function 'secu_PrintPKCS7SignedAndEnveloped':
40:54.08 secutil.c:2822:11: warning: passing argument 5 of 'SECU_PrintSignedData' from incompatible pointer type [enabled by default]
40:54.08 In file included from secutil.c:19:0:
40:54.08 secutil.h:260:12: note: expected 'SECU_PPFunc' but argument is of type 'int (*)(struct FILE *, const struct SECItem *, const char *, int)'
40:54.08 secutil.c: In function 'SEC_PrintCertificateAndTrust':
40:54.08 secutil.c:3152:10: warning: passing argument 5 of 'SECU_PrintSignedData' from incompatible pointer type [enabled by default]
40:54.08 secutil.c:3125:5: note: expected 'SECU_PPFunc' but argument is of type 'int (*)(struct FILE *, const struct SECItem *, const char *, int)'
40:54.08 secutil.c: In function 'SECU_StoreCRL':
40:54.08 secutil.c:3324:62: warning: comparison between signed and unsigned integer expressions [-Wsign-compare]
40:54.11 sslinfo.c: In function 'SSL_DisableDefaultExportCipherSuites':
40:54.11 sslinfo.c:247:15: warning: variable 'rv' set but not used [-Wunused-but-set-variable]
40:54.11 sslinfo.c: In function 'SSL_DisableExportCipherSuites':
40:54.11 sslinfo.c:268:15: warning: variable 'rv' set but not used [-Wunused-but-set-variable]
40:54.23 jarsign.c: In function 'jar_create_pk7':
40:54.23 jarsign.c:174:11: warning: variable 'errstring' set but not used [-Wunused-but-set-variable]
40:54.43 jar.c: In function 'JAR_find_next':
40:54.43 jar.c:423:30: warning: comparison between signed and unsigned integer expressions [-Wsign-compare]
40:54.43 jar.c: In function 'jar_find_first_cert':
40:54.43 jar.c:462:24: warning: comparison between signed and unsigned integer expressions [-Wsign-compare]
40:54.49 ssl3ecc.c: In function 'ssl3_DisableECCSuites':
40:54.49 ssl3ecc.c:969:19: warning: unused variable 'rv' [-Wunused-variable]
40:54.49 ssl3ecc.c: In function 'ssl3_SendSupportedCurvesXtn':
40:54.49 ssl3ecc.c:1130:28: warning: comparison between signed and unsigned integer expressions [-Wsign-compare]
40:54.49 ssl3ecc.c: In function 'ssl3_HandleSupportedCurvesXtn':
40:54.49 ssl3ecc.c:1238:35: warning: comparison between signed and unsigned integer expressions [-Wsign-compare]
40:54.51 libnss3.so
40:54.70 jarfile.c: In function 'jar_physical_inflate':
40:54.70 jarfile.c:341:32: warning: comparison between signed and unsigned integer expressions [-Wsign-compare]
40:54.70 jarfile.c:356:38: warning: comparison between signed and unsigned integer expressions [-Wsign-compare]
40:54.70 jarfile.c: In function 'jar_extract_mf':
40:54.70 jarfile.c:578:14: warning: comparison between signed and unsigned integer expressions [-Wsign-compare]
40:54.70 jarfile.c: In function 'jar_listzip':
40:54.70 jarfile.c:702:47: warning: comparison between signed and unsigned integer expressions [-Wsign-compare]
40:54.70 jarfile.c:768:43: warning: comparison between signed and unsigned integer expressions [-Wsign-compare]
40:54.70 jarfile.c: In function 'jar_listtar':
40:54.70 jarfile.c:830:45: warning: comparison between signed and unsigned integer expressions [-Wsign-compare]
40:54.70 jarfile.c:824:12: warning: variable 'when' set but not used [-Wunused-but-set-variable]
40:54.70 jarfile.c:823:14: warning: variable 'mode' set but not used [-Wunused-but-set-variable]
40:55.89 shlibsign.c: In function 'writeItem':
40:55.89 shlibsign.c:150:22: warning: comparison between signed and unsigned integer expressions [-Wsign-compare]
40:55.89 shlibsign.c: In function 'main':
40:55.89 shlibsign.c:908:40: warning: comparison between signed and unsigned integer expressions [-Wsign-compare]
40:55.91 cd mangle; /usr/bin/make libs
40:56.08 mkdir: kann Verzeichnis „/opt/FirefoxSource/mozilla-release/objdir-droid/security/nss/lib/freebl“ nicht anlegen: Die Datei existiert bereits
40:56.49 pk12util.c: In function 'p12u_InitContext':
40:56.49 pk12util.c:104:12: warning: variable 'fileExist' set but not used [-Wunused-but-set-variable]
40:56.49 pk12util.c: In function 'P12U_ListPKCS12File':
40:56.49 pk12util.c:762:30: warning: passing argument 5 of 'SECU_PrintSignedData' from incompatible pointer type [enabled by default]
40:56.49 In file included from pk12util.c:11:0:
40:56.49 /opt/FirefoxSource/mozilla-release/objdir-droid/dist/private/nss/secutil.h:260:12: note: expected 'SECU_PPFunc' but argument is of type 'int (*)(struct FILE *, const struct SECItem *, const char *, int)'
40:56.67 loader.c: In function 'freebl_LoadDSO':
40:56.67 loader.c:135:14: warning: variable 'status' set but not used [-Wunused-but-set-variable]
40:56.67 loader.c: In function 'BL_Unload':
40:56.67 loader.c:904:20: warning: unused variable 'status' [-Wunused-variable]
40:56.88 ldvector.c: In function 'FREEBL_GetVector':
40:56.88 ldvector.c:301:19: warning: variable 'c' set but not used [-Wunused-but-set-variable]
40:57.28 pk11.c: In function 'ListModule':
40:57.28 pk11.c:612:16: warning: comparison between signed and unsigned integer expressions [-Wsign-compare]
40:57.57 token.c: In function 'nssCKFWToken_GetUTCTime':
40:57.57 token.c:1261:27: warning: variable 'z' set but not used [-Wunused-but-set-variable]
40:57.60 keystuff.c: In function 'UpdateRNG':
40:57.60 keystuff.c:96:18: warning: comparison between signed and unsigned integer expressions [-Wsign-compare]
40:57.60 keystuff.c: In function 'CERTUTIL_GeneratePrivateKey':
40:57.60 keystuff.c:497:15: warning: variable 'algtag' set but not used [-Wunused-but-set-variable]
40:57.74 ytab.c: In function 'Pk11Install_yyparse':
40:57.74 ytab.c:219:5: warning: suggest parentheses around assignment used as truth value [-Wparentheses]
40:58.19 lex.Pk11Install_yy.cpp:1060:13: warning: 'Pkcs11Install_yyunput' defined but not used [-Wunused-function]
40:58.19 lex.Pk11Install_yy.cpp:1106:12: warning: 'input' defined but not used [-Wunused-function]
40:58.31 rawhash.c: In function 'HASH_GetRawHashObject':
40:58.31 rawhash.c:156:5: warning: comparison of unsigned expression < 0 is always false [-Wtype-limits]
40:58.42 cd builtins; /usr/bin/make libs
40:58.88 bfind.c: In function 'builtins_attrmatch':
40:58.88 bfind.c:122:11: warning: comparison between signed and unsigned integer expressions [-Wsign-compare]
40:58.96 cts.c: In function 'CTS_DecryptUpdate':
40:58.96 cts.c:226:23: warning: comparison between signed and unsigned integer expressions [-Wsign-compare]
40:58.98 binst.c: In function 'builtins_mdInstance_GetLibraryVersion':
40:58.98 binst.c:70:17: warning: variable 'c' set but not used [-Wunused-but-set-variable]
40:59.16 gcm.c: In function 'gcm_getX':
40:59.16 gcm.c:223:13: warning: comparison between signed and unsigned integer expressions [-Wsign-compare]
40:59.20 sha512.c: In function 'SHA512_Compress':
40:59.20 sha512.c:933:14: warning: unused variable 't1' [-Wunused-variable]
40:59.20 sha512.c:955:18: warning: unused variable 't2' [-Wunused-variable]
40:59.20 sha512.c:955:14: warning: unused variable 't1' [-Wunused-variable]
40:59.20 sha512.c: In function 'SHA512_End':
40:59.20 sha512.c:1229:14: warning: unused variable 't1' [-Wunused-variable]
40:59.20 sha512.c: In function 'SHA512_EndRaw':
40:59.20 sha512.c:1274:14: warning: unused variable 't1' [-Wunused-variable]
40:59.59 dh.c: In function 'DH_Derive':
40:59.59 dh.c:271:13: warning: comparison between signed and unsigned integer expressions [-Wsign-compare]
40:59.84 ec.c: In function 'ec_points_mul':
40:59.84 ec.c:89:17: warning: comparison between signed and unsigned integer expressions [-Wsign-compare]
40:59.84 ec.c: In function 'EC_ValidatePublicKey':
40:59.84 ec.c:450:33: warning: comparison between signed and unsigned integer expressions [-Wsign-compare]
40:59.97 ecdecode.c: In function 'gf_populate_params':
40:59.97 ecdecode.c:120:5: warning: comparison of unsigned expression < 0 is always false [-Wtype-limits]
41:00.28 dsa.c: In function 'DSA_VerifyDigest':
41:00.28 dsa.c:518:25: warning: comparison between signed and unsigned integer expressions [-Wsign-compare]
41:00.28 dsa.c:530:27: warning: comparison between signed and unsigned integer expressions [-Wsign-compare]
41:00.41 shvfy.c: In function 'readItem':
41:00.41 shvfy.c:267:19: warning: comparison between signed and unsigned integer expressions [-Wsign-compare]
41:00.56 rsa.c: In function 'RSA_NewKey':
41:00.56 rsa.c:251:29: warning: comparison between signed and unsigned integer expressions [-Wsign-compare]
41:00.56 rsa.c: In function 'rsa_get_primes_from_exponents':
41:00.56 rsa.c:482:52: warning: comparison between signed and unsigned integer expressions [-Wsign-compare]
41:00.59 pqg.c: In function 'makePrimefromPrimesShaweTaylor':
41:00.59 pqg.c:617:34: warning: comparison between signed and unsigned integer expressions [-Wsign-compare]
41:00.59 pqg.c:687:28: warning: comparison between signed and unsigned integer expressions [-Wsign-compare]
41:00.59 pqg.c: In function 'makePrimefromSeedShaweTaylor':
41:00.59 pqg.c:849:28: warning: comparison between signed and unsigned integer expressions [-Wsign-compare]
41:00.59 pqg.c: In function 'pqg_ParamGen':
41:00.59 pqg.c:1232:18: warning: variable 'b' set but not used [-Wunused-but-set-variable]
41:00.59 pqg.c: In function 'PQG_VerifyParams':
41:00.59 pqg.c:1614:50: warning: comparison between signed and unsigned integer expressions [-Wsign-compare]
41:00.59 pqg.c:1672:25: warning: comparison between signed and unsigned integer expressions [-Wsign-compare]
41:00.59 pqg.c:1708:18: warning: comparison between signed and unsigned integer expressions [-Wsign-compare]
41:00.59 pqg.c:1709:25: warning: comparison between signed and unsigned integer expressions [-Wsign-compare]
41:00.59 pqg.c:1710:33: warning: comparison between signed and unsigned integer expressions [-Wsign-compare]
41:00.59 pqg.c:1733:29: warning: comparison between signed and unsigned integer expressions [-Wsign-compare]
41:00.59 pqg.c:1775:27: warning: 'type' may be used uninitialized in this function [-Wmaybe-uninitialized]
41:00.60 pqg.c:1595:16: note: 'type' was declared here
41:00.60 pqg.c:1777:5: warning: 'hashtype' may be used uninitialized in this function [-Wmaybe-uninitialized]
41:00.60 pqg.c:1594:19: note: 'hashtype' was declared here
41:00.77 mpi/mpprime.c: In function 'mpp_make_prime':
41:00.77 mpi/mpprime.c:445:47: warning: comparison between signed and unsigned integer expressions [-Wsign-compare]
41:00.88 mpi/mplogic.c: In function 'mpl_num_set':
41:00.88 mpi/mplogic.c:230:20: warning: comparison between signed and unsigned integer expressions [-Wsign-compare]
41:00.88 mpi/mplogic.c: In function 'mpl_num_clear':
41:00.88 mpi/mplogic.c:260:20: warning: comparison between signed and unsigned integer expressions [-Wsign-compare]
41:01.63 ecl/ecp_521.c: In function 'ec_GFp_nistp521_mod':
41:01.63 ecl/ecp_521.c:42:73: warning: comparison between signed and unsigned integer expressions [-Wsign-compare]
41:01.63 ecl/ecp_521.c:50:18: warning: comparison between signed and unsigned integer expressions [-Wsign-compare]
41:01.83 mpi/mpi.c: In function 'mp_expt':
41:01.83 mpi/mpi.c:1114:20: warning: comparison between signed and unsigned integer expressions [-Wsign-compare]
41:01.83 mpi/mpi.c:1118:22: warning: comparison between signed and unsigned integer expressions [-Wsign-compare]
41:01.83 mpi/mpi.c: In function 's_mp_exptmod':
41:01.83 mpi/mpi.c:1497:20: warning: comparison between signed and unsigned integer expressions [-Wsign-compare]
41:01.83 mpi/mpi.c:1501:22: warning: comparison between signed and unsigned integer expressions [-Wsign-compare]
41:01.83 mpi/mpi.c: In function 'mp_trailing_zeros':
41:01.83 mpi/mpi.c:2012:45: warning: comparison between signed and unsigned integer expressions [-Wsign-compare]
41:01.83 mpi/mpi.c: In function 's_mp_fixup_reciprocal':
41:01.83 mpi/mpi.c:2164:19: warning: comparison between signed and unsigned integer expressions [-Wsign-compare]
41:01.83 mpi/mpi.c:2164:51: warning: signed and unsigned type in conditional expression [-Wsign-compare]
41:01.83 mpi/mpi.c:2166:11: warning: comparison between signed and unsigned integer expressions [-Wsign-compare]
41:01.83 mpi/mpi.c: In function 's_mp_lshd':
41:01.83 mpi/mpi.c:2938:18: warning: comparison between signed and unsigned integer expressions [-Wsign-compare]
41:01.83 mpi/mpi.c: In function 's_mp_mul_2':
41:01.83 mpi/mpi.c:3063:12: warning: comparison between signed and unsigned integer expressions [-Wsign-compare]
41:01.83 mpi/mpi.c: In function 's_mp_todigit':
41:01.83 mpi/mpi.c:4600:10: warning: comparison between signed and unsigned integer expressions [-Wsign-compare]
41:01.83 mpi/mpi.c: In function 'mp_to_unsigned_octets':
41:01.83 mpi/mpi.c:4720:29: warning: comparison between signed and unsigned integer expressions [-Wsign-compare]
41:01.83 mpi/mpi.c: In function 'mp_to_signed_octets':
41:01.83 mpi/mpi.c:4752:29: warning: comparison between signed and unsigned integer expressions [-Wsign-compare]
41:01.83 mpi/mpi.c:4766:20: warning: comparison between signed and unsigned integer expressions [-Wsign-compare]
41:01.83 mpi/mpi.c:4767:18: warning: comparison between signed and unsigned integer expressions [-Wsign-compare]
41:01.83 mpi/mpi.c: In function 'mp_to_fixlen_octets':
41:01.83 mpi/mpi.c:4792:29: warning: comparison between signed and unsigned integer expressions [-Wsign-compare]
41:01.83 mpi/mpi.c:4795:16: warning: comparison between signed and unsigned integer expressions [-Wsign-compare]
41:02.32 lgglue.c: In function 'sftkdb_resolvePath':
41:02.32 lgglue.c:44:24: warning: comparison between signed and unsigned integer expressions [-Wsign-compare]
41:02.66 lowpbe.c: In function 'nsspkcs5_PKCS12PBE':
41:02.66 lowpbe.c:519:22: warning: comparison between signed and unsigned integer expressions [-Wsign-compare]
41:03.16 pkcs11u.c: In function 'sftk_DeleteObject':
41:03.16 pkcs11u.c:1177:22: warning: unused variable 'to' [-Wunused-variable]
41:03.16 pkcs11u.c: In function 'sftk_NewTokenObject':
41:03.16 pkcs11u.c:1902:22: warning: variable 'tokObject' set but not used [-Wunused-but-set-variable]
41:03.30 sdb.c: In function 'sdb_FindObjectsInit':
41:03.30 sdb.c:702:28: warning: comparison between signed and unsigned integer expressions [-Wsign-compare]
41:03.30 sdb.c:727:32: warning: comparison between signed and unsigned integer expressions [-Wsign-compare]
41:03.30 sdb.c: In function 'sdb_GetAttributeValueNoLock':
41:03.30 sdb.c:848:17: warning: comparison between signed and unsigned integer expressions [-Wsign-compare]
41:03.30 sdb.c:900:34: warning: comparison between signed and unsigned integer expressions [-Wsign-compare]
41:03.30 sdb.c: In function 'sdb_SetAttributeValue':
41:03.30 sdb.c:978:27: warning: comparison between signed and unsigned integer expressions [-Wsign-compare]
41:03.30 sdb.c:1007:17: warning: comparison between signed and unsigned integer expressions [-Wsign-compare]
41:03.30 sdb.c: In function 'sdb_CreateObject':
41:03.30 sdb.c:1138:42: warning: comparison between signed and unsigned integer expressions [-Wsign-compare]
41:03.30 sdb.c:1168:17: warning: comparison between signed and unsigned integer expressions [-Wsign-compare]
41:03.41 sftkhmac.c: In function 'sftk_HMACConstantTime_Update':
41:03.41 sftkhmac.c:149:15: warning: unused variable 'rv' [-Wunused-variable]
41:03.41 sftkhmac.c: In function 'sftk_SSLv3MACConstantTime_Update':
41:03.41 sftkhmac.c:163:15: warning: unused variable 'rv' [-Wunused-variable]
41:03.55 pkcs11.c: In function 'sftk_GetPubKey':
41:03.55 pkcs11.c:1756:35: warning: comparison between signed and unsigned integer expressions [-Wsign-compare]
41:03.55 pkcs11.c:1764:35: warning: comparison between signed and unsigned integer expressions [-Wsign-compare]
41:03.55 pkcs11.c:1774:27: warning: comparison between signed and unsigned integer expressions [-Wsign-compare]
41:03.55 pkcs11.c: In function 'NSC_GetInfo':
41:03.55 pkcs11.c:3144:19: warning: variable 'c' set but not used [-Wunused-but-set-variable]
41:03.55 pkcs11.c: In function 'NSC_GetAttributeValue':
41:03.55 pkcs11.c:4314:58: warning: comparison between signed and unsigned integer expressions [-Wsign-compare]
41:03.55 pkcs11.c: In function 'sftk_emailhack':
41:03.55 pkcs11.c:4527:17: warning: comparison between signed and unsigned integer expressions [-Wsign-compare]
41:03.55 pkcs11.c: In function 'NSC_FindObjects':
41:03.55 pkcs11.c:4743:54: warning: signed and unsigned type in conditional expression [-Wsign-compare]
41:03.55 pkcs11.c: In function 'NSC_CreateObject':
41:03.55 pkcs11.c:4085:21: warning: 'moduleIndex' may be used uninitialized in this function [-Wmaybe-uninitialized]
41:03.55 pkcs11.c:4005:19: note: 'moduleIndex' was declared here
41:03.81 sftkdb.c: In function 'sftkdb_fixupTemplateOut':
41:03.81 sftkdb.c:328:22: warning: variable 'data' set but not used [-Wunused-but-set-variable]
41:03.81 sftkdb.c:345:69: warning: comparison between signed and unsigned integer expressions [-Wsign-compare]
41:03.81 sftkdb.c: In function 'sftk_signTemplate':
41:03.81 sftkdb.c:520:17: warning: comparison between signed and unsigned integer expressions [-Wsign-compare]
41:03.81 sftkdb.c: In function 'sftkdb_CreateObject':
41:03.81 sftkdb.c:576:12: warning: variable 'inTransaction' set but not used [-Wunused-but-set-variable]
41:03.81 sftkdb.c: In function 'sftk_ExtractTemplate':
41:03.81 sftkdb.c:619:17: warning: comparison between signed and unsigned integer expressions [-Wsign-compare]
41:03.81 sftkdb.c:632:17: warning: comparison between signed and unsigned integer expressions [-Wsign-compare]
41:03.81 sftkdb.c: In function 'sftkdb_resolveConflicts':
41:03.82 sftkdb.c:1045:13: warning: comparison between signed and unsigned integer expressions [-Wsign-compare]
41:03.82 sftkdb.c: In function 'sftkdb_FindObjects':
41:03.82 sftkdb.c:1261:14: warning: comparison between signed and unsigned integer expressions [-Wsign-compare]
41:03.82 sftkdb.c: In function 'sftkdb_GetObjectTemplate':
41:03.82 sftkdb.c:1613:14: warning: comparison between signed and unsigned integer expressions [-Wsign-compare]
41:03.82 sftkdb.c:1631:63: warning: comparison between signed and unsigned integer expressions [-Wsign-compare]
41:03.82 sftkdb.c: In function 'sftkdb_handleIDAndName':
41:03.82 sftkdb.c:2014:11: warning: variable 'crv' set but not used [-Wunused-but-set-variable]
41:03.82 sftkdb.c: In function 'sftkdb_mergeObject':
41:03.82 sftkdb.c:2196:17: warning: comparison between signed and unsigned integer expressions [-Wsign-compare]
41:03.82 sftkdb.c: In function 'sftkdb_Update':
41:03.82 sftkdb.c:2301:38: warning: comparison between signed and unsigned integer expressions [-Wsign-compare]
41:03.86 sftkpwd.c: In function 'sftk_updateMacs':
41:03.86 sftkpwd.c:908:17: warning: comparison between signed and unsigned integer expressions [-Wsign-compare]
41:03.86 sftkpwd.c:909:31: warning: comparison between signed and unsigned integer expressions [-Wsign-compare]
41:03.86 sftkpwd.c:930:17: warning: comparison between signed and unsigned integer expressions [-Wsign-compare]
41:03.86 sftkpwd.c:935:31: warning: comparison between signed and unsigned integer expressions [-Wsign-compare]
41:03.86 sftkpwd.c:868:11: warning: variable 'crv2' set but not used [-Wunused-but-set-variable]
41:03.86 sftkpwd.c:867:11: warning: variable 'crv' set but not used [-Wunused-but-set-variable]
41:03.86 sftkpwd.c: In function 'sftk_updateEncrypted':
41:03.86 sftkpwd.c:986:17: warning: comparison between signed and unsigned integer expressions [-Wsign-compare]
41:03.86 sftkpwd.c:993:31: warning: comparison between signed and unsigned integer expressions [-Wsign-compare]
41:03.86 sftkpwd.c: In function 'sftkdb_convertObjects':
41:03.86 sftkpwd.c:1125:38: warning: comparison between signed and unsigned integer expressions [-Wsign-compare]
41:04.42 pkcs11c.c: In function 'NSC_GenerateKeyPair':
41:04.43 pkcs11c.c:4340:9: warning: variable 'private_value_bits' set but not used [-Wunused-but-set-variable]
41:04.43 pkcs11c.c: In function 'sftk_PackagePrivateKey':
41:04.43 pkcs11c.c:4862:14: warning: variable 'fordebug' set but not used [-Wunused-but-set-variable]
41:04.43 pkcs11c.c: In function 'NSC_DeriveKey':
41:04.43 pkcs11c.c:6764:18: warning: comparison between signed and unsigned integer expressions [-Wsign-compare]
41:04.43 pkcs11c.c:6769:18: warning: comparison between signed and unsigned integer expressions [-Wsign-compare]
41:04.43 pkcs11c.c:6850:20: warning: comparison between signed and unsigned integer expressions [-Wsign-compare]
41:04.43 pkcs11c.c: In function 'NSC_GenerateKeyPair':
41:04.43 pkcs11c.c:4260:6: warning: 'subPrimeLen' may be used uninitialized in this function [-Wmaybe-uninitialized]
41:04.43 pkcs11c.c:4042:14: note: 'subPrimeLen' was declared here
41:04.43 pkcs11c.c:4212:23: warning: 'modulusLen' may be used uninitialized in this function [-Wmaybe-uninitialized]
41:04.43 pkcs11c.c:4041:14: note: 'modulusLen' was declared here
41:04.43 pkcs11c.c: In function 'NSC_GenerateKey':
41:04.43 pkcs11c.c:3968:13: warning: 'hashType' may be used uninitialized in this function [-Wmaybe-uninitialized]
41:04.91 libjs_static.a
41:29.12 libjs_static.a.desc
41:29.69 libeditline.a.desc
41:29.77 js
41:34.14 jsapi-tests
41:39.29 gdb-tests
41:43.62 libcertverifier.a.desc
41:43.73 libmozillapkix.a.desc
41:43.85 libmozillapkix_gtest.a.desc
41:43.96 libpkixtestutil.a.desc
41:44.05 libsecurity_apps.a.desc
41:44.26 libxpt.a
41:44.36 libxpt.a.desc
41:44.50 libxpcom_string.a.desc
41:44.62 libxpcomglue_s.a
41:45.03 libxpcomglue_s.a.desc
41:45.18 libxpcomglue.a
41:45.24 libxpcomglue.a.desc
41:45.38 libxpcomglue_s_nomozalloc.a
41:45.44 libxpcomglue_s_nomozalloc.a.desc
41:45.56 libxpcom_glue_gtest.a.desc
41:45.68 libxpcom_base.a.desc
41:45.91 libxpcom_ds.a.desc
41:46.13 libxpcom_io.a.desc
41:46.33 libxpcom_components.a.desc
41:46.50 libxpcom_threads.a.desc
41:46.67 libxpcom_reflect_xptinfo.a.desc
41:46.81 libxpcom_reflect_xptcall.a.desc
41:46.90 libxpcom_reflect_xptcall_md_unix.a.desc
41:47.66 libchrome_src.a.desc
41:47.87 libxpcom_core.a.desc
41:48.22 libmodules_libpref_src.a.desc
41:48.31 /opt/FirefoxSource/mozilla-release/netwerk/base/public/security-prefs.js: WARNING: no preprocessor directives found
41:48.48 libintl_hyphenation_src.a.desc
41:48.69 libintl_locale_src.a.desc
41:48.80 libintl_locale_src_unix.a.desc
41:49.28 libintl_lwbrk_src.a.desc
41:49.48 libintl_strres_src.a.desc
41:49.70 libunicharutil_external_s.a
41:49.84 libunicharutil_external_s.a.desc
41:49.93 libintl_unicharutil_util_internal.a
41:49.98 libintl_unicharutil_util_internal.a.desc
41:50.07 libintl_unicharutil_src.a.desc
41:50.47 libintl_uconv_src.a.desc
41:50.75 libi18n.a.desc
41:51.17 libnetwerk_base_src.a.desc
41:51.41 libnetwerk_cookie.a.desc
41:51.58 libnetwerk_dns.a.desc
41:51.74 libnetwerk_socket.a.desc
41:51.88 libnetwerk_mime.a.desc
41:52.14 libnetwerk_streamconv_src.a.desc
41:52.22 libnetwerk_streamconv_converters.a.desc
41:52.35 libnetwerk_cache.a.desc
41:52.56 libnetwerk_cache2.a.desc
41:52.75 libnetwerk_protocol_about.a.desc
41:52.91 libnetwerk_protocol_app.a.desc
41:52.99 libnetwerk_protocol_data.a.desc
41:53.08 libnetwerk_protocol_device.a.desc
41:53.18 libnetwerk_protocol_file.a.desc
41:53.36 libnetwerk_protocol_ftp.a.desc
41:53.64 libnetwerk_protocol_http.a.desc
41:53.97 libnetwerk_protocol_res.a.desc
41:54.10 libnetwerk_protocol_viewsource.a.desc
41:54.25 libnetwerk_protocol_websocket.a.desc
41:54.41 libnetwerk_protocol_wyciwyg.a.desc
41:54.59 libnetwerk_system_android.a.desc
41:54.68 libnetwerk_ipc.a.desc
41:55.13 libnecko.a.desc
41:55.24 libextensions_auth.a.desc
41:55.48 libipc_chromium.a.desc
41:55.77 libipc_glue.a.desc
41:55.99 libipc_ipdl.a.desc
41:56.18 libipc_testshell.a.desc
41:56.29 libjs_ipc.a.desc
41:56.45 libhal.a.desc
41:56.78 libjs_xpconnect_wrappers.a.desc
41:56.90 libjs_xpconnect_loader.a.desc
41:57.10 libxpconnect_s.a.desc
41:57.33 libintl_chardet_src.a.desc
41:57.40 libyuv_neon.a.desc
41:57.49 libyuv.a.desc
41:57.59 libjar.a.desc
41:57.85 libmodules_libjar_zipwriter_src.a.desc
41:58.13 libstorage_src.a.desc
41:58.27 libstoragecomps.a.desc
41:58.36 libextensions_cookie.a.desc
41:58.52 libextensions_permissions.a.desc
41:58.76 librdf_base_src.a.desc
41:58.86 librdfutil_external_s.a
41:58.93 librdfutil_external_s.a.desc
41:59.01 librdf_util_src_internal.a.desc
41:59.09 librdf_datasource_src.a.desc
41:59.17 librdf.a.desc
41:59.29 libutils.so
41:59.45 libstagefright.so
41:59.61 libvideoeditorplayer.so
41:59.80 libutils.so
41:59.97 libstagefright.so
42:00.10 libstagefright_color_conversion.so
42:00.23 libstagefright.so
42:00.40 libstagefright.so
42:00.53 libomxplugin.so
42:00.68 libomxplugingb.so
42:00.82 libomxplugingb235.so
42:00.97 libomxpluginfroyo.so
42:01.11 libstagefright.so
42:01.27 libomxpluginhc.so
42:01.41 libomxpluginkk.so
42:01.85 libgtest.a.desc
42:01.95 liburiloader_base.a.desc
42:02.13 liburiloader_exthandler.a.desc
42:02.33 WriteArgument
42:02.47 liburiloader_prefetch.a.desc
42:02.67 libcaps.a.desc
42:02.83 libparser_expat_lib.a.desc
42:03.05 libparser_xml_src.a.desc
42:03.24 libhtmlpars.a.desc
42:03.43 libparser_html.a.desc
42:03.74 libgfx_cairo_cairo_src.a.desc
42:03.92 libgfx_cairo_libpixman_src.a.desc
42:04.06 libgfx_2d.a.desc
42:04.20 libgfx_ycbcr.a.desc
42:04.38 libgfx_angle.a.desc
42:04.59 libgfx_src.a.desc
42:04.76 libgfx_qcms.a.desc
42:04.88 libgfx_gl.a.desc
42:05.30 libgfx_layers.a.desc
42:05.79 libgfx_graphite2_src.a.desc
42:05.93 libgfx_harfbuzz_src.a.desc
42:06.08 libgfx_ots_src.a.desc
42:06.29 libthebes.a.desc
42:06.51 libgfx_ipc.a.desc
42:07.04 libgfx_skia.a.desc
42:07.73 libgfxtest.a.desc
42:08.05 libimage_src.a.desc
42:08.24 libimage_decoders.a.desc
42:08.36 libimage_decoders_icon_android.a.desc
42:08.45 libimgicon.a.desc
42:08.59 libimage_encoders_ico.a.desc
42:08.68 libimage_encoders_png.a.desc
42:08.75 libimage_encoders_jpeg.a.desc
42:08.83 libimage_encoders_bmp.a.desc
42:08.90 libimglib2.a.desc
42:11.78 libdom_animation.a.desc
42:11.86 libdom_apps_src.a.desc
42:12.18 libdom_base.a.desc
42:12.67 libdom_activities_src.a.desc
42:12.80 libdom_archivereader.a.desc
42:13.14 libdom_bindings.a.desc
42:13.56 libdombindings_test_s.a.desc
42:13.69 libdom_battery.a.desc
42:13.78 libdom_browser-element.a.desc
42:14.04 libdom_crypto.a.desc
42:14.28 libdom_alarm.a.desc
42:14.46 libdom_datastore.a.desc
42:14.66 libdom_devicestorage.a.desc
42:14.76 libdom_encoding.a.desc
42:14.96 libdom_events.a.desc
42:15.29 libdom_filehandle.a.desc
42:15.42 libdom_filesystem.a.desc
42:15.55 libdom_asmjscache.a.desc
42:15.64 libdom_media.a.desc
42:16.03 libdom_power.a.desc
42:16.32 libdom_quota.a.desc
42:16.71 libdom_mobilemessage_src.a.desc
42:16.98 libdom_src_jsurl.a.desc
42:17.08 libdom_src_storage.a.desc
42:17.18 libdom_src_offline.a.desc
42:17.26 libdom_src_json.a.desc
42:17.35 libdom_src_geolocation.a.desc
42:17.44 libdom_src_notification.a.desc
42:17.56 libdom_time.a.desc
42:18.06 libdom_network_src.a.desc
42:18.36 libdom_plugins_base.a.desc
42:18.58 libdom_plugins_base_android.a.desc
42:18.76 libdom_plugins_ipc.a.desc
42:19.00 libdom_indexedDB.a.desc
42:19.20 libdom_indexedDB_ipc.a.desc
42:19.34 /opt/FirefoxSource/mozilla-release/dom/indexedDB/test/extensions/bootstrap.js: WARNING: no preprocessor directives found
42:19.40 libdom_system.a.desc
42:19.57 libdom_system_android.a.desc
42:19.74 libdom_ipc.a.desc
42:20.31 libdom_workers.a.desc
42:20.54 /opt/FirefoxSource/mozilla-release/dom/workers/test/extensions/bootstrap/worker.js: WARNING: no preprocessor directives found
42:20.54 /opt/FirefoxSource/mozilla-release/dom/workers/test/extensions/bootstrap/bootstrap.js: WARNING: no preprocessor directives found
42:20.66 /opt/FirefoxSource/mozilla-release/dom/workers/test/extensions/traditional/worker.js: WARNING: no preprocessor directives found
42:20.81 libdom_camera.a.desc
42:20.94 libdom_audiochannel.a.desc
42:21.09 libdom_promise.a.desc
42:21.22 libdom_smil.a.desc
42:21.38 libdom_telephony.a.desc
42:21.78 libdom_xbl.a.desc
42:22.22 libdom_xslt_base.a.desc
42:22.31 libdom_xslt_xml.a.desc
42:22.46 libdom_xslt_xpath.a.desc
42:22.71 libdom_xslt_xslt.a.desc
42:23.08 libdom_resourcestats.a.desc
42:23.43 libdom_gamepad.a.desc
42:23.62 libnptest.so
42:23.75 libnpsecondtest.so
42:23.88 libnptestjava.so
42:24.06   adding: install.rdf (deflated 52%)
42:24.10   adding: plugins/libnptest.so (deflated 60%)
42:24.13   adding: plugins/libnpsecondtest.so (deflated 60%)
42:24.21 libview_src.a.desc
42:24.40 libwidget_shared.a.desc
42:24.55 libxpwidgets_s.a.desc
42:24.79 libwidget_android.a.desc
42:25.44 libcontent_base_src.a.desc
42:26.20 libcontent_canvas_src.a.desc
42:27.00 libcontent_html_content_src.a.desc
42:27.58 libcontent_html_document_src.a.desc
42:27.70 libcontent_mathml_content_src.a.desc
42:27.90 libcontent_media.a.desc
42:28.17 libcontent_media_encoder.a.desc
42:28.30 libmozgmp.a.desc
42:28.50 libcontent_media_mediasource.a.desc
42:28.61 libcontent_media_ogg.a.desc
42:28.79 libcontent_media_webaudio.a.desc
42:29.04 libcontent_media_webaudio_blink.a.desc
42:29.33 libcontent_media_raw.a.desc
42:29.42 libcontent_media_wave.a.desc
42:29.51 libcontent_media_webm.a.desc
42:29.61 libcontent_media_android.a.desc
42:29.71 libcontent_media_webrtc.a.desc
42:29.87 libcontent_media_webspeech_synth.a.desc
42:30.08 libcontent_media_webspeech_recognition.a.desc
42:30.25 libcontent_media_eme.a.desc
42:30.36 libmedia_gtest.a.desc
42:30.46 libcontent_svg_document_src.a.desc
42:30.96 libcontent_svg_content_src.a.desc
42:31.64 libcontent_xml_content_src.a.desc
42:31.88 libcontent_xml_document_src.a.desc
42:32.12 libcontent_xul_document_src.a.desc
42:32.34 libcontent_xul_content_src.a.desc
42:32.59 libcontent_xul_templates_src.a.desc
42:32.86 libeditor_txtsvc.a.desc
42:33.05 libeditor_libeditor_base.a.desc
42:33.22 libeditor_libeditor_text.a.desc
42:33.37 libeditor_libeditor_html.a.desc
42:33.52 libeditor_txmgr.a.desc
42:33.67 libeditor_composer.a.desc
42:33.94 liblayout_style.a.desc
42:34.62 liblayout_base.a.desc
42:35.08 liblayout_generic.a.desc
42:35.58 liblayout_forms.a.desc
42:35.79 liblayout_tables.a.desc
42:36.03 liblayout_svg.a.desc
42:36.38 liblayout_xul.a.desc
42:36.74 liblayout_xul_tree.a.desc
42:36.94 liblayout_xul_grid.a.desc
42:37.07 liblayout_ipc.a.desc
42:37.30 liblayout_mathml.a.desc
42:37.59 liblayout_inspector.a.desc
42:37.91 liblayout_printing.a.desc
42:38.09 libgklayout.a.desc
42:38.31 libgkmedias.a.desc
42:38.51 libdocshell_base.a.desc
42:38.82 libdocshell_shistory_src.a.desc
42:38.90 libdocshell_build.a.desc
42:39.38 libembedding_components_windowwatcher_src.a.desc
42:39.47 libembedding_components_appstartup_src.a.desc
42:39.66 libembedding_components_find_src.a.desc
42:39.87 libembedding_components_webbrowserpersist_src.a.desc
42:40.07 libembedding_components_commandhandler_src.a.desc
42:40.16 libembedding_components_printingui_src_unixshared.a.desc
42:40.23 libembedcomponents.a.desc
42:40.32 libembedding_browser_webBrowser.a.desc
42:40.48 libwebbrwsr.a.desc
42:40.79 libxpfe_appshell_src.a.desc
42:40.90 libother-licenses_skia-npapi.a.desc
42:41.01 libextensions_universalchardet_src_base.a.desc
42:41.11 libuniversalchardet.a.desc
42:41.21 libaccessible_other.a.desc
42:41.36 libaccessible_base.a.desc
42:41.59 libaccessible_generic.a.desc
42:41.75 libaccessible_html.a.desc
42:42.20 libaccessible_xpcom.a.desc
42:42.33 libaccessible_xul.a.desc
42:42.59 libprofdirserviceprovidersa_s.a.desc
42:42.71 libtools_profiler.a.desc
42:42.91 libsps_test.a.desc
42:43.00 libxpfe_components_windowds.a.desc
42:43.14 libxpfe_components_directory.a.desc
42:43.28 libappcomps.a.desc
42:43.56 libextensions_spellcheck_hunspell_src.a.desc
42:43.70 libspellchecker.a.desc
42:43.94 libsecurity_manager_boot_src.a.desc
42:44.14 libsecurity_manager_ssl_src.a.desc
42:44.48 libtlsserver.a.desc
42:44.56 BadCertServer
42:44.56 GenerateOCSPResponse
42:44.56 OCSPStaplingServer
42:44.72 libssltest.a.desc
42:45.22 libsecurity_manager_pki_src.a.desc
42:45.72 libtoolkit_components_alerts.a.desc
42:46.06 libtoolkit_components_commandlines.a.desc
42:46.65 libtoolkit_components_diskspacewatcher.a.desc
42:46.80 libtoolkit_components_downloads.a.desc
42:47.20 libtoolkit_components_finalizationwitness.a.desc
42:47.53 libtoolkit_components_find.a.desc
42:47.77 libtoolkit_components_jsdownloads_src.a.desc
42:47.96 libtoolkit_components_mediasniffer.a.desc
42:48.11 libtoolkit_components_osfile.a.desc
42:48.30 libtoolkit_components_parentalcontrols.a.desc
42:48.72 libtoolkit_components_perf.a.desc
42:49.26 libtoolkit_components_protobuf.a.desc
42:49.35 libtoolkit_components_reflect.a.desc
42:49.51 libtoolkit_components_startup.a.desc
42:49.73 libtoolkit_components_statusfilter.a.desc
42:49.81 libtoolkit_components_telemetry.a.desc
42:50.25 libtoolkit_components_typeaheadfind.a.desc
42:50.86 libtoolkit_components_workerlz4.a.desc
42:50.94 libtoolkit_components_ctypes.a.desc
42:51.04 libjsctypes-test.so
42:51.42 libtoolkit_components_autocomplete.a.desc
42:51.56 libtoolkit_components_satchel.a.desc
42:52.07 libtoolkit_components_url-classifier.a.desc
42:52.27 libtoolkitcomps.a.desc
42:53.19 libtoolkit_devtools_server.a.desc
42:54.33 libtoolkit_identity.a.desc
42:55.18 libtoolkit_mozapps_extensions.a.desc
42:57.01 BadPlugin
42:57.01 GoodPlugin
42:57.26 libtoolkit_profile.a.desc
42:58.37 TestWebappRT
42:58.48 libtoolkit_system_androidproxy.a.desc
42:58.59 libbreakpad_common_s.a.desc
42:58.80 libtoolkit_crashreporter_google-breakpad_src_processor.a.desc
42:58.90 libbreakpad_linux_common_s.a.desc
42:59.35 libxulapp_s.a.desc
42:59.66 libextensions_pref_autoconfig_src.a.desc
42:59.96 libservices_crypto_component.a.desc
43:00.34 libstartupcache.a.desc
43:00.49 libjs_ductwork_debugger.a.desc
43:00.61 libother-licenses_snappy.a.desc
43:00.70 libbrowsercomps.a.desc
43:00.84 libxul.a.desc
43:01.19 libStaticXULComponentsEnd.a.desc
43:01.26 libxul.so
46:46.90 /opt/FirefoxSource/mozilla-release/tools/quitter/chrome.manifest: WARNING: no preprocessor directives found
46:48.61 ssltunnel
46:50.81 /opt/FirefoxSource/mozilla-release/mobile/android/thirdparty/jap/branding/locales/en-US/brand.properties: WARNING: no useful preprocessor directives found
46:52.62 /opt/FirefoxSource/mozilla-release/mobile/locales/en-US/overrides/netError.dtd: WARNING: no preprocessor directives found
46:52.62 /opt/FirefoxSource/mozilla-release/mobile/locales/en-US/overrides/appstrings.properties: WARNING: no useful preprocessor directives found
46:52.62 /opt/FirefoxSource/mozilla-release/mobile/locales/en-US/overrides/passwordmgr.properties: WARNING: no useful preprocessor directives found
46:53.99 /opt/FirefoxSource/mozilla-release/mobile/android/base/WebappManifestFragment.xml.frag.in: WARNING: no preprocessor directives found
46:55.00 gecko-mozglue.jar
46:55.02 squareup-picasso.jar
46:55.37 sync-thirdparty.jar
46:55.38 websockets.jar
46:55.75 Reading 0 suggested sites: []
46:55.75 /opt/FirefoxSource/mozilla-release/objdir-droid/mobile/android/base/res/raw/suggestedsites.json updated
46:55.87 make[5]: *** Keine Regel vorhanden, um das Target »/opt/FirefoxSource/mozilla-release/mobile/android/thirdparty/jap/jar_dependencies/ANONDroidLib-0.1.1-SNAPSHOT.jar«,
46:55.87   benötigt von »gecko-browser.jar«, zu erstellen.  Schluss.
46:55.87 make[5]: *** Warte auf noch nicht beendete Prozesse...
46:58.35 generated/org/mozilla/gecko/mozglue/GeckoLoader.java:284: warning: [deprecation] CPU_ABI in Build has been deprecated
46:58.35         final String abi = android.os.Build.CPU_ABI;
46:58.35                                            ^
46:58.37 generated/org/mozilla/gecko/mozglue/GeckoLoader.java:346: warning: [deprecation] CPU_ABI in Build has been deprecated
46:58.37         message.append(": ABI: " + MOZ_APP_ABI + ", " + android.os.Build.CPU_ABI);
46:58.37                                                                         ^
46:58.59 2 warnings
46:59.52 Note: /opt/FirefoxSource/mozilla-release/mobile/android/thirdparty/com/squareup/picasso/Utils.java uses or overrides a deprecated API.
46:59.52 Note: Recompile with -Xlint:deprecation for details.
47:02.67 Note: Some input files use or override a deprecated API.
47:02.67 Note: Recompile with -Xlint:deprecation for details.
47:02.67 Note: Some input files use unchecked or unsafe operations.
47:02.67 Note: Recompile with -Xlint:unchecked for details.
47:02.94 make[4]: *** [mobile/android/base/libs] Fehler 2
47:02.95 make[3]: *** [libs] Fehler 2
47:02.95 make[2]: *** [default] Fehler 2
47:02.95 make[1]: *** [realbuild] Fehler 2
47:02.95 make: *** [build] Fehler 2
47:02.95 452 compiler warnings present.
Build step 'Shell ausführen' marked build as failure
[PostBuildScript] - Execution post build scripts.
[PostBuildScript] Build is not success : do not execute script
Finished: FAILURE