Console Output

Skipping 544 KB.. Full Log
40:13.59 WebGLExtensionCompressedTextureS3TC.o
40:15.64 nsCrossSiteListenerProxy.o
40:31.86 MediaRecorder.o
40:31.87 HTMLMenuElement.o
40:33.16 MediaResource.o
40:34.85 WebGLExtensionDebugRendererInfo.o
40:35.45 nsDOMAttributeMap.o
40:36.75 MediaShutdownManager.o
40:38.11 WebGLExtensionDebugShaders.o
40:38.38 nsDOMBlobBuilder.o
40:42.16 nsDOMCaretPosition.o
40:43.18 MediaStreamGraph.o
40:43.48 WebGLExtensionDepthTexture.o
40:43.52 HTMLMenuItemElement.o
40:44.44 nsDOMFile.o
40:44.87 MediaStreamTrack.o
40:46.67 HTMLMetaElement.o
40:46.87 WebGLExtensionDrawBuffers.o
40:47.09 nsDOMFileReader.o
40:49.88 HTMLMeterElement.o
40:50.09 WebGLExtensionElementIndexUint.o
40:50.63 nsDOMMutationObserver.o
40:52.63 MediaTaskQueue.o
40:53.38 HTMLModElement.o
40:53.53 WebGLExtensionFragDepth.o
40:53.57 nsDOMSerializer.o
40:54.52 MediaTrack.o
40:55.20 MediaTrackList.o
40:55.91 HTMLObjectElement.o
40:56.56 WebGLExtensionInstancedArrays.o
40:56.94 RtspMediaResource.o
40:57.26 nsDOMSettableTokenList.o
40:58.37 HTMLOptGroupElement.o
40:59.20 nsDOMTokenList.o
41:00.56 WebGLExtensionLoseContext.o
41:01.08 nsDataDocumentContentPolicy.o
41:01.13 SharedThreadPool.o
41:03.45 nsDocumentEncoder.o
41:03.54 HTMLOptionElement.o
41:04.03 WebGLExtensionSRGB.o
41:04.87 StreamBuffer.o
41:05.12 nsElementFrameLoaderOwner.o
41:05.69 TextTrack.o
41:06.12 TextTrackCue.o
41:07.10 WebGLExtensionStandardDerivatives.o
41:09.08 HTMLOptionsCollection.o
41:10.79 TextTrackCueList.o
41:10.83 WebGLExtensionTextureFilterAnisotropic.o
41:11.48 nsFormData.o
41:13.00 HTMLOutputElement.o
41:14.96 nsFrameLoader.o
41:14.96 WebGLExtensionTextureFloat.o
41:15.06 TextTrackList.o
41:17.28 HTMLParagraphElement.o
41:17.85 nsFrameMessageManager.o
41:18.89 TextTrackRegion.o
41:19.08 WebGLExtensionTextureFloatLinear.o
41:20.40 HTMLPictureElement.o
41:22.24 VideoFrameContainer.o
41:22.33 WebGLExtensionTextureHalfFloat.o
41:23.12 HTMLPreElement.o
41:24.05 VideoPlaybackQuality.o
41:25.37 WebGLExtensionTextureHalfFloatLinear.o
41:25.95 HTMLProgressElement.o
41:27.08 nsGenConImageContent.o
41:29.24 VideoSegment.o
41:29.31 WebGLExtensionVertexArray.o
41:29.34 HTMLPropertiesCollection.o
41:31.89 HTMLScriptElement.o
41:32.29 WebGLFramebuffer.o
41:32.66 VideoStreamTrack.o
41:34.37 VideoTrack.o
41:34.40 In file included from ../../../dist/include/nsDataHashtable.h:11:0,
41:34.40                  from /opt/FirefoxSource/mozilla-release/content/base/src/nsFrameMessageManager.h:21,
41:34.40                  from /opt/FirefoxSource/mozilla-release/content/base/src/nsFrameMessageManager.cpp:8:
41:34.40 ../../../dist/include/nsBaseHashtable.h: In member function 'void nsFrameScriptExecutor::TryCacheLoadAndCompileScript(const nsAString_internal&, bool, bool, JS::MutableHandle<JSScript*>)':
41:34.40 Warning: -Wmaybe-uninitialized in /opt/FirefoxSource/mozilla-release/objdir-droid/dist/include/nsBaseHashtable.h: 'holder' may be used uninitialized in this function
41:34.40 ../../../dist/include/nsBaseHashtable.h:138:5: warning: 'holder' may be used uninitialized in this function [-Wmaybe-uninitialized]
41:34.40 /opt/FirefoxSource/mozilla-release/content/base/src/nsFrameMessageManager.cpp:1550:44: note: 'holder' was declared here
41:35.05 HTMLSelectElement.o
41:35.07 nsGenericDOMDataNode.o
41:35.86 WebGLFramebufferAttachable.o
41:36.48 VideoTrackList.o
41:37.25 nsGkAtoms.o
41:38.63 HTMLShadowElement.o
41:39.66 VideoUtils.o
41:41.06 WebGLObjectModel.o
41:41.64 nsHTMLContentSerializer.o
41:41.89 WebVTTListener.o
41:42.51 nsHostObjectProtocolHandler.o
41:44.28 HTMLSharedElement.o
41:45.13 nsHostObjectURI.o
41:47.50 /opt/FirefoxSource/mozilla-release/content/media/WebVTTListener.cpp: In member function 'virtual nsresult mozilla::dom::WebVTTListener::OnCue(JS::Handle<JS::Value>, JSContext*)':
41:47.50 Warning: -Wmaybe-uninitialized in /opt/FirefoxSource/mozilla-release/content/media/WebVTTListener.cpp: 'cue' may be used uninitialized in this function
41:47.50 /opt/FirefoxSource/mozilla-release/content/media/WebVTTListener.cpp:173:33: warning: 'cue' may be used uninitialized in this function [-Wmaybe-uninitialized]
41:47.91 nsINode.o
41:48.52 WebGLProgram.o
41:48.52 HTMLSharedListElement.o
41:49.12 nsInProcessTabChildGlobal.o
41:50.06 nsLineBreaker.o
41:51.79 HTMLSharedObjectElement.o
41:51.94 WebGLQuery.o
41:53.89 SVGDocument.o
41:56.05 HTMLSourceElement.o
41:56.54 WebGLRenderbuffer.o
41:57.42 nsMappedAttributeElement.o
41:57.89 WebGLShader.o
41:59.38 nsMappedAttributes.o
41:59.84 HTMLSpanElement.o
42:00.25 HTMLStyleElement.o
42:01.13 nsMixedContentBlocker.o
42:03.24 WebGLShaderPrecisionFormat.o
42:03.61 nsNameSpaceManager.o
42:04.00 DOMSVGAnimatedLengthList.o
42:04.00 DOMSVGAnimatedNumberList.o
42:04.17 HTMLTableCaptionElement.o
42:05.65 nsNoDataProtocolContentPolicy.o
42:06.09 DOMSVGLength.o
42:06.97 WebGLTexelConversions.o
42:07.15 HTMLTableCellElement.o
42:08.22 nsNodeUtils.o
42:08.48 DOMSVGLengthList.o
42:09.00 nsPlainTextSerializer.o
42:10.02 HTMLTableColElement.o
42:10.24 WebGLTexture.o
42:11.03 DOMSVGNumber.o
42:13.32 HTMLTableElement.o
42:13.91 DOMSVGNumberList.o
42:14.48 nsPropertyTable.o
42:16.01 DOMSVGPathSeg.o
42:17.83 nsRange.o
42:17.84 HTMLTableRowElement.o
42:18.39 nsReferencedElement.o
42:18.50 WebGLUniformLocation.o
42:19.64 DOMSVGPathSegList.o
42:22.35 HTMLTableSectionElement.o
42:23.43 WebGLVertexArray.o
42:23.71 DOMSVGPoint.o
42:26.29 DOMSVGPointList.o
42:26.32 nsScriptElement.o
42:26.46 HTMLTemplateElement.o
42:26.73 WebGLVertexArrayFake.o
42:30.55 DOMSVGStringList.o
42:30.55 nsScriptLoader.o
42:31.37 HTMLTextAreaElement.o
42:33.17 DOMSVGTransformList.o
42:33.23 nsStubDocumentObserver.o
42:33.96 WebGLVertexArrayGL.o
42:34.21 HTMLTimeElement.o
42:35.54 SVGAElement.o
42:37.20 nsStubMutationObserver.o
42:37.36 nsStyleLinkElement.o
42:37.49 nsStyledElement.o
42:38.77 SVGAltGlyphElement.o
42:39.05 HTMLTitleElement.o
42:41.51 nsSyncLoadService.o
42:41.53 HTMLTrackElement.o
42:41.54 SVGAngle.o
42:42.15 CDATASection.o
42:42.17 ProcessingInstruction.o
42:44.19 HTMLUnknownElement.o
42:44.32 XMLStylesheetProcessingInstruction.o
42:44.52 SVGAnimateElement.o
42:44.63 nsTextFragment.o
42:46.32 nsXMLElement.o
42:46.56 SVGAnimateMotionElement.o
42:46.72 nsTextNode.o
42:47.18 nsTraversal.o
42:49.35 nsTreeSanitizer.o
42:49.48 SVGAnimateTransformElement.o
42:50.07 HTMLVideoElement.o
42:51.09 SVGAnimatedAngle.o
42:51.46 nsViewportInfo.o
42:52.29 SVGAnimatedBoolean.o
42:53.95 SVGAnimatedEnumeration.o
42:54.00 MediaError.o
42:54.15 SVGAnimatedInteger.o
42:54.41 nsXHTMLContentSerializer.o
42:55.67 nsXMLContentSerializer.o
42:55.77 SVGAnimatedLength.o
42:56.03 SVGAnimatedLengthList.o
42:57.69 SVGAnimatedNumber.o
42:57.90 nsXMLHttpRequest.o
42:58.24 SVGAnimatedNumberList.o
42:58.37 RadioNodeList.o
42:59.68 SVGAnimatedPathSegList.o
43:00.12 XMLDocument.o
43:00.12 nsXMLContentSink.o
43:00.44 nsXMLNameSpaceMap.o
43:01.66 TextTrackManager.o
43:02.58 SVGAnimatedPointList.o
43:24.01 nsXMLFragmentContentSink.o
43:24.11 TimeRanges.o
43:24.95 UndoManager.o
43:25.08 SVGAnimatedPreserveAspectRatio.o
43:27.34 SVGAnimatedRect.o
43:28.48 ValidityState.o
43:28.76 nsXMLPrettyPrinter.o
43:30.29 XULDocument.o
43:30.29 nsXULCommandDispatcher.o
43:30.89 SVGAnimatedString.o
43:32.19 nsDOMStringMap.o
43:32.77 nsFormSubmission.o
43:32.80 SVGAnimatedTransformList.o
43:33.35 nsXULContextMenuBuilder.o
43:33.35 nsXULElement.o
43:37.75 SVGAnimationElement.o
43:37.75 nsGenericHTMLElement.o
43:40.26 nsXULPopupListener.o
43:41.82 SVGAttrValueWrapper.o
43:42.59 nsGenericHTMLFrameElement.o
43:44.85 SVGCircleElement.o
43:47.15 SVGClipPathElement.o
43:49.78 SVGContentUtils.o
43:50.63 nsContentSupportMap.o
43:50.63 nsContentTestNode.o
43:50.80 nsHTMLDNSPrefetch.o
43:52.05 SVGDefsElement.o
43:52.76 nsInstantiationNode.o
43:53.41 nsRDFBinding.o
43:54.35 nsRDFConInstanceTestNode.o
43:54.38 nsIConstraintValidation.o
43:54.93 nsRDFConMemberTestNode.o
43:54.98 nsXULContentSink.o
43:56.40 nsRDFPropertyTestNode.o
43:57.09 SVGDescElement.o
43:57.10 nsRadioVisitor.o
43:58.12 nsRDFQuery.o
43:58.12 nsXULControllers.o
43:58.83 nsResourceSet.o
43:59.38 nsRuleNetwork.o
43:59.58 nsTemplateMatch.o
44:00.17 SVGElementFactory.o
44:00.21 nsTextEditorState.o
44:00.34 nsTemplateRule.o
44:01.69 nsXULPrototypeCache.o
44:01.69 nsTreeRows.o
44:02.35 SVGEllipseElement.o
44:02.41 nsXULPrototypeDocument.o
44:02.82 nsXMLBinding.o
44:04.08 nsXULContentBuilder.o
44:04.19 SVGFEBlendElement.o
44:05.96 nsXULContentUtils.o
44:07.95 nsFilteredContentIterator.o
44:07.95 nsTextServicesDocument.o
44:08.90 SVGFEColorMatrixElement.o
44:10.05 SVGFEComponentTransferElement.o
44:10.61 nsXULSortService.o
44:12.50 nsXULTemplateBuilder.o
44:12.88 ChangeAttributeTxn.o
44:12.89 ChangeCSSInlineStyleTxn.o
44:13.21 SVGFECompositeElement.o
44:13.33 CreateElementTxn.o
44:13.87 nsXULTemplateQueryProcessorRDF.o
44:14.07 DeleteNodeTxn.o
44:14.39 /opt/FirefoxSource/mozilla-release/editor/txtsvc/nsTextServicesDocument.cpp: In member function 'nsresult nsTextServicesDocument::GetUncollapsedSelection(nsITextServicesDocument::TSDBlockSelectionStatus*, int32_t*, int32_t*)':
44:14.39 Warning: -Wmaybe-uninitialized in /opt/FirefoxSource/mozilla-release/editor/txtsvc/nsTextServicesDocument.cpp: 'e2s1' may be used uninitialized in this function
44:14.39 /opt/FirefoxSource/mozilla-release/editor/txtsvc/nsTextServicesDocument.cpp:2826:3: warning: 'e2s1' may be used uninitialized in this function [-Wmaybe-uninitialized]
44:14.39 Warning: -Wmaybe-uninitialized in /opt/FirefoxSource/mozilla-release/editor/txtsvc/nsTextServicesDocument.cpp: 'e1s2' may be used uninitialized in this function
44:14.40 /opt/FirefoxSource/mozilla-release/editor/txtsvc/nsTextServicesDocument.cpp:2826:3: warning: 'e1s2' may be used uninitialized in this function [-Wmaybe-uninitialized]
44:14.40 SVGFEConvolveMatrixElement.o
44:15.94 DeleteRangeTxn.o
44:16.34 nsInternetCiter.o
44:16.34 nsPlaintextDataTransfer.o
44:16.79 nsPlaintextEditor.o
44:17.10 SVGFEDiffuseLightingElement.o
44:17.75 DeleteTextTxn.o
44:19.65 nsXULTemplateQueryProcessorStorage.o
44:19.74 nsTextEditRules.o
44:20.68 SVGFEDisplacementMapElement.o
44:21.27 EditAggregateTxn.o
44:22.49 nsXULTemplateQueryProcessorXML.o
44:24.25 SVGFEDistantLightElement.o
44:24.46 nsTextEditRulesBidi.o
44:24.66 EditTxn.o
44:24.92 nsXULTemplateResultRDF.o
44:25.29 IMETextTxn.o
44:25.55 InsertElementTxn.o
44:28.00 nsXULTemplateResultSetRDF.o
44:28.46 InsertTextTxn.o
44:28.90 nsXULTemplateResultStorage.o
44:30.19 nsXULTemplateResultXML.o
44:30.52 JoinElementTxn.o
44:30.71 nsXULTreeBuilder.o
44:30.73 nsTextEditUtils.o
44:30.75 SVGFEDropShadowElement.o
44:30.95 PlaceholderTxn.o
44:32.86 SetDocTitleTxn.o
44:35.45 SVGFEFloodElement.o
44:35.57 SplitElementTxn.o
44:35.74 SVGFEGaussianBlurElement.o
44:35.88 TextEditorTest.o
44:35.89 TypeInState.o
44:35.96 nsEditProperty.o
44:37.34 nsEditor.o
44:37.97 nsHTMLAbsPosition.o
44:38.25 nsHTMLAnonymousUtils.o
44:38.97 nsTransactionItem.o
44:38.97 nsTransactionList.o
44:39.19 nsEditorCommands.o
45:00.17 SVGFEImageElement.o
45:00.32 nsTransactionManager.o
45:00.57 nsHTMLCSSUtils.o
45:00.99 nsTransactionManagerFactory.o
45:02.27 nsTransactionStack.o
45:03.34 nsComposeTxtSrvFilter.o
45:03.34 nsComposerCommands.o
45:04.21 nsHTMLDataTransfer.o
45:04.22 SVGFEMergeElement.o
45:04.68 nsComposerCommandsUpdater.o
45:07.73 nsComposerController.o
45:07.89 nsEditorController.o
45:08.75 nsComposerDocumentCommands.o
45:09.16 nsHTMLEditRules.o
45:09.17 nsComposerRegistration.o
45:09.84 nsEditorEventListener.o
45:10.03 SVGFEMergeNodeElement.o
45:10.05 nsEditorUtils.o
45:14.62 nsEditingSession.o
45:15.22 SVGFEMorphologyElement.o
45:15.43 nsEditorSpellCheck.o
45:15.69 nsHTMLEditUtils.o
45:15.82 nsSelectionState.o
45:17.95 SVGFEOffsetElement.o
45:18.79 nsStyleSheetTxns.o
45:21.04 nsCSSRuleProcessor.o
45:21.04 nsFontFaceLoader.o
45:21.34 SVGFEPointLightElement.o
45:24.31 nsHTMLEditor.o
45:24.34 AnimationCommon.o
45:24.76 SVGFESpecularLightingElement.o
45:25.53 /opt/FirefoxSource/mozilla-release/layout/style/nsCSSRuleProcessor.cpp: In member function 'nsRestyleHint nsCSSRuleProcessor::HasStateDependentStyle(ElementDependentRuleProcessorData*, mozilla::dom::Element*, nsCSSPseudoElements::Type, mozilla::EventStates)':
45:25.53 Warning: -Wmaybe-uninitialized in /opt/FirefoxSource/mozilla-release/layout/style/nsCSSRuleProcessor.cpp: 'selectorForPseudo' may be used uninitialized in this function
45:25.53 /opt/FirefoxSource/mozilla-release/layout/style/nsCSSRuleProcessor.cpp:2682:52: warning: 'selectorForPseudo' may be used uninitialized in this function [-Wmaybe-uninitialized]
45:25.53 /opt/FirefoxSource/mozilla-release/layout/style/nsCSSRuleProcessor.cpp:2643:22: note: 'selectorForPseudo' was declared here
45:25.54 CSS.o
45:26.77 nsHTMLEditorEventListener.o
45:29.00 SVGFESpotLightElement.o
45:29.04 CSSRuleList.o
45:30.25 CSSStyleSheet.o
45:30.78 CSSVariableDeclarations.o
45:31.47 CSSVariableResolver.o
45:32.49 SVGFETileElement.o
45:32.55 CSSVariableValues.o
45:34.40 CounterStyleManager.o
45:34.85 nsHTMLEditorStyle.o
45:35.15 Declaration.o
45:35.51 /opt/FirefoxSource/mozilla-release/layout/style/CSSStyleSheet.cpp: In member function 'bool nsMediaExpression::Matches(nsPresContext*, const nsCSSValue&) const':
45:35.51 Warning: -Wmaybe-uninitialized in /opt/FirefoxSource/mozilla-release/layout/style/CSSStyleSheet.cpp: 'cmp' may be used uninitialized in this function
45:35.51 /opt/FirefoxSource/mozilla-release/layout/style/CSSStyleSheet.cpp:277:21: warning: 'cmp' may be used uninitialized in this function [-Wmaybe-uninitialized]
45:36.36 SVGFETurbulenceElement.o
45:36.84 ErrorReporter.o
45:37.61 nsHTMLInlineTableEditor.o
45:38.58 ImageLoader.o
45:41.60 Loader.o
45:44.22 SVGFilterElement.o
45:44.23 nsDocumentViewer.o
45:44.23 nsPresArena.o
45:44.55 nsHTMLObjectResizer.o
45:46.37 MediaQueryList.o
45:46.64 nsHTMLURIRefObject.o
45:47.69 SVGForeignObjectElement.o
45:49.59 nsTableEditor.o
45:50.57 nsWSRunObject.o
45:50.57 SVGFragmentIdentifier.o
45:51.41 StyleAnimationValue.o
45:54.31 StyleRule.o
45:54.92 nsPresShell.o
45:55.21 SVGGElement.o
45:55.59 nsRefreshDriver.o
45:57.73 SVGGradientElement.o
45:58.65 /opt/FirefoxSource/mozilla-release/layout/style/StyleAnimationValue.cpp: In function 'void ExtractBorderColor(nsStyleContext*, const void*, mozilla::css::Side, mozilla::StyleAnimationValue&)':
45:58.66 Warning: -Wmaybe-uninitialized in /opt/FirefoxSource/mozilla-release/layout/style/StyleAnimationValue.cpp: 'color' may be used uninitialized in this function
45:58.66 /opt/FirefoxSource/mozilla-release/layout/style/StyleAnimationValue.cpp:3702:25: warning: 'color' may be used uninitialized in this function [-Wmaybe-uninitialized]
45:58.66 /opt/FirefoxSource/mozilla-release/layout/style/StyleAnimationValue.cpp:2726:11: note: 'color' was declared here
45:58.66 /opt/FirefoxSource/mozilla-release/layout/style/StyleAnimationValue.cpp: In static member function 'static bool mozilla::StyleAnimationValue::ExtractComputedValue(nsCSSProperty, nsStyleContext*, mozilla::StyleAnimationValue&)':
45:58.66 Warning: -Wmaybe-uninitialized in /opt/FirefoxSource/mozilla-release/layout/style/StyleAnimationValue.cpp: 'color' may be used uninitialized in this function
45:58.66 /opt/FirefoxSource/mozilla-release/layout/style/StyleAnimationValue.cpp:3702:25: warning: 'color' may be used uninitialized in this function [-Wmaybe-uninitialized]
45:58.66 /opt/FirefoxSource/mozilla-release/layout/style/StyleAnimationValue.cpp:2959:19: note: 'color' was declared here
45:58.66 nsAnimationManager.o
46:00.02 SVGGraphicsElement.o
46:02.71 SVGIFrameElement.o
46:03.25 nsCSSAnonBoxes.o
46:03.57 SVGImageElement.o
46:05.18 nsCSSDataBlock.o
46:05.46 SVGIntegerPairSMILType.o
46:08.77 nsLineLayout.o
46:08.77 nsObjectFrame.o
46:09.58 nsCSSKeywords.o
46:10.58 SVGLength.o
46:11.82 ActiveLayerTracker.o
46:12.06 nsCSSParser.o
46:12.69 SVGLengthList.o
46:12.92 nsCSSProps.o
46:13.51 FrameChildList.o
46:15.14 SVGLengthListSMILType.o
46:20.70 SVGLineElement.o
46:22.72 SVGMPathElement.o
46:24.23 /opt/FirefoxSource/mozilla-release/layout/style/nsCSSParser.cpp: In member function 'bool {anonymous}::CSSParserImpl::ParseGridLine(nsCSSValue&)':
46:24.23 Warning: -Wmaybe-uninitialized in /opt/FirefoxSource/mozilla-release/layout/style/nsCSSParser.cpp: 'integer' may be used uninitialized in this function
46:24.23 /opt/FirefoxSource/mozilla-release/layout/style/nsCSSParser.cpp:8583:56: warning: 'integer' may be used uninitialized in this function [-Wmaybe-uninitialized]
46:24.23 /opt/FirefoxSource/mozilla-release/layout/style/nsCSSParser.cpp:8525:11: note: 'integer' was declared here
46:25.25 SVGMarkerElement.o
46:27.94 SVGMaskElement.o
46:34.98 MathMLTextRunFactory.o
46:34.98 DisplayItemClip.o
46:34.99 SVGMatrix.o
47:02.10 SVGMetadataElement.o
47:04.51 ScrollbarActivity.o
47:04.73 SVGMotionSMILAnimationFunction.o
47:05.79 DisplayListClipState.o
47:05.79 nsCSSPseudoClasses.o
47:07.03 /opt/FirefoxSource/mozilla-release/layout/generic/MathMLTextRunFactory.cpp: In member function 'virtual void MathMLTextRunFactory::RebuildTextRun(nsTransformedTextRun*, gfxContext*)':
47:07.04 Warning: -Wmaybe-uninitialized in /opt/FirefoxSource/mozilla-release/layout/generic/MathMLTextRunFactory.cpp: 'mathVar' may be used uninitialized in this function
47:07.04 /opt/FirefoxSource/mozilla-release/layout/generic/MathMLTextRunFactory.cpp:692:10: warning: 'mathVar' may be used uninitialized in this function [-Wmaybe-uninitialized]
47:07.04 /opt/FirefoxSource/mozilla-release/layout/generic/MathMLTextRunFactory.cpp:590:11: note: 'mathVar' was declared here
47:07.04 StickyScrollContainer.o
47:07.85 SVGMotionSMILAttr.o
47:08.35 FrameLayerBuilder.o
47:08.61 nsCSSPseudoElements.o
47:11.29 FramePropertyTable.o
47:31.64 SVGMotionSMILPathUtils.o
47:31.65 TextOverflow.o
47:31.66 nsCSSRules.o
47:32.33 nsCSSScanner.o
47:34.73 SVGMotionSMILType.o
47:35.47 nsAbsoluteContainingBlock.o
47:36.13 SVGNumberList.o
47:37.38 SVGNumberListSMILType.o
47:38.60 nsCSSValue.o
47:38.64 GeometryUtils.o
47:39.13 MaskLayerImageCache.o
47:39.36 nsComputedDOMStyle.o
47:39.99 nsBRFrame.o
47:40.35 SVGNumberPairSMILType.o
47:42.34 SVGOrientSMILType.o
47:42.87 nsDOMCSSAttrDeclaration.o
47:42.95 nsBlockFrame.o
47:43.13 PaintTracker.o
47:43.56 SVGPathData.o
47:45.39 PositionedEventTargeting.o
47:45.83 RestyleManager.o
47:46.36 nsBlockReflowContext.o
47:46.92 SVGPathElement.o
47:49.63 RestyleTracker.o
47:49.84 /opt/FirefoxSource/mozilla-release/layout/style/nsComputedDOMStyle.cpp: In member function 'mozilla::dom::CSSValue* nsComputedDOMStyle::DoGetOutlineWidth()':
47:49.85 Warning: -Wmaybe-uninitialized in /opt/FirefoxSource/mozilla-release/layout/style/nsComputedDOMStyle.cpp: 'width' may be used uninitialized in this function
47:49.85 /opt/FirefoxSource/mozilla-release/layout/style/nsComputedDOMStyle.cpp:2696:26: warning: 'width' may be used uninitialized in this function [-Wmaybe-uninitialized]
47:49.85 /opt/FirefoxSource/mozilla-release/layout/style/nsComputedDOMStyle.cpp: In member function 'mozilla::dom::CSSValue* nsComputedDOMStyle::DoGetTextDecorationColor()':
47:49.85 Warning: -Wmaybe-uninitialized in /opt/FirefoxSource/mozilla-release/layout/style/nsComputedDOMStyle.cpp: 'color' may be used uninitialized in this function
47:49.85 /opt/FirefoxSource/mozilla-release/layout/style/nsComputedDOMStyle.cpp:3121:29: warning: 'color' may be used uninitialized in this function [-Wmaybe-uninitialized]
47:49.85 /opt/FirefoxSource/mozilla-release/layout/style/nsComputedDOMStyle.cpp: In member function 'mozilla::dom::CSSValue* nsComputedDOMStyle::GetBorderColorFor(mozilla::css::Side)':
47:49.85 Warning: -Wmaybe-uninitialized in /opt/FirefoxSource/mozilla-release/layout/style/nsComputedDOMStyle.cpp: 'color' may be used uninitialized in this function
47:49.85 /opt/FirefoxSource/mozilla-release/layout/style/nsComputedDOMStyle.cpp:4426:29: warning: 'color' may be used uninitialized in this function [-Wmaybe-uninitialized]
47:49.85 nsDOMCSSDeclaration.o
47:50.21 SVGPathSegListSMILType.o
47:53.13 /opt/FirefoxSource/mozilla-release/layout/generic/nsBlockFrame.cpp: In member function 'void nsBlockFrame::AddFrames(nsFrameList&, nsIFrame*)':
47:53.13 Warning: -Wmaybe-uninitialized in /opt/FirefoxSource/mozilla-release/layout/generic/nsBlockFrame.cpp: 'overflowLines' may be used uninitialized in this function
47:53.13 /opt/FirefoxSource/mozilla-release/layout/generic/nsBlockFrame.cpp:4959:72: warning: 'overflowLines' may be used uninitialized in this function [-Wmaybe-uninitialized]
47:53.14 nsBlockReflowState.o
47:57.20 SVGPathSegUtils.o
47:58.59 /opt/FirefoxSource/mozilla-release/layout/base/RestyleManager.cpp: In member function 'void mozilla::ElementRestyler::RestyleChildren(nsRestyleHint)':
47:58.59 Warning: -Wmaybe-uninitialized in /opt/FirefoxSource/mozilla-release/layout/base/RestyleManager.cpp: 'lastContinuation' may be used uninitialized in this function
47:58.59 /opt/FirefoxSource/mozilla-release/layout/base/RestyleManager.cpp:2622:41: warning: 'lastContinuation' may be used uninitialized in this function [-Wmaybe-uninitialized]
47:58.59 /opt/FirefoxSource/mozilla-release/layout/base/RestyleManager.cpp:2605:13: note: 'lastContinuation' was declared here
47:58.60 SelectionCarets.o
48:10.48 nsDOMCSSRGBColor.o
48:11.48 SVGPatternElement.o
48:15.89 StackArena.o
48:42.20 TouchCaret.o
49:07.12 nsBidi.o
49:11.54 nsBulletFrame.o
49:11.67 SVGPointList.o
50:04.78 nsDOMCSSRect.o
50:07.11 nsDOMCSSValueList.o
50:07.81 nsCanvasFrame.o
50:08.19 nsHTMLCSSStyleSheet.o
50:09.01 nsHTMLStyleSheet.o
50:09.66 nsBidiPresUtils.o
50:10.80 nsCSSColorUtils.o
50:10.86 SVGPointListSMILType.o
50:12.28 nsLayoutStylesheetCache.o
50:13.49 nsColumnSetFrame.o
50:14.10 SVGPolygonElement.o
50:15.83 nsMediaFeatures.o
50:16.72 SVGPolylineElement.o
50:17.52 nsCSSFrameConstructor.o
50:17.84 nsCSSRendering.o
50:18.70 nsNthIndexCache.o
50:20.09 nsContainerFrame.o
50:20.99 SVGPreserveAspectRatio.o
50:22.19 nsROCSSPrimitiveValue.o
50:23.95 SVGRect.o
50:24.17 nsRuleData.o
50:24.20 nsFirstLetterFrame.o
50:25.85 nsRuleNode.o
50:26.08 SVGRectElement.o
50:26.83 nsStyleContext.o
50:28.86 nsFlexContainerFrame.o
50:28.92 SVGSVGElement.o
50:28.97 nsCSSRenderingBorders.o
50:31.67 SVGScriptElement.o
50:32.13 nsFloatManager.o
51:09.40 /opt/FirefoxSource/mozilla-release/layout/base/nsCSSRendering.cpp: In function 'bool _ZL14IsOpaqueBorderRK13nsStyleBorder.part.39(const nsStyleBorder&)':
51:09.40 Warning: -Wmaybe-uninitialized in /opt/FirefoxSource/mozilla-release/layout/base/nsCSSRendering.cpp: 'color' may be used uninitialized in this function
51:09.40 /opt/FirefoxSource/mozilla-release/layout/base/nsCSSRendering.cpp:1667:50: warning: 'color' may be used uninitialized in this function [-Wmaybe-uninitialized]
51:09.40 /opt/FirefoxSource/mozilla-release/layout/base/nsCSSRendering.cpp:1658:11: note: 'color' was declared here
51:09.40 /opt/FirefoxSource/mozilla-release/layout/base/nsCSSRendering.cpp: In static member function 'static void nsCSSRendering::PaintOutline(nsPresContext*, nsRenderingContext&, nsIFrame*, const nsRect&, const nsRect&, nsStyleContext*)':
51:09.40 Warning: -Wmaybe-uninitialized in /opt/FirefoxSource/mozilla-release/layout/base/nsCSSRendering.cpp: 'width' may be used uninitialized in this function
51:09.40 /opt/FirefoxSource/mozilla-release/layout/base/nsCSSRendering.cpp:852:65: warning: 'width' may be used uninitialized in this function [-Wmaybe-uninitialized]
51:09.40 /opt/FirefoxSource/mozilla-release/layout/base/nsCSSRendering.cpp: In static member function 'static void nsCSSRendering::PaintGradient(nsPresContext*, nsRenderingContext&, nsStyleGradient*, const nsRect&, const nsRect&, const nsRect&, const CSSIntRect&, const nsSize&)':
51:09.40 Warning: -Wmaybe-uninitialized in /opt/FirefoxSource/mozilla-release/layout/base/nsCSSRendering.cpp: 'position' may be used uninitialized in this function
51:09.40 /opt/FirefoxSource/mozilla-release/layout/base/nsCSSRendering.cpp:353:40: warning: 'position' may be used uninitialized in this function [-Wmaybe-uninitialized]
51:09.40 /opt/FirefoxSource/mozilla-release/layout/base/nsCSSRendering.cpp:2287:12: note: 'position' was declared here
51:09.40 /opt/FirefoxSource/mozilla-release/layout/base/nsCSSRendering.cpp: In static member function 'static void nsCSSRendering::PaintBackgroundWithSC(nsPresContext*, nsRenderingContext&, nsIFrame*, const nsRect&, const nsRect&, nsStyleContext*, const nsStyleBorder&, uint32_t, nsRect*, int32_t)':
51:09.40 Warning: -Wmaybe-uninitialized in /opt/FirefoxSource/mozilla-release/layout/base/nsCSSRendering.cpp: 'isSolidBorder' may be used uninitialized in this function
51:09.40 /opt/FirefoxSource/mozilla-release/layout/base/nsCSSRendering.cpp:2805:9: warning: 'isSolidBorder' may be used uninitialized in this function [-Wmaybe-uninitialized]
51:09.40 /opt/FirefoxSource/mozilla-release/layout/base/nsCSSRendering.cpp:2718:8: note: 'isSolidBorder' was declared here
51:09.40 Warning: -Wmaybe-uninitialized in /opt/FirefoxSource/mozilla-release/layout/base/nsCSSRendering.cpp: 'currentBackgroundClip' may be used uninitialized in this function
51:09.40 /opt/FirefoxSource/mozilla-release/layout/base/nsCSSRendering.cpp:2809:9: warning: 'currentBackgroundClip' may be used uninitialized in this function [-Wmaybe-uninitialized]
51:09.40 /opt/FirefoxSource/mozilla-release/layout/base/nsCSSRendering.cpp:2717:11: note: 'currentBackgroundClip' was declared here
51:09.40 /opt/FirefoxSource/mozilla-release/layout/style/nsRuleNode.cpp: In static member function 'static nscoord nsRuleNode::CalcFontPointSize(int32_t, int32_t, nsPresContext*, nsFontSizeType)':
51:09.40 Warning: -Wmaybe-uninitialized in /opt/FirefoxSource/mozilla-release/layout/style/nsRuleNode.cpp: 'column' may be used uninitialized in this function
51:09.40 /opt/FirefoxSource/mozilla-release/layout/style/nsRuleNode.cpp:2884:55: warning: 'column' may be used uninitialized in this function [-Wmaybe-uninitialized]
51:09.40 /opt/FirefoxSource/mozilla-release/layout/style/nsRuleNode.cpp:2862:12: note: 'column' was declared here
51:09.40 /opt/FirefoxSource/mozilla-release/layout/style/nsRuleNode.cpp: In static member function 'static bool nsRuleNode::HasAuthorSpecifiedRules(nsStyleContext*, uint32_t, bool)':
51:09.40 Warning: -Wmaybe-uninitialized in /opt/FirefoxSource/mozilla-release/layout/style/nsRuleNode.cpp: 'textShadowOffset' may be used uninitialized in this function
51:09.40 /opt/FirefoxSource/mozilla-release/layout/style/nsRuleNode.cpp:9096:65: warning: 'textShadowOffset' may be used uninitialized in this function [-Wmaybe-uninitialized]
51:09.41 Warning: -Wmaybe-uninitialized in /opt/FirefoxSource/mozilla-release/layout/style/nsRuleNode.cpp: 'paddingOffset' may be used uninitialized in this function
51:09.41 /opt/FirefoxSource/mozilla-release/layout/style/nsRuleNode.cpp:9092:65: warning: 'paddingOffset' may be used uninitialized in this function [-Wmaybe-uninitialized]
51:09.41 Warning: -Wmaybe-uninitialized in /opt/FirefoxSource/mozilla-release/layout/style/nsRuleNode.cpp: 'borderOffset' may be used uninitialized in this function
51:09.41 /opt/FirefoxSource/mozilla-release/layout/style/nsRuleNode.cpp:9088:63: warning: 'borderOffset' may be used uninitialized in this function [-Wmaybe-uninitialized]
51:09.41 nsStyleCoord.o
51:09.41 nsCaret.o
51:10.03 /opt/FirefoxSource/mozilla-release/layout/generic/nsFlexContainerFrame.cpp: In member function 'void nsFlexContainerFrame::DoFlexLayout(nsPresContext*, nsHTMLReflowMetrics&, const nsHTMLReflowState&, nsReflowStatus&, nscoord, nscoord, nsTArray<nsFlexContainerFrame::StrutInfo>&, const nsFlexContainerFrame::FlexboxAxisTracker&)':
51:10.03 Warning: -Wmaybe-uninitialized in /opt/FirefoxSource/mozilla-release/layout/generic/nsFlexContainerFrame.cpp: 'flexContainerAscent' may be used uninitialized in this function
51:10.03 /opt/FirefoxSource/mozilla-release/layout/generic/nsFlexContainerFrame.cpp:3392:3: warning: 'flexContainerAscent' may be used uninitialized in this function [-Wmaybe-uninitialized]
51:10.03 /opt/FirefoxSource/mozilla-release/layout/generic/nsFlexContainerFrame.cpp:3214:11: note: 'flexContainerAscent' was declared here
51:10.04 nsFontInflationData.o
51:10.38 SVGSetElement.o
51:12.40 nsCounterManager.o
51:12.40 /opt/FirefoxSource/mozilla-release/layout/style/nsStyleContext.cpp: In member function 'nsChangeHint nsStyleContext::CalcStyleDifference(nsStyleContext*, nsChangeHint)':
51:12.40 Warning: -Wmaybe-uninitialized in /opt/FirefoxSource/mozilla-release/layout/style/nsStyleContext.cpp: 'otherVisDecColor' may be used uninitialized in this function
51:12.40 /opt/FirefoxSource/mozilla-release/layout/style/nsStyleContext.cpp:610:7: warning: 'otherVisDecColor' may be used uninitialized in this function [-Wmaybe-uninitialized]
51:12.40 /opt/FirefoxSource/mozilla-release/layout/style/nsStyleContext.cpp:604:32: note: 'otherVisDecColor' was declared here
51:12.40 Warning: -Wmaybe-uninitialized in /opt/FirefoxSource/mozilla-release/layout/style/nsStyleContext.cpp: 'thisVisDecColor' may be used uninitialized in this function
51:12.40 /opt/FirefoxSource/mozilla-release/layout/style/nsStyleContext.cpp:610:7: warning: 'thisVisDecColor' may be used uninitialized in this function [-Wmaybe-uninitialized]
51:12.40 /opt/FirefoxSource/mozilla-release/layout/style/nsStyleContext.cpp:604:15: note: 'thisVisDecColor' was declared here
51:12.40 Warning: -Wmaybe-uninitialized in /opt/FirefoxSource/mozilla-release/layout/style/nsStyleContext.cpp: 'otherColor' may be used uninitialized in this function
51:12.40 /opt/FirefoxSource/mozilla-release/layout/style/nsStyleContext.cpp:580:7: warning: 'otherColor' may be used uninitialized in this function [-Wmaybe-uninitialized]
51:12.40 /opt/FirefoxSource/mozilla-release/layout/style/nsStyleContext.cpp:579:26: note: 'otherColor' was declared here
51:12.40 Warning: -Wmaybe-uninitialized in /opt/FirefoxSource/mozilla-release/layout/style/nsStyleContext.cpp: 'otherColor' may be used uninitialized in this function
51:12.40 /opt/FirefoxSource/mozilla-release/layout/style/nsStyleContext.cpp:567:9: warning: 'otherColor' may be used uninitialized in this function [-Wmaybe-uninitialized]
51:12.40 /opt/FirefoxSource/mozilla-release/layout/style/nsStyleContext.cpp:564:28: note: 'otherColor' was declared here
51:12.40 Warning: -Wmaybe-uninitialized in /opt/FirefoxSource/mozilla-release/layout/style/nsStyleContext.cpp: 'thisColor' may be used uninitialized in this function
51:12.40 /opt/FirefoxSource/mozilla-release/layout/style/nsStyleContext.cpp:567:9: warning: 'thisColor' may be used uninitialized in this function [-Wmaybe-uninitialized]
51:12.40 /opt/FirefoxSource/mozilla-release/layout/style/nsStyleContext.cpp:564:17: note: 'thisColor' was declared here
51:12.40 nsStyleSet.o
51:12.73 nsFrame.o
51:13.23 SVGStopElement.o
51:13.86 nsStyleStruct.o
51:15.97 SVGStringList.o
51:17.75 nsFrameList.o
51:24.61 SVGStyleElement.o
51:24.61 nsDisplayList.o
51:26.80 nsStyleTransformMatrix.o
51:27.71 SVGSwitchElement.o
51:29.40 In file included from ../../dist/include/nsAString.h:23:0,
51:29.40                  from ../../dist/include/nsSubstring.h:10,
51:29.40                  from ../../dist/include/nsString.h:12,
51:29.40                  from ../../dist/include/nsStringGlue.h:18,
51:29.40                  from ../../dist/include/nsHashKeys.h:18,
51:29.40                  from /opt/FirefoxSource/mozilla-release/layout/base/nsIPresShell.h:28,
51:29.40                  from /opt/FirefoxSource/mozilla-release/layout/base/nsPresContext.h:16,
51:29.40                  from /opt/FirefoxSource/mozilla-release/layout/base/../style/nsRuleNode.h:14,
51:29.40                  from /opt/FirefoxSource/mozilla-release/layout/base/../style/nsStyleContext.h:11,
51:29.40                  from /opt/FirefoxSource/mozilla-release/layout/base/../generic/nsIFrame.h:25,
51:29.40                  from /opt/FirefoxSource/mozilla-release/layout/base/nsGenConList.h:11,
51:29.40                  from /opt/FirefoxSource/mozilla-release/layout/base/nsCounterManager.h:13,
51:29.40                  from /opt/FirefoxSource/mozilla-release/layout/base/nsCounterManager.cpp:9:
51:29.40 ../../dist/include/nsTSubstring.h: In member function 'void nsCounterUseNode::GetText(nsString&)':
51:29.40 Warning: -Wmaybe-uninitialized in /opt/FirefoxSource/mozilla-release/objdir-droid/dist/include/nsTSubstring.h: 'separator' may be used uninitialized in this function
51:29.40 ../../dist/include/nsTSubstring.h:526:40: warning: 'separator' may be used uninitialized in this function [-Wmaybe-uninitialized]
51:29.40 /opt/FirefoxSource/mozilla-release/layout/base/nsCounterManager.cpp:94:21: note: 'separator' was declared here
51:29.40 nsDisplayListInvalidation.o
51:31.14 /opt/FirefoxSource/mozilla-release/layout/style/nsStyleStruct.cpp: In member function 'nsChangeHint nsStyleTextReset::CalcDifference(const nsStyleTextReset&) const':
51:31.14 Warning: -Wmaybe-uninitialized in /opt/FirefoxSource/mozilla-release/layout/style/nsStyleStruct.cpp: 'otherDecColor' may be used uninitialized in this function
51:31.14 /opt/FirefoxSource/mozilla-release/layout/style/nsStyleStruct.cpp:3037:5: warning: 'otherDecColor' may be used uninitialized in this function [-Wmaybe-uninitialized]
51:31.14 Warning: -Wmaybe-uninitialized in /opt/FirefoxSource/mozilla-release/layout/style/nsStyleStruct.cpp: 'decColor' may be used uninitialized in this function
51:31.14 /opt/FirefoxSource/mozilla-release/layout/style/nsStyleStruct.cpp:3037:5: warning: 'decColor' may be used uninitialized in this function [-Wmaybe-uninitialized]
51:33.39 /opt/FirefoxSource/mozilla-release/layout/generic/nsFrame.cpp: In static member function 'static int32_t nsFrame::GetLineNumber(nsIFrame*, bool, nsIFrame**)':
51:33.39 Warning: -Wmaybe-uninitialized in /opt/FirefoxSource/mozilla-release/layout/generic/nsFrame.cpp: 'thisBlock' may be used uninitialized in this function
51:33.39 /opt/FirefoxSource/mozilla-release/layout/generic/nsFrame.cpp:6747:42: warning: 'thisBlock' may be used uninitialized in this function [-Wmaybe-uninitialized]
51:33.39 /opt/FirefoxSource/mozilla-release/layout/generic/nsFrame.cpp: In member function 'nsresult nsIFrame::PeekOffsetParagraph(nsPeekOffsetStruct*)':
51:33.40 Warning: -Wmaybe-uninitialized in /opt/FirefoxSource/mozilla-release/layout/generic/nsFrame.cpp: 'blockFrameOrBR.nsContentAndOffset::mOffset' may be used uninitialized in this function
51:33.40 /opt/FirefoxSource/mozilla-release/layout/generic/nsFrame.cpp:6225:54: warning: 'blockFrameOrBR.nsContentAndOffset::mOffset' may be used uninitialized in this function [-Wmaybe-uninitialized]
51:33.40 /opt/FirefoxSource/mozilla-release/layout/generic/nsFrame.cpp: In member function 'bool nsIFrame::FinishAndStoreOverflow(nsOverflowAreas&, nsSize, nsSize*)':
51:33.40 Warning: -Wmaybe-uninitialized in /opt/FirefoxSource/mozilla-release/layout/generic/nsFrame.cpp: 'width' may be used uninitialized in this function
51:33.40 /opt/FirefoxSource/mozilla-release/layout/generic/nsFrame.cpp:7189:37: warning: 'width' may be used uninitialized in this function [-Wmaybe-uninitialized]
51:33.40 /opt/FirefoxSource/mozilla-release/layout/generic/nsFrame.cpp:7110:11: note: 'width' was declared here
51:33.40 nsFrameSetFrame.o
51:42.72 nsStyleUtil.o
51:44.19 nsFrameState.o
51:44.28 SVGSymbolElement.o
51:44.60 nsTransitionManager.o
51:47.71 SVGTSpanElement.o
51:50.03 SVGTests.o
51:50.09 nsFrameUtil.o
51:51.76 SVGTextContentElement.o
51:52.47 /opt/FirefoxSource/mozilla-release/layout/base/nsDisplayList.cpp: In static member function 'static bool nsDisplayBackgroundImage::AppendBackgroundItemsToTop(nsDisplayListBuilder*, nsIFrame*, nsDisplayList*)':
51:52.47 Warning: -Wmaybe-uninitialized in /opt/FirefoxSource/mozilla-release/layout/base/nsDisplayList.cpp: 'color' may be used uninitialized in this function
51:52.47 /opt/FirefoxSource/mozilla-release/layout/base/nsDisplayList.cpp:1880:3: warning: 'color' may be used uninitialized in this function [-Wmaybe-uninitialized]
51:52.49 nsFrameManager.o
51:54.23 nsFrameTraversal.o
51:54.79 SVGTextElement.o
51:55.49 nsButtonFrameRenderer.o
51:55.49 nsColorControlFrame.o
51:55.75 nsGfxScrollFrame.o
51:57.16 nsGenConList.o
51:57.86 nsGridContainerFrame.o
51:58.16 SVGTextPathElement.o
52:05.40 nsHTMLCanvasFrame.o
52:07.47 nsHTMLReflowMetrics.o
52:10.77 nsLayoutDebugger.o
52:10.77 SVGTextPositioningElement.o
52:11.90 nsComboboxControlFrame.o
52:13.37 nsLayoutHistoryState.o
52:13.41 nsHTMLReflowState.o
52:13.77 SVGTitleElement.o
52:17.01 nsImageFrame.o
52:17.83 SVGTransform.o
52:17.83 nsLayoutUtils.o
52:18.71 nsFieldSetFrame.o
52:19.33 nsPresContext.o
52:20.21 SVGTransformList.o
52:22.18 /opt/FirefoxSource/mozilla-release/layout/generic/nsHTMLReflowState.cpp: In member function 'void nsHTMLReflowState::InitConstraints(nsPresContext*, nscoord, nscoord, const nsMargin*, const nsMargin*, nsIAtom*)':
52:22.18 Warning: -Wmaybe-uninitialized in /opt/FirefoxSource/mozilla-release/layout/generic/nsHTMLReflowState.cpp: 'fType' may be used uninitialized in this function
52:22.18 /opt/FirefoxSource/mozilla-release/layout/generic/nsHTMLReflowState.cpp:1992:37: warning: 'fType' may be used uninitialized in this function [-Wmaybe-uninitialized]
52:22.19 nsImageMap.o
52:24.37 SVGTransformListParser.o
52:26.74 nsFileControlFrame.o
52:26.84 SVGTransformListSMILType.o
52:28.80 SVGTransformableElement.o
52:29.51 nsInlineFrame.o
52:29.52 SVGUseElement.o
52:30.34 /opt/FirefoxSource/mozilla-release/layout/base/nsLayoutUtils.cpp: In static member function 'static nscoord nsLayoutUtils::ComputeWidthValue(nsRenderingContext*, nsIFrame*, nscoord, nscoord, nscoord, const nsStyleCoord&)':
52:30.34 Warning: -Wmaybe-uninitialized in /opt/FirefoxSource/mozilla-release/layout/base/nsLayoutUtils.cpp: 'result' may be used uninitialized in this function
52:30.34 /opt/FirefoxSource/mozilla-release/layout/base/nsLayoutUtils.cpp:3971:11: warning: 'result' may be used uninitialized in this function [-Wmaybe-uninitialized]
52:30.35 nsQuoteList.o
52:31.83 nsFormControlFrame.o
52:33.24 SVGViewBoxSMILType.o
52:33.57 nsIntervalSet.o
52:36.32 nsGfxButtonControlFrame.o
52:36.39 SVGViewElement.o
52:37.76 nsLeafFrame.o
52:37.99 nsLineBox.o
52:38.26 SVGZoomEvent.o
52:39.37 nsStyleChangeList.o
52:39.54 nsGfxCheckboxControlFrame.o
52:40.57 nsISVGPoint.o
52:41.10 nsPageContentFrame.o
52:44.62 nsGfxRadioControlFrame.o
52:44.62 nsSVGAngle.o
52:44.62 nsStyleSheetService.o
52:44.62 nsPageFrame.o
52:47.40 nsSVGAnimatedTransformList.o
52:50.46 nsSVGBoolean.o
53:48.84 nsHTMLButtonControlFrame.o
53:52.01 nsPlaceholderFrame.o
53:52.82 nsImageControlFrame.o
53:55.59 nsSVGClass.o
53:56.35 nsLegendFrame.o
53:56.56 nsSelection.o
53:57.80 /opt/FirefoxSource/mozilla-release/content/svg/content/src/nsSVGBoolean.cpp: In member function 'nsresult nsSVGBoolean::SetBaseValueAtom(const nsIAtom*, nsSVGElement*)':
53:57.80 Warning: -Wmaybe-uninitialized in /opt/FirefoxSource/mozilla-release/content/svg/content/src/nsSVGBoolean.cpp: 'val' may be used uninitialized in this function
53:57.80 /opt/FirefoxSource/mozilla-release/content/svg/content/src/nsSVGBoolean.cpp:68:24: warning: 'val' may be used uninitialized in this function [-Wmaybe-uninitialized]
53:57.94 /opt/FirefoxSource/mozilla-release/layout/base/nsStyleSheetService.cpp: In member function 'virtual nsresult nsStyleSheetService::UnregisterSheet(nsIURI*, uint32_t)':
53:57.94 Warning: -Wmaybe-uninitialized in /opt/FirefoxSource/mozilla-release/layout/base/nsStyleSheetService.cpp: 'message' may be used uninitialized in this function
53:57.94 /opt/FirefoxSource/mozilla-release/layout/base/nsStyleSheetService.cpp:266:51: warning: 'message' may be used uninitialized in this function [-Wmaybe-uninitialized]
53:59.02 BasicTableLayoutStrategy.o
53:59.02 FixedTableLayoutStrategy.o
53:59.84 nsSimplePageSequenceFrame.o
53:59.94 nsSVGDataParser.o
54:01.22 nsListControlFrame.o
54:03.51 nsSVGElement.o
54:03.82 SpanningCellSorter.o
54:04.55 nsSVGEnum.o
54:04.80 nsMeterFrame.o
54:07.20 nsCellMap.o
54:08.35 nsTableCellFrame.o
54:08.48 nsSplittableFrame.o
54:10.15 nsSVGFeatures.o
54:11.74 nsNumberControlFrame.o
54:12.16 nsSVGFilters.o
54:13.48 nsSubDocumentFrame.o
54:13.51 nsTableColFrame.o
54:13.58 nsSVGInteger.o
54:15.93 nsProgressFrame.o
54:16.32 nsTextFrame.o
54:18.33 nsSVGIntegerPair.o
54:20.44 nsTableColGroupFrame.o
54:20.53 nsSVGLength2.o
54:21.81 nsRangeFrame.o
54:22.20 nsTextFrameUtils.o
54:22.83 nsSVGNumber2.o
54:24.90 nsTableFrame.o
54:26.29 nsSVGNumberPair.o
54:27.54 nsSelectsAreaFrame.o
54:29.96 nsTableOuterFrame.o
54:31.82 nsTextRunTransformations.o
54:33.19 nsSVGPathDataParser.o
54:35.44 nsSVGPathGeometryElement.o
54:38.26 /opt/FirefoxSource/mozilla-release/layout/tables/nsTableFrame.cpp: In member function 'void nsTableFrame::HomogenousInsertFrames(nsIFrame::ChildListID, nsIFrame*, nsFrameList&)':
54:38.26 Warning: -Wmaybe-uninitialized in /opt/FirefoxSource/mozilla-release/layout/tables/nsTableFrame.cpp: 'content' may be used uninitialized in this function
54:38.26 /opt/FirefoxSource/mozilla-release/layout/tables/nsTableFrame.cpp:2343:59: warning: 'content' may be used uninitialized in this function [-Wmaybe-uninitialized]
54:38.26 /opt/FirefoxSource/mozilla-release/layout/tables/nsTableFrame.cpp:2337:19: note: 'content' was declared here
54:55.31 nsVideoFrame.o
54:56.82 nsTextControlFrame.o
54:56.94 nsTablePainter.o
54:57.49 nsSVGPolyElement.o
54:58.78 nsViewportFrame.o
55:00.77 /opt/FirefoxSource/mozilla-release/layout/tables/nsTableOuterFrame.cpp: In member function 'virtual void nsTableOuterFrame::Reflow(nsPresContext*, nsHTMLReflowMetrics&, const nsHTMLReflowState&, nsReflowStatus&)':
55:00.77 Warning: -Wmaybe-uninitialized in /opt/FirefoxSource/mozilla-release/layout/tables/nsTableOuterFrame.cpp: 'captionFirstReflow' may be used uninitialized in this function
55:00.77 /opt/FirefoxSource/mozilla-release/layout/tables/nsTableOuterFrame.cpp:1036:59: warning: 'captionFirstReflow' may be used uninitialized in this function [-Wmaybe-uninitialized]
55:00.77 /opt/FirefoxSource/mozilla-release/layout/tables/nsTableOuterFrame.cpp:903:8: note: 'captionFirstReflow' was declared here
55:00.77 nsTableRowFrame.o
55:00.81 nsSVGString.o
55:03.50 nsSVGTransform.o
55:04.15 nsTableRowGroupFrame.o
55:05.67 nsSVGViewBox.o
55:05.84 SVGFEContainerFrame.o
55:05.84 SVGFEImageFrame.o
55:08.09 SVGFELeafFrame.o
55:08.91 SVGFEUnstyledLeafFrame.o
55:09.21 nsBox.o
55:09.21 nsBoxFrame.o
55:11.34 SVGTextFrame.o
55:12.33 RenderFrameChild.o
55:12.33 RenderFrameParent.o
55:12.54 nsMathMLChar.o
55:12.54 nsMathMLContainerFrame.o
55:12.79 nsBoxLayout.o
55:15.57 SVGViewFrame.o
55:17.05 nsBoxLayoutState.o
55:17.59 nsMathMLFrame.o
55:19.20 nsBoxObject.o
55:20.29 nsButtonBoxFrame.o
55:39.38 nsMathMLOperators.o
55:40.99 nsContainerBoxObject.o
56:00.41 nsDeckFrame.o
56:00.48 nsFilterInstance.o
56:03.81 nsMathMLSelectedFrame.o
56:04.19 nsDocElementBoxFrame.o
56:05.24 nsMathMLTokenFrame.o
56:05.57 nsSVGAFrame.o
56:06.29 nsMathMLmactionFrame.o
56:07.40 nsGroupBoxFrame.o
56:09.41 nsMathMLmencloseFrame.o
56:09.81 nsSVGClipPathFrame.o
56:11.06 nsImageBoxFrame.o
56:11.87 nsMathMLmfencedFrame.o
56:12.93 nsSVGContainerFrame.o
56:13.93 nsMathMLmfracFrame.o
56:15.18 nsLeafBoxFrame.o
56:16.95 nsSVGEffects.o
56:17.61 nsMathMLmmultiscriptsFrame.o
56:19.39 nsMathMLmoFrame.o
56:20.16 nsListBoxBodyFrame.o
56:23.17 nsSVGFilterFrame.o
56:23.68 nsMathMLmpaddedFrame.o
56:23.79 nsListBoxLayout.o
56:23.89 nsMathMLmphantomFrame.o
56:28.89 nsSVGFilterInstance.o
56:28.91 nsMathMLmrootFrame.o
56:29.02 nsMathMLmrowFrame.o
56:29.15 nsListBoxObject.o
56:31.62 nsListItemFrame.o
56:32.32 nsMathMLmspaceFrame.o
56:32.58 nsMenuBarFrame.o
56:32.71 nsSVGForeignObjectFrame.o
56:34.01 inCSSValueSearch.o
56:34.01 inDOMUtils.o
56:41.20 nsMenuBarListener.o
56:41.20 inDOMView.o
56:41.20 nsSVGGFrame.o
56:41.20 nsMathMLmsqrtFrame.o
56:47.07 nsSVGGenericContainerFrame.o
56:47.29 nsMenuBoxObject.o
56:47.38 nsMathMLmtableFrame.o
57:08.13 inDeepTreeWalker.o
57:10.61 nsMenuFrame.o
57:11.13 nsSVGGradientFrame.o
57:11.34 nsMathMLmunderoverFrame.o
57:12.21 inFlasher.o
57:14.89 inLayoutUtils.o
57:15.46 nsSVGImageFrame.o
57:16.22 nsMathMLsemanticsFrame.o
57:16.23 nsMenuPopupFrame.o
57:20.45 inSearchLoop.o
57:20.80 nsPopupBoxObject.o
57:20.98 nsSVGInnerSVGFrame.o
57:23.62 nsFontFace.o
57:24.84 nsFontFaceList.o
57:25.07 nsPrintData.o
57:25.07 nsPrintEngine.o
57:26.33 nsSVGIntegrationUtils.o
57:27.73 nsPopupSetFrame.o
57:28.54 nsPagePrintTimer.o
57:30.10 nsSVGMarkerFrame.o
57:30.27 nsProgressMeterFrame.o
57:31.73 nsSVGMaskFrame.o
57:32.64 nsRepeatService.o
57:34.88 nsPrintObject.o
57:36.33 nsResizerFrame.o
57:36.72 nsPrintPreviewListener.o
57:37.24 nsContentDLF.o
57:37.24 nsLayoutModule.o
57:37.38 nsRootBoxFrame.o
57:38.61 nsSVGOuterSVGFrame.o
57:40.17 nsLayoutStatics.o
57:41.33 nsScrollBoxFrame.o
57:42.16 nsSVGPaintServerFrame.o
57:44.82 nsScrollBoxObject.o
57:55.72 nsScrollbarButtonFrame.o
57:55.75 nsSVGPathGeometryFrame.o
57:57.16 nsSVGPatternFrame.o
58:19.89 nsDocShell.o
58:19.90 LoadContext.o
58:22.30 nsScrollbarFrame.o
58:22.96 nsSVGStopFrame.o
58:24.54 nsSVGSwitchFrame.o
58:29.94 nsSliderFrame.o
58:29.94 nsSVGUseFrame.o
58:29.95 nsSVGUtils.o
58:32.80 nsSplitterFrame.o
58:33.37 nsSprocketLayout.o
58:40.28 nsStackFrame.o
58:43.87 LoadInfo.o
58:46.91 SerializedLoadContext.o
58:46.95 nsAboutRedirector.o
58:47.19 nsSHEntry.o
58:47.19 nsSHEntryShared.o
58:47.88 /opt/FirefoxSource/mozilla-release/layout/xul/nsSprocketLayout.cpp: In member function 'void nsSprocketLayout::AlignChildren(nsIFrame*, nsBoxLayoutState&)':
58:47.88 Warning: -Wmaybe-uninitialized in /opt/FirefoxSource/mozilla-release/layout/xul/nsSprocketLayout.cpp: 'y' may be used uninitialized in this function
58:47.88 /opt/FirefoxSource/mozilla-release/layout/xul/nsSprocketLayout.cpp:973:22: warning: 'y' may be used uninitialized in this function [-Wmaybe-uninitialized]
58:47.88 Warning: -Wmaybe-uninitialized in /opt/FirefoxSource/mozilla-release/layout/xul/nsSprocketLayout.cpp: 'x' may be used uninitialized in this function
58:47.88 /opt/FirefoxSource/mozilla-release/layout/xul/nsSprocketLayout.cpp:993:22: warning: 'x' may be used uninitialized in this function [-Wmaybe-uninitialized]
58:47.88 Warning: -Wmaybe-uninitialized in /opt/FirefoxSource/mozilla-release/layout/xul/nsSprocketLayout.cpp: 'isLTR' may be used uninitialized in this function
58:47.88 /opt/FirefoxSource/mozilla-release/layout/xul/nsSprocketLayout.cpp:989:45: warning: 'isLTR' may be used uninitialized in this function [-Wmaybe-uninitialized]
58:47.88 Warning: -Wmaybe-uninitialized in /opt/FirefoxSource/mozilla-release/layout/xul/nsSprocketLayout.cpp: 'maxAscent' may be used uninitialized in this function
58:47.88 /opt/FirefoxSource/mozilla-release/layout/xul/nsSprocketLayout.cpp:967:54: warning: 'maxAscent' may be used uninitialized in this function [-Wmaybe-uninitialized]
58:47.89 nsStackLayout.o
58:48.71 nsDocShellModule.o
58:49.27 nsSHTransaction.o
58:49.27 nsDSURIContentListener.o
58:50.03 nsDefaultURIFixup.o
58:50.26 nsTextBoxFrame.o
58:51.06 nsSHistory.o
58:51.60 nsAutoWindowStateHelper.o
58:51.60 nsDialogParamBlock.o
58:52.21 nsDocShellEditorData.o
58:52.86 nsTitleBarFrame.o
58:53.55 nsWindowWatcher.o
58:54.93 nsDocShellEnumerator.o
58:55.41 nsDocShellLoadInfo.o
58:55.65 nsDocShellTransferableHooks.o
58:55.82 nsDownloadHistory.o
58:56.30 nsWebNavigationInfo.o
58:56.71 nsAppStartupNotifier.o
58:57.15 nsXULLabelFrame.o
58:57.60 /opt/FirefoxSource/mozilla-release/layout/xul/nsTextBoxFrame.cpp: In member function 'void nsTextBoxFrame::DrawText(nsRenderingContext&, const nsRect&, const nsRect&, const nscolor*)':
58:57.60 Warning: -Wmaybe-uninitialized in /opt/FirefoxSource/mozilla-release/layout/xul/nsTextBoxFrame.cpp: 'underColor' may be used uninitialized in this function
58:57.60 /opt/FirefoxSource/mozilla-release/layout/xul/nsTextBoxFrame.cpp:488:43: warning: 'underColor' may be used uninitialized in this function [-Wmaybe-uninitialized]
58:57.61 Warning: -Wmaybe-uninitialized in /opt/FirefoxSource/mozilla-release/layout/xul/nsTextBoxFrame.cpp: 'overColor' may be used uninitialized in this function
58:57.61 /opt/FirefoxSource/mozilla-release/layout/xul/nsTextBoxFrame.cpp:495:42: warning: 'overColor' may be used uninitialized in this function [-Wmaybe-uninitialized]
58:57.61 Warning: -Wmaybe-uninitialized in /opt/FirefoxSource/mozilla-release/layout/xul/nsTextBoxFrame.cpp: 'strikeColor' may be used uninitialized in this function
58:57.61 /opt/FirefoxSource/mozilla-release/layout/xul/nsTextBoxFrame.cpp:573:37: warning: 'strikeColor' may be used uninitialized in this function [-Wmaybe-uninitialized]
58:57.61 Warning: -Wmaybe-uninitialized in /opt/FirefoxSource/mozilla-release/layout/xul/nsTextBoxFrame.cpp: 'strikeStyle' may be used uninitialized in this function
58:57.61 /opt/FirefoxSource/mozilla-release/layout/xul/nsTextBoxFrame.cpp:573:37: warning: 'strikeStyle' may be used uninitialized in this function [-Wmaybe-uninitialized]
58:57.61 Warning: -Wmaybe-uninitialized in /opt/FirefoxSource/mozilla-release/layout/xul/nsTextBoxFrame.cpp: 'underStyle' may be used uninitialized in this function
58:57.61 /opt/FirefoxSource/mozilla-release/layout/xul/nsTextBoxFrame.cpp:488:43: warning: 'underStyle' may be used uninitialized in this function [-Wmaybe-uninitialized]
58:57.61 Warning: -Wmaybe-uninitialized in /opt/FirefoxSource/mozilla-release/layout/xul/nsTextBoxFrame.cpp: 'overStyle' may be used uninitialized in this function
58:57.61 /opt/FirefoxSource/mozilla-release/layout/xul/nsTextBoxFrame.cpp:495:42: warning: 'overStyle' may be used uninitialized in this function [-Wmaybe-uninitialized]
58:57.62 nsFind.o
58:57.62 nsWebBrowserFind.o
58:57.73 nsWebBrowserPersist.o
58:59.20 nsBaseCommandController.o
58:59.20 nsCommandGroup.o
59:00.69 nsXULPopupManager.o
59:01.50 nsCommandManager.o
59:02.54 nsCommandParams.o
59:03.61 nsXULTooltipListener.o
59:03.91 nsPrintProgress.o
59:03.91 nsPrintProgressParams.o
59:04.32 nsControllerCommandTable.o
59:05.09 nsEmbeddingModule.o
59:05.69 nsPrintingPromptService.o
59:05.87 nsCommandHandler.o
59:05.87 nsContextMenuInfo.o
59:06.26 nsWebBrowserModule.o
59:06.66 nsAppShellFactory.o
59:06.66 nsAppShellService.o
59:06.93 nsDocShellTreeOwner.o
59:07.47 nsAppShellWindowEnumerator.o
59:09.31 nsChromeTreeOwner.o
59:10.56 nsEmbedStream.o
59:10.62 ANPCanvas.o
59:10.62 ANPPaint.o
59:10.70 nsWebBrowser.o
59:11.38 nsContentTreeOwner.o
59:11.48 ANPPath.o
59:11.50 nsWebBrowserContentPolicy.o
59:11.87 ANPTypeface.o
59:12.24 SkANP.o
59:12.60 /opt/FirefoxSource/mozilla-release/other-licenses/skia-npapi/ANPTypeface.cpp: In function 'int32_t anp_getFontPath(const ANPTypeface*, char*, int32_t, int32_t*)':
59:12.60 Warning: -Wunused-variable in /opt/FirefoxSource/mozilla-release/other-licenses/skia-npapi/ANPTypeface.cpp: unused variable 'stream'
59:12.60 /opt/FirefoxSource/mozilla-release/other-licenses/skia-npapi/ANPTypeface.cpp:63:15: warning: unused variable 'stream' [-Wunused-variable]
59:13.08 CharDistribution.o
59:13.08 JpCntx.o
59:14.45 LangBulgarianModel.o
59:14.76 nsWebShellWindow.o
59:15.19 nsWindowMediator.o
59:15.29 LangCyrillicModel.o
59:15.43 LangGreekModel.o
59:15.53 LangHebrewModel.o
59:15.61 LangHungarianModel.o
59:15.70 LangThaiModel.o
59:15.79 nsBig5Prober.o
59:15.87 nsCharSetProber.o
59:16.05 nsEUCJPProber.o
59:16.16 nsEUCKRProber.o
59:16.36 nsEUCTWProber.o
59:16.52 nsEscCharsetProber.o
59:16.67 nsEscSM.o
59:16.84 nsGB2312Prober.o
59:16.95 nsUdetXPCOMWrapper.o
59:16.95 nsUniversalCharDetModule.o
59:16.96 nsHebrewProber.o
59:17.12 nsLatin1Prober.o
59:17.25 nsMBCSGroupProber.o
59:17.38 nsMBCSSM.o
59:17.61 nsSBCSGroupProber.o
59:17.75 AccessibleWrap.o
59:17.75 Platform.o
59:17.75 nsSBCharSetProber.o
59:17.77 nsSJISProber.o
59:17.78 nsXULWindow.o
59:17.89 nsUTF8Prober.o
59:17.94 nsUniversalDetector.o
59:18.30 ARIAMap.o
59:18.30 ARIAStateMap.o
59:18.69 ARIAGridAccessible.o
59:18.69 Accessible.o
59:20.53 ApplicationAccessible.o
59:21.06 AccCollector.o
59:22.35 BaseAccessibles.o
59:23.27 DocAccessible.o
59:23.76 AccEvent.o
59:24.72 AccGroupInfo.o
59:25.12 FormControlAccessible.o
59:25.88 HyperTextAccessible.o
59:27.67 AccIterator.o
59:28.58 HTMLCanvasAccessible.o
59:28.58 HTMLElementAccessibles.o
59:28.86 Asserts.o
59:30.10 DocManager.o
59:31.02 HTMLFormControlAccessible.o
59:34.35 ImageAccessible.o
59:38.09 EventQueue.o
59:38.90 xpcAccEvents.o
59:38.90 nsAccessibleRelation.o
59:40.95 HTMLImageMapAccessible.o
59:43.58 Filters.o
59:45.09 xpcAccessibleHyperText.o
59:46.62 FocusManager.o
59:47.35 HTMLLinkAccessible.o
60:01.87 OuterDocAccessible.o
60:02.96 xpcAccessibleSelectable.o
60:03.94 HTMLListAccessible.o
60:04.49 Logging.o
60:05.13 RootAccessible.o
60:06.41 xpcAccessibleTable.o
60:06.78 HTMLSelectAccessible.o
60:07.65 xpcAccessibleTableCell.o
60:07.89 TableCellAccessible.o
60:07.90 NotificationController.o
60:08.84 xpcAccessibleTextRange.o
60:09.76 xpcAccessibleValue.o
60:09.88 HTMLTableAccessible.o
60:11.30 SelectionManager.o
60:12.26 TextLeafAccessible.o
60:14.07 XULAlertAccessible.o
60:14.08 XULColorPickerAccessible.o
60:15.00 XULComboboxAccessible.o
60:15.80 StyleInfo.o
60:18.19 nsProfileDirServiceProvider.o
60:18.19 nsProfileLock.o
60:18.33 XULElementAccessibles.o
60:18.70 TextAttrs.o
60:19.19 local_debug_info_symbolizer.o
60:19.19 platform-linux.o
60:19.41 TextRange.o
60:22.45 XULFormControlAccessible.o
60:23.01 shared-libraries-linux.o
60:23.61 TextUpdater.o
60:23.69 XULListboxAccessible.o
60:24.39 EHABIStackWalk.o
60:26.19 AutoObjectMapper.o
60:27.65 XULMenuAccessible.o
60:27.99 TreeWalker.o
60:28.34 XULSelectControlAccessible.o
60:28.93 BreakpadSampler.o
60:29.77 JSStreamWriter.o
60:32.05 XULSliderAccessible.o
60:32.28 nsAccUtils.o
60:32.36 LulCommon.o
60:32.86 XULTabAccessible.o
60:33.42 LulDwarf.o
60:34.31 LulDwarfSummariser.o
60:35.40 nsAccessibilityService.o
60:35.89 XULTreeAccessible.o
60:36.11 XULTreeGridAccessible.o
60:40.00 LulElf.o
60:40.45 LulExidx.o
60:41.78 LulMain.o
60:42.07 nsAccessiblePivot.o
60:42.30 LulRWLock.o
60:43.26 ProfileEntry.o
60:43.80 ProfilerBacktrace.o
60:44.15 nsWindowDataSource.o
60:45.29 nsDirectoryViewer.o
60:45.66 nsCoreUtils.o
60:45.93 ProfilerIOInterposeObserver.o
60:46.43 ProfilerMarkers.o
60:47.30 SaveProfileTask.o
60:47.98 nsEventShell.o
60:48.24 SyncProfile.o
60:48.68 nsTextEquivUtils.o
60:48.96 TableTicker.o
60:49.46 ThreadResponsiveness.o
60:51.13 UnwinderThread2.o
60:51.78 nsProfiler.o
60:51.93 nsModule.o
60:52.07 mozHunspell.o
60:52.07 mozHunspellDirProvider.o
60:52.32 nsProfilerFactory.o
60:52.62 platform.o
60:53.65 mozEnglishWordUtils.o
60:53.65 mozGenericWordUtils.o
60:53.72 nsSecureBrowserUIImpl.o
60:53.72 PublicKeyPinningService.o
60:54.14 mozInlineSpellChecker.o
60:54.37 mozInlineSpellWordUtil.o
60:55.18 RemoteSpellCheckEngineChild.o
60:55.59 RemoteSpellCheckEngineParent.o
60:55.86 affentry.o
60:56.15 nsBOOTModule.o
60:56.70 nsEntropyCollector.o
60:56.98 md4.o
60:56.99 CryptoTask.o
60:57.18 nsCertificatePrincipal.o
60:57.19 nsSecurityHeaderParser.o
60:57.51 affixmgr.o
60:57.52 nsSecurityWarningDialogs.o
60:57.80 nsCertOverrideService.o
60:57.85 nsSiteSecurityService.o
60:58.13 nsCertPicker.o
60:58.24 csutil.o
60:59.00 mozPersonalDictionary.o
60:59.47 OCSPCommon.o
60:59.47 TLSServer.o
60:59.53 nsCertVerificationThread.o
61:00.18 nsClientAuthRemember.o
61:00.24 BadCertServer.o
61:00.24 GenerateOCSPResponse.o
61:00.53 OCSPStaplingServer.o
61:00.90 nsCrypto.o
61:01.13 dictmgr.o
61:01.18 OCSPCacheTest.o
61:01.18 TLSIntoleranceTest.o
61:01.89 nsDataSignatureVerifier.o
61:01.93 filemgr.o
61:02.14 mozSpellChecker.o
61:02.30 hashmgr.o
61:02.61 hunspell.o
61:02.63 nsKeygenHandler.o
61:03.50 mozSpellCheckerFactory.o
61:03.53 nsKeygenThread.o
61:03.84 hunzip.o
61:05.70 nsKeyModule.o
61:06.19 nsNSSASN1Object.o
61:06.25 mozSpellI18NManager.o
61:06.45 phonet.o
61:06.67 nsNSSCallbacks.o
61:06.86 replist.o
61:07.11 /opt/FirefoxSource/mozilla-release/security/manager/ssl/src/nsNSSASN1Object.cpp: In function 'nsresult buildASN1ObjectFromDER(unsigned char*, unsigned char*, nsIASN1Sequence*)':
61:07.11 Warning: -Wmaybe-uninitialized in /opt/FirefoxSource/mozilla-release/security/manager/ssl/src/nsNSSASN1Object.cpp: 'bytesUsed' may be used uninitialized in this function
61:07.11 /opt/FirefoxSource/mozilla-release/security/manager/ssl/src/nsNSSASN1Object.cpp:131:22: warning: 'bytesUsed' may be used uninitialized in this function [-Wmaybe-uninitialized]
61:07.11 nsNSSCertCache.o
61:07.27 suggestmgr.o
61:07.62 TestCertDB.o
61:07.83 nsASN1Tree.o
61:07.83 nsFormSigningDialog.o
61:08.28 nsNSSDialogHelper.o
61:08.95 nsAlertsService.o
61:08.95 nsXULAlerts.o
61:09.74 nsNSSCertHelper.o
61:09.87 nsNSSDialogs.o
61:10.16 nsCommandLine.o
61:10.34 nsNSSCertificate.o
61:10.43 nsPKIModule.o
61:11.52 nsPKIParamBlock.o
61:11.98 DiskSpaceWatcher.o
61:12.12 nsNSSCertificateFakeTransport.o
61:12.31 nsNSSCertTrust.o
61:12.36 SQLFunctions.o
61:12.36 ApplicationReputation.o
61:12.96 nsNSSCertValidity.o
61:13.06 csd.pb.o
61:13.17 nsNSSCleaner.o
61:13.67 FinalizationWitnessService.o
61:13.83 nsNSSErrors.o
61:13.94 nsNSSIOLayer.o
61:14.49 nsNSSModule.o
61:15.31 nsFindService.o
61:15.40 nsDownloadManager.o
61:15.62 nsNSSShutDown.o
61:16.67 nsNTLMAuthModule.o
61:17.04 nsPK11TokenDB.o
61:17.56 nsPKCS11Slot.o
61:17.63 nsPKCS12Blob.o
61:17.74 DownloadPlatform.o
61:18.33 nsProtectedAuthThread.o
61:18.38 nsPSMBackgroundThread.o
61:19.42 nsRandomGenerator.o
61:19.48 mp3sniff.o
61:19.48 nsMediaSniffer.o
61:19.48 nsSDR.o
61:19.82 nsMediaSnifferModule.o
61:20.01 NSSErrorsService.o
61:20.02 NativeOSFileInternals.o
61:20.69 nsSSLSocketProvider.o
61:20.96 nsParentalControlsServiceDefault.o
61:21.20 PerfMeasurement.o
61:21.31 nsSSLStatus.o
61:21.55 extension_set.o
61:21.55 generated_message_util.o
61:21.83 nsStreamCipher.o
61:21.95 reflect.o
61:22.01 coded_stream.o
61:22.34 nsTLSSocketProvider.o
61:22.35 zero_copy_stream.o
61:22.75 nsUsageArrayHelper.o
61:22.95 StartupTimeline.o
61:22.95 nsAppStartup.o
61:23.06 zero_copy_stream_impl_lite.o
61:23.28 nsUserInfoUnix.o
61:23.64 PSMRunnable.o
61:23.68 message_lite.o
61:23.93 nsBrowserStatusFilter.o
61:24.24 SharedSSLState.o
61:24.59 repeated_field.o
61:24.60 common.o
61:24.60 SSLServerCertVerification.o
61:25.17 TransportSecurityInfo.o
61:25.25 once.o
61:25.27 wire_format_lite.o
61:25.29 Telemetry.o
61:25.88 nsCryptoHash.o
61:26.75 nsTypeAheadFind.o
61:27.01 nsNSSCertificateDB.o
61:27.41 nsNSSComponent.o
61:27.62 nsNSSVersion.o
61:29.79 PSMContentListener.o
61:30.08 nsCertTree.o
61:30.95 lz4.o
61:31.06 ctypes.o
61:31.11 nsAutoCompleteController.o
61:31.11 nsAutoCompleteSimpleResult.o
61:31.96 nsFormFillController.o
61:32.10 nsUrlClassifierPrefixSet.o
61:32.10 nsUrlClassifierStreamUpdater.o
61:32.10 HashStore.o
61:32.83 ChunkSet.o
61:32.97 nsToolkitCompsModule.o
61:34.16 nsJSInspector.o
61:34.84 IdentityCryptoService.o
61:35.05 AddonPathService.o
61:35.24 Classifier.o
61:35.43 LookupCache.o
61:35.68 BadPlugin.o
61:35.68 GoodPlugin.o
61:36.40 nsProfileLock.o
61:36.40 nsToolkitProfileService.o
61:36.75 TestWebappRT.o
61:36.88 ProtocolParser.o
61:37.65 nsCheckSummedOutputStream.o
61:37.82 nsAndroidSystemProxySettings.o
61:38.82 nsUrlClassifierDBService.o
61:38.88 nsUrlClassifierProxies.o
61:39.04 nsUrlClassifierUtils.o
61:39.73 /opt/FirefoxSource/mozilla-release/toolkit/system/androidproxy/nsAndroidSystemProxySettings.cpp: In member function 'virtual MozExternalRefCountType nsAndroidSystemProxySettings::Release()':
61:39.73 Warning: -Wdelete-non-virtual-dtor in /opt/FirefoxSource/mozilla-release/toolkit/system/androidproxy/nsAndroidSystemProxySettings.cpp: deleting object of polymorphic class type 'nsAndroidSystemProxySettings' which has non-virtual destructor might cause undefined behaviour
61:39.73 /opt/FirefoxSource/mozilla-release/toolkit/system/androidproxy/nsAndroidSystemProxySettings.cpp:32:409: warning: deleting object of polymorphic class type 'nsAndroidSystemProxySettings' which has non-virtual destructor might cause undefined behaviour [-Wdelete-non-virtual-dtor]
61:39.79 convert_UTF.o
61:39.79 breakpad_getcontext.o
61:39.98 arm_ex_reader.o
61:40.02 arm_ex_to_module.o
61:40.85 bytereader.o
61:40.85 dwarf2diehandler.o
61:41.31 dwarf2reader.o
61:41.42 basic_code_modules.o
61:41.43 basic_source_line_resolver.o
61:41.44 dwarf_cfi_to_module.o
61:41.85 dwarf_cu_to_module.o
61:42.02 dwarf_line_to_module.o
61:42.25 call_stack.o
61:43.23 language.o
61:43.79 dump_symbols.o
61:44.13 /opt/FirefoxSource/mozilla-release/toolkit/crashreporter/google-breakpad/src/common/dwarf_cu_to_module.cc: In member function 'std::string google_breakpad::DwarfCUToModule::GenericDIEHandler::ComputeQualifiedName()':
61:44.13 Warning: -Wmaybe-uninitialized in /opt/FirefoxSource/mozilla-release/toolkit/crashreporter/google-breakpad/src/common/dwarf_cu_to_module.cc: 'enclosing_name' may be used uninitialized in this function
61:44.13 /opt/FirefoxSource/mozilla-release/toolkit/crashreporter/google-breakpad/src/common/dwarf_cu_to_module.cc:386:68: warning: 'enclosing_name' may be used uninitialized in this function [-Wmaybe-uninitialized]
61:44.13 Warning: -Wmaybe-uninitialized in /opt/FirefoxSource/mozilla-release/toolkit/crashreporter/google-breakpad/src/common/dwarf_cu_to_module.cc: 'unqualified_name' may be used uninitialized in this function
61:44.13 /opt/FirefoxSource/mozilla-release/toolkit/crashreporter/google-breakpad/src/common/dwarf_cu_to_module.cc:386:68: warning: 'unqualified_name' may be used uninitialized in this function [-Wmaybe-uninitialized]
61:44.13 elf_symbols_to_module.o
61:44.31 logging.o
61:44.49 cfi_frame_info.o
61:44.84 minidump.o
61:44.99 md5.o
61:44.99 module.o
61:45.24 pathname_stripper.o
61:46.26 string_conversion.o
61:46.42 unique_string.o
61:46.69 file_id.o
61:46.69 elfutils.o
61:46.98 source_line_resolver_base.o
61:46.98 guid_creator.o
61:47.08 linux_libc_support.o
61:47.17 memory_mapped_file.o
61:47.28 safe_readlink.o
61:47.46 stack_frame_symbolizer.o
61:47.64 nsAppRunner.o
61:47.66 nsEmbedFunctions.o
61:47.85 CreateAppData.o
61:48.82 EventTracer.o
61:49.58 nsAutoConfig.o
61:49.58 nsConfigFactory.o
61:51.09 nsJSConfigTriggers.o
61:51.57 stackwalker.o
61:51.77 nsReadConfig.o
61:52.19 nsSyncJPAKE.o
61:52.36 stackwalker_amd64.o
61:52.81 /opt/FirefoxSource/mozilla-release/toolkit/xre/nsAppRunner.cpp: In member function 'int XREMain::XRE_mainStartup(bool*)':
61:52.81 Warning: -Wmaybe-uninitialized in /opt/FirefoxSource/mozilla-release/toolkit/xre/nsAppRunner.cpp: 'currentIsSelected' may be used uninitialized in this function
61:52.81 /opt/FirefoxSource/mozilla-release/toolkit/xre/nsAppRunner.cpp:2096:7: warning: 'currentIsSelected' may be used uninitialized in this function [-Wmaybe-uninitialized]
61:52.81 /opt/FirefoxSource/mozilla-release/toolkit/xre/nsAppRunner.cpp:2094:12: note: 'currentIsSelected' was declared here
61:52.81 ProfileReset.o
61:52.82 StartupCache.o
61:52.82 StartupCacheModule.o
61:53.14 nsAndroidStartup.o
61:53.28 stackwalker_arm.o
61:53.75 nsConsoleWriter.o
61:53.95 StartupCacheUtils.o
61:54.26 stackwalker_ppc.o
61:54.32 stackwalker_sparc.o
61:54.91 stackwalker_x86.o
61:54.97 JSDebugger.o
61:55.46 tokenize.o
61:55.52 nsNativeAppSupportBase.o
61:55.67 snappy-c.o
61:55.67 snappy-sinksource.o
61:55.91 nsNativeAppSupportDefault.o
61:55.98 snappy-stubs-internal.o
61:56.04 snappy.o
61:56.44 nsSigHandlers.o
61:56.57 nsXREDirProvider.o
61:57.28 nsBrowserModule.o
61:57.28 nsShellService.o
61:57.47 StaticXULComponentsStart.o
61:58.06 ssltunnel.o
61:58.18 TestArrayUtils.o
61:58.18 TestAtomics.o
61:58.36 nsAndroidHistory.o
61:58.63 TestBinarySearch.o
61:58.70 TestVolatileBuffer.o
61:59.80 editline.o
61:59.80 sysunix.o
62:00.11 /opt/FirefoxSource/mozilla-release/mobile/android/components/build/nsShellService.cpp: In member function 'virtual MozExternalRefCountType nsShellService::Release()':
62:00.11 Warning: -Wdelete-non-virtual-dtor in /opt/FirefoxSource/mozilla-release/mobile/android/components/build/nsShellService.cpp: deleting object of polymorphic class type 'nsShellService' which has non-virtual destructor might cause undefined behaviour
62:00.11 /opt/FirefoxSource/mozilla-release/mobile/android/components/build/nsShellService.cpp:13:381: warning: deleting object of polymorphic class type 'nsShellService' which has non-virtual destructor might cause undefined behaviour [-Wdelete-non-virtual-dtor]
62:00.63 TestBloomFilter.o
62:00.90 js.o
62:00.91 jsheaptools.o
62:00.94 jsoptparse.o
62:01.01 TestCasting.o
62:01.58 TestCeilingFloor.o
62:01.70 TestCheckedInt.o
62:01.73 /opt/FirefoxSource/mozilla-release/mobile/android/components/build/nsAndroidHistory.cpp: In member function 'virtual MozExternalRefCountType nsAndroidHistory::Release()':
62:01.73 Warning: -Wdelete-non-virtual-dtor in /opt/FirefoxSource/mozilla-release/mobile/android/components/build/nsAndroidHistory.cpp: deleting object of polymorphic class type 'nsAndroidHistory' which has non-virtual destructor might cause undefined behaviour
62:01.73 /opt/FirefoxSource/mozilla-release/mobile/android/components/build/nsAndroidHistory.cpp:18:385: warning: deleting object of polymorphic class type 'nsAndroidHistory' which has non-virtual destructor might cause undefined behaviour [-Wdelete-non-virtual-dtor]
62:01.73 TestCountPopulation.o
62:02.64 selfTest.o
62:02.65 testAddPropertyPropcache.o
62:06.05 testArgumentsObject.o
62:06.54 testArrayBuffer.o
62:08.37 In file included from /opt/FirefoxSource/mozilla-release/js/src/shell/../jsweakmap.h:10:0,
62:08.37                  from /opt/FirefoxSource/mozilla-release/js/src/shell/../vm/ScopeObject.h:12,
62:08.37                  from /opt/FirefoxSource/mozilla-release/js/src/shell/../frontend/SharedContext.h:19,
62:08.37                  from /opt/FirefoxSource/mozilla-release/js/src/shell/../frontend/FullParseHandler.h:13,
62:08.37                  from /opt/FirefoxSource/mozilla-release/js/src/shell/../frontend/Parser.h:17,
62:08.37                  from /opt/FirefoxSource/mozilla-release/js/src/shell/js.cpp:58:
62:08.37 /opt/FirefoxSource/mozilla-release/js/src/shell/../jscompartment.h: In function 'bool EvalInFrame(JSContext*, unsigned int, jsval*)':
62:08.37 Warning: -Wmaybe-uninitialized in /opt/FirefoxSource/mozilla-release/js/src/jscompartment.h: 'ac.js::AutoCompartment::origin_' may be used uninitialized in this function
62:08.37 /opt/FirefoxSource/mozilla-release/js/src/shell/../jscompartment.h:157:31: warning: 'ac.js::AutoCompartment::origin_' may be used uninitialized in this function [-Wmaybe-uninitialized]
62:08.37 /opt/FirefoxSource/mozilla-release/js/src/shell/js.cpp:2775:37: note: 'ac.js::AutoCompartment::origin_' was declared here
62:08.37 In file included from /opt/FirefoxSource/mozilla-release/js/src/shell/../jscompartmentinlines.h:14:0,
62:08.37                  from /opt/FirefoxSource/mozilla-release/js/src/shell/js.cpp:73:
62:08.37 Warning: -Wmaybe-uninitialized in /opt/FirefoxSource/mozilla-release/js/src/jscntxtinlines.h: 'ac.js::AutoCompartment::cx_' may be used uninitialized in this function
62:08.37 /opt/FirefoxSource/mozilla-release/js/src/shell/../jscntxtinlines.h:413:29: warning: 'ac.js::AutoCompartment::cx_' may be used uninitialized in this function [-Wmaybe-uninitialized]
62:08.37 /opt/FirefoxSource/mozilla-release/js/src/shell/js.cpp:2775:37: note: 'ac.js::AutoCompartment::cx_' was declared here
62:08.37 In file included from /opt/FirefoxSource/mozilla-release/js/src/shell/../jsweakmap.h:10:0,
62:08.37                  from /opt/FirefoxSource/mozilla-release/js/src/shell/../vm/ScopeObject.h:12,
62:08.37                  from /opt/FirefoxSource/mozilla-release/js/src/shell/../frontend/SharedContext.h:19,
62:08.37                  from /opt/FirefoxSource/mozilla-release/js/src/shell/../frontend/FullParseHandler.h:13,
62:08.37                  from /opt/FirefoxSource/mozilla-release/js/src/shell/../frontend/Parser.h:17,
62:08.37                  from /opt/FirefoxSource/mozilla-release/js/src/shell/js.cpp:58:
62:08.37 /opt/FirefoxSource/mozilla-release/js/src/shell/../jscompartment.h: In function 'bool Evaluate(JSContext*, unsigned int, jsval*)':
62:08.37 Warning: -Wmaybe-uninitialized in /opt/FirefoxSource/mozilla-release/js/src/jscompartment.h: '*((void*)(& ancx)+24).js::AutoCompartment::origin_' may be used uninitialized in this function
62:08.37 /opt/FirefoxSource/mozilla-release/js/src/shell/../jscompartment.h:157:31: warning: '*((void*)(& ancx)+24).js::AutoCompartment::origin_' may be used uninitialized in this function [-Wmaybe-uninitialized]
62:08.37 /opt/FirefoxSource/mozilla-release/js/src/shell/js.cpp:1229:20: note: '*((void*)(& ancx)+24).js::AutoCompartment::origin_' was declared here
62:08.37 In file included from /opt/FirefoxSource/mozilla-release/js/src/shell/../jscompartmentinlines.h:14:0,
62:08.37                  from /opt/FirefoxSource/mozilla-release/js/src/shell/js.cpp:73:
62:08.37 Warning: -Wmaybe-uninitialized in /opt/FirefoxSource/mozilla-release/js/src/jscntxtinlines.h: '*((void*)(& ancx)+24).js::AutoCompartment::cx_' may be used uninitialized in this function
62:08.37 /opt/FirefoxSource/mozilla-release/js/src/shell/../jscntxtinlines.h:449:53: warning: '*((void*)(& ancx)+24).js::AutoCompartment::cx_' may be used uninitialized in this function [-Wmaybe-uninitialized]
62:08.37 /opt/FirefoxSource/mozilla-release/js/src/shell/js.cpp:1229:20: note: '*((void*)(& ancx)+24).js::AutoCompartment::cx_' was declared here
62:08.37 In file included from /opt/FirefoxSource/mozilla-release/js/src/shell/js.cpp:38:0:
62:08.38 Warning: -Wmaybe-uninitialized in /opt/FirefoxSource/mozilla-release/js/src/jsapi.h: '*((void*)(& ancx)+8).JSAutoRequest::mContext' may be used uninitialized in this function
62:08.38 /opt/FirefoxSource/mozilla-release/js/src/shell/../jsapi.h:1327:32: warning: '*((void*)(& ancx)+8).JSAutoRequest::mContext' may be used uninitialized in this function [-Wmaybe-uninitialized]
62:08.38 /opt/FirefoxSource/mozilla-release/js/src/shell/js.cpp:1229:20: note: '*((void*)(& ancx)+8).JSAutoRequest::mContext' was declared here
62:08.39 gdb-tests.o
62:08.39 test-JSObject.o
62:08.69 testBindCallable.o
62:08.88 test-JSString.o
62:09.28 test-JSSymbol.o
62:10.78 test-Root.o
62:11.19 test-jsid.o
62:12.13 test-jsval.o
62:13.17 test-prettyprinters.o
62:13.33 typedef-printers.o
62:13.57 testBug604087.o
62:13.64 testCallNonGenericMethodOnProxy.o
62:13.79 testChromeBuffer.o
62:18.96 TestCountZeroes.o
62:19.02 testClassGetter.o
62:19.64 TestEndian.o
62:20.14 testCloneScript.o
62:20.46 testConservativeGC.o
62:23.33 testContexts.o
62:23.36 TestEnumSet.o
62:25.21 testCustomIterator.o
62:40.81 TestFloatingPoint.o
62:52.42 testDebugger.o
62:52.56 TestIntegerPrintfMacros.o
62:52.56 pkixbind.o
62:52.56 pkixbuild.o
62:52.60 pkixcert.o
62:52.79 AppData.o
62:52.80 FileUtils.o
62:52.87 pkixcheck.o
62:52.96 TestMacroArgs.o
62:53.09 pkixder.o
62:53.10 nsArrayEnumerator.o
62:53.34 nsArrayUtils.o
62:53.38 TestMacroForEach.o
62:53.43 In file included from /opt/FirefoxSource/mozilla-release/security/pkix/lib/pkixutil.h:28:0,
62:53.43                  from /opt/FirefoxSource/mozilla-release/security/pkix/lib/pkixcheck.h:29,
62:53.43                  from /opt/FirefoxSource/mozilla-release/security/pkix/lib/pkixcheck.cpp:29:
62:53.43 /opt/FirefoxSource/mozilla-release/security/pkix/lib/pkixder.h: In function 'mozilla::pkix::Result mozilla::pkix::DecodeBasicConstraints(mozilla::pkix::Input&, bool&, long int&)':
62:53.43 Warning: -Wmaybe-uninitialized in /opt/FirefoxSource/mozilla-release/security/pkix/lib/pkixder.h: 'parsedValue' may be used uninitialized in this function
62:53.43 /opt/FirefoxSource/mozilla-release/security/pkix/lib/pkixder.h:396:22: warning: 'parsedValue' may be used uninitialized in this function [-Wmaybe-uninitialized]
62:53.43 /opt/FirefoxSource/mozilla-release/security/pkix/lib/pkixder.h:391:11: note: 'parsedValue' was declared here
62:53.43 pkixnss.o
62:53.43 TestPair.o
62:53.50 TestRollingMean.o
62:53.61 nsCategoryCache.o
62:53.62 TestSHA1.o
62:53.71 pkixocsp.o
62:53.74 nsClassInfoImpl.o
62:53.91 TestTypedEnum.o
62:53.99 TestTypeTraits.o
62:54.23 nsCOMArray.o
62:54.36 nsComponentManagerUtils.o
62:54.46 /opt/FirefoxSource/mozilla-release/security/pkix/lib/pkixocsp.cpp: In function 'mozilla::pkix::Result mozilla::pkix::BasicResponse(mozilla::pkix::Input&, mozilla::pkix::Context&)':
62:54.46 Warning: -Wmaybe-uninitialized in /opt/FirefoxSource/mozilla-release/security/pkix/lib/pkixocsp.cpp: 'version' may be used uninitialized in this function
62:54.46 /opt/FirefoxSource/mozilla-release/security/pkix/lib/pkixocsp.cpp:470:3: warning: 'version' may be used uninitialized in this function [-Wmaybe-uninitialized]
62:54.46 /opt/FirefoxSource/mozilla-release/security/pkix/lib/pkixocsp.cpp:465:16: note: 'version' was declared here
62:54.49 GenericModule.o
62:54.50 nsStringAPI.o
62:54.56 testDeepFreeze.o
62:54.82 AppData.o
62:54.86 nsCOMPtr.o
62:55.07 nsCRTGlue.o
62:55.22 nsCycleCollectionParticipant.o
62:55.38 nsDeque.o
62:55.51 BlockingResourceBase.o
62:55.82 DeadlockDetector.o
62:55.93 FileUtils.o
62:55.95 nsEnumeratorUtils.o
62:56.09 GenericFactory.o
62:56.19 nsID.o
62:56.35 nsArrayEnumerator.o
62:56.41 nsIInterfaceRequestorUtils.o
62:56.54 nsINIParser.o
62:56.67 nsISupportsImpl.o
62:56.73 nsArrayUtils.o
62:57.00 nsCOMArray.o
62:57.07 nsMemory.o
62:57.13 nsCOMPtr.o
62:57.17 nsQuickSort.o
62:57.45 nsTArray.o
62:57.60 nsTHashtable.o
62:57.65 nsCRTGlue.o
62:57.77 nsThreadUtils.o
62:57.83 nsCategoryCache.o
62:58.00 nsClassInfoImpl.o
62:58.37 nsTObserverArray.o
62:58.44 testDefineGetterSetterNonEnumerable.o
62:58.50 nsComponentManagerUtils.o
62:59.02 nsCycleCollectionParticipant.o
62:59.02 nsVersionComparator.o
62:59.17 nsVoidArray.o
62:59.24 nsDeque.o
62:59.28 nsWeakReference.o
62:59.64 pldhash.o
62:59.80 nsEnumeratorUtils.o
62:59.80 nsStringAPI.o
63:00.04 nsID.o
63:00.06 nsXPCOMGlue.o
63:00.28 nsIInterfaceRequestorUtils.o
63:00.43 nsINIParser.o
63:00.57 nsISupportsImpl.o
63:00.99 nsMemory.o
63:01.11 nsProxyRelease.o
63:01.24 testDefineProperty.o
63:01.26 TestFileUtils.o
63:01.26 TestGCPostBarriers.o
63:02.19 nsQuickSort.o
63:02.46 nsTArray.o
63:02.61 nsTHashtable.o
63:03.23 nsTObserverArray.o
63:03.33 nsTextFormatter.o
63:03.48 nsThreadUtils.o
63:03.78 TestUniquePtr.o
63:03.89 TestWeakPtr.o
63:04.08 nsVersionComparator.o
63:04.70 nsVoidArray.o
63:04.70 testEnclosingFunction.o
63:04.80 nsWeakReference.o
63:04.89 TestPoisonArea.o
63:05.18 pldhash.o
63:05.22 xptcinvoke_arm.o
63:05.22 xptcstubs_arm.o
63:05.36 unused.o
63:05.75 TestMinStringAPI.o
63:06.20 TestComponent.o
63:06.34 TestComponent.o
63:06.34 testErrorCopying.o
63:06.38 TestComponent.o
63:06.95 nsTestSample.o
63:07.00 nsCollationUnix.o
63:07.01 nsDateTimeFormatUnix.o
63:07.09 GreekCasing.o
63:07.09 IrishCasing.o
63:07.14 StreamFunctions.o
63:07.14 ZipWriterModule.o
63:07.26 nsDeflateConverter.o
63:07.31 nsBidiUtils.o
63:07.48 nsPosixLocale.o
63:07.52 nsSpecialCasingData.o
63:07.64 nsZipDataStream.o
63:08.21 nsAndroidCharset.o
63:08.21 nsUnicharUtils.o
63:08.21 nsZipHeader.o
63:08.30 testException.o
63:08.33 nsUnicodeProperties.o
63:08.80 nsRDFResource.o
63:09.05 nsZipWriter.o
63:09.49 WriteArgument.o
63:09.54 testExternalStrings.o
63:09.65 nsIconChannel.o
63:10.01 nsIconModule.o
63:10.01 nsIconProtocolHandler.o
63:10.30 nsIconURI.o
63:10.78 TestCodeGenBinding.o
63:10.78 TestDictionaryBinding.o
63:11.27 testFindSCCs.o
63:11.79 ANPAudio.o
63:11.79 ANPBitmap.o
63:13.03 testFreshGlobalEvalRedefinition.o
63:14.43 ANPEvent.o
63:14.44 IndexedDBChild.o
63:14.45 IndexedDBParent.o
63:15.17 ANPLog.o
63:17.91 testFuncCallback.o
63:18.39 ANPMatrix.o
63:18.91 ANPNativeWindow.o
63:19.21 ANPOpenGL.o
63:19.56 testFunctionProperties.o
63:21.03 testGCAllocator.o
63:21.17 ANPSurface.o
63:23.43 testGCExactRooting.o
63:23.69 ANPSystem.o
63:26.00 In file included from ../../../dist/include/mozilla/dom/indexedDB/IndexedDatabase.h:14:0,
63:26.00                  from /opt/FirefoxSource/mozilla-release/dom/indexedDB/ipc/IndexedDBParent.h:11,
63:26.00                  from /opt/FirefoxSource/mozilla-release/dom/indexedDB/ipc/IndexedDBParent.cpp:6:
63:26.00 ../../../dist/include/nsAutoPtr.h: In member function 'nsresult mozilla::dom::indexedDB::IndexedDBDatabaseParent::HandleRequestEvent(nsIDOMEvent*, const nsAString_internal&)':
63:26.00 Warning: -Wmaybe-uninitialized in /opt/FirefoxSource/mozilla-release/objdir-droid/dist/include/nsAutoPtr.h: 'database' may be used uninitialized in this function
63:26.00 ../../../dist/include/nsAutoPtr.h:926:5: warning: 'database' may be used uninitialized in this function [-Wmaybe-uninitialized]
63:26.00 /opt/FirefoxSource/mozilla-release/dom/indexedDB/ipc/IndexedDBParent.cpp:417:16: note: 'database' was declared here
63:30.06 testGCFinalizeCallback.o
63:37.44 ANPVideo.o
63:37.44 TestExampleGenBinding.o
63:37.48 testGCHeapPostBarriers.o
63:58.22 TestJSImplGenBinding.o
63:58.61 AndroidLocationProvider.o
63:58.61 nsHapticFeedback.o
63:58.73 testGCOutOfMemory.o
63:58.76 testGCStoreBufferRemoval.o
64:00.01 ANPWindow.o
64:00.85 testHashTable.o
64:00.88 testHashTableInit.o
64:04.45 TestJSImplInheritanceGenBinding.o
64:05.03 testIndexToString.o
64:06.29 TestAudioChannelService.o
64:06.77 testIntString.o
64:07.76 nptest.o
64:07.76 nptest_droid.o
64:10.13 nptest_utils.o
64:10.53 nptest_name.o
64:10.54 testIntTypesABI.o
64:10.95 testIntern.o
64:12.52 nptest.o
64:12.53 nptest_droid.o
64:12.88 testIsInsideNursery.o
64:14.96 testJSEvaluateScript.o
64:15.08 nptest_utils.o
64:18.65 nptest_name.o
64:19.37 TestTypedefBinding.o
64:20.31 MediaEncoder.o
64:20.31 OpusTrackEncoder.o
64:21.05 testJitFoldsTo.o
64:22.22 TrackEncoder.o
64:23.72 testJitMoveEmitterCycles.o
64:24.29 testJitRValueAlloc.o
64:24.85 testLookup.o
64:25.95 GMPChild.o
64:25.95 GMPParent.o
64:28.14 testLooselyEqual.o
64:28.77 GMPPlatform.o
64:29.23 testMappedArrayBuffer.o
64:32.94 testNewObject.o
64:34.10 GMPProcessChild.o
64:35.55 GMPProcessParent.o
64:36.37 GMPService.o
64:37.63 GMPSharedMemManager.o
64:37.68 testNullRoot.o
64:39.89 GMPVideoDecoderChild.o
64:41.57 GMPVideoDecoderParent.o
64:44.11 testOOM.o
64:44.12 testObjectEmulatingUndefined.o
64:44.62 GMPVideoEncodedFrameImpl.o
64:47.03 GMPVideoEncoderChild.o
64:47.07 MediaSource.o
64:47.07 MediaSourceDecoder.o
64:47.17 testOps.o
64:48.20 GMPVideoEncoderParent.o
64:49.59 testOriginPrincipals.o
64:49.75 GMPVideoHost.o
64:51.68 SourceBuffer.o
64:51.92 GMPVideoPlaneImpl.o
64:52.02 testParseJSON.o
64:52.70 OggCodecState.o
64:52.70 OggDecoder.o
64:52.99 GMPVideoi420FrameImpl.o
64:55.29 testPersistentRooted.o
64:57.33 SourceBufferList.o
64:57.61 testProfileStrings.o
64:58.07 testPropCache.o
64:59.75 OggReader.o
64:59.87 AnalyserNode.o
64:59.87 AudioBuffer.o
65:00.11 SourceBufferResource.o
65:00.97 testRegExp.o
65:03.74 AudioBufferSourceNode.o
65:03.84 OggWriter.o
65:03.92 testResolveRecursion.o
65:04.57 testSameValue.o
65:06.28 AudioContext.o
65:07.86 testScriptInfo.o
65:08.29 RawDecoder.o
65:08.29 RawReader.o
65:08.73 OpusParser.o
65:09.47 testScriptObject.o
65:12.08 testSetProperty.o
65:12.77 WebMBufferedParser.o
65:12.77 WebMDecoder.o
65:14.01 WaveDecoder.o
65:14.01 WaveReader.o
65:15.11 WebMReader.o
65:18.75 testSetPropertyIgnoringNamedGetter.o
65:18.82 AudioDestinationNode.o
65:21.28 testSourcePolicy.o
65:22.92 AndroidMediaDecoder.o
65:22.92 AndroidMediaPluginHost.o
65:23.59 AudioListener.o
65:23.69 testStringBuffer.o
65:25.37 AndroidMediaReader.o
65:25.65 testStructuredClone.o
65:26.08 testSymbol.o
65:26.97 AudioNode.o
65:28.10 MediaEngineDefault.o
65:28.10 PeerIdentity.o
65:29.84 testToIntWidth.o
65:29.86 AndroidMediaResourceServer.o
65:31.81 AudioParam.o
65:32.02 testTrap.o
65:33.04 SpeechSynthesis.o
65:33.04 SpeechSynthesisUtterance.o
65:33.78 SpeechGrammar.o
65:33.78 SpeechGrammarList.o
65:34.13 testTypedArrays.o
65:34.36 SpeechRecognition.o
65:34.93 SpeechRecognitionAlternative.o
65:35.20 AudioProcessingEvent.o
65:36.94 testUTF8.o
65:37.55 SpeechSynthesisVoice.o
65:37.94 BiquadFilterNode.o
65:39.65 SpeechRecognitionResult.o
65:41.44 ChannelMergerNode.o
65:41.84 SpeechSynthesisChild.o
65:42.14 testUncaughtError.o
65:42.18 SpeechRecognitionResultList.o
65:44.13 SpeechSynthesisParent.o
65:44.33 testWeakMap.o
65:44.58 ChannelSplitterNode.o
65:44.80 SpeechStreamListener.o
65:47.41 endpointer.o
65:48.32 ConvolverNode.o
65:49.23 nsSpeechTask.o
65:49.97 energy_endpointer.o
65:50.55 energy_endpointer_params.o
65:50.85 DelayBuffer.o
65:51.02 FakeSpeechRecognitionService.o
65:52.01 nsSynthVoiceRegistry.o
65:55.55 DelayNode.o
65:56.15 CDMProxy.o
65:56.15 EMELog.o
65:59.02 DynamicsCompressorNode.o
65:59.40 MediaKeyError.o
65:59.41 TestAudioCompactor.o
65:59.41 TestTrackEncoder.o
65:59.44 MediaKeyMessageEvent.o
66:00.58 MediaKeyNeededEvent.o
66:03.02 FFTBlock.o
66:04.58 testXDR.o
66:04.62 TestVideoSegment.o
66:05.38 MediaKeySession.o
66:07.53 tests.o
66:07.96 MediaKeys.o
66:08.51 GainNode.o
66:10.95 TestAudioMixer.o
66:11.41 MediaBufferDecoder.o
66:11.41 TestTXMgr.o
66:13.66 host_ListCSSProperties.o
66:14.50 nsTreeBodyFrame.o
66:14.50 nsTreeBoxObject.o
66:14.65 MediaElementAudioSourceNode.o
66:15.49 MediaStreamAudioDestinationNode.o
66:16.42 MediaStreamAudioSourceNode.o
66:17.60 /opt/FirefoxSource/mozilla-release/content/media/webaudio/MediaBufferDecoder.cpp: In member function 'void mozilla::WebAudioDecodeJob::OnFailure(mozilla::WebAudioDecodeJob::ErrorCode)':
66:17.60 Warning: -Wmaybe-uninitialized in /opt/FirefoxSource/mozilla-release/content/media/webaudio/MediaBufferDecoder.cpp: 'errorMessage' may be used uninitialized in this function
66:17.60 /opt/FirefoxSource/mozilla-release/content/media/webaudio/MediaBufferDecoder.cpp:583:48: warning: 'errorMessage' may be used uninitialized in this function [-Wmaybe-uninitialized]
66:18.10 OfflineAudioCompletionEvent.o
66:18.50 nsGrid.o
66:18.50 nsGridCell.o
66:19.78 OscillatorNode.o
66:21.53 nsTreeColFrame.o
66:21.62 PannerNode.o
66:22.18 /opt/FirefoxSource/mozilla-release/layout/xul/tree/nsTreeBodyFrame.cpp: In member function 'void nsTreeBodyFrame::PaintCell(int32_t, nsTreeColumn*, const nsRect&, nsPresContext*, nsRenderingContext&, const nsRect&, nscoord&, nsPoint)':
66:22.18 Warning: -Wmaybe-uninitialized in /opt/FirefoxSource/mozilla-release/layout/xul/tree/nsTreeBodyFrame.cpp: 'color' may be used uninitialized in this function
66:22.18 /opt/FirefoxSource/mozilla-release/layout/xul/tree/nsTreeBodyFrame.cpp:3209:40: warning: 'color' may be used uninitialized in this function [-Wmaybe-uninitialized]
66:22.19 nsTreeColumns.o
66:23.86 nsGridLayout2.o
66:24.80 In file included from /opt/FirefoxSource/mozilla-release/layout/xul/tree/../nsBox.h:10:0,
66:24.80                  from /opt/FirefoxSource/mozilla-release/layout/xul/tree/../../generic/nsFrame.h:14,
66:24.80                  from /opt/FirefoxSource/mozilla-release/layout/xul/tree/../../generic/nsLeafFrame.h:12,
66:24.80                  from /opt/FirefoxSource/mozilla-release/layout/xul/tree/../nsLeafBoxFrame.h:9,
66:24.80                  from /opt/FirefoxSource/mozilla-release/layout/xul/tree/nsTreeBodyFrame.h:11,
66:24.80                  from /opt/FirefoxSource/mozilla-release/layout/xul/tree/nsTreeBoxObject.cpp:15:
66:24.80 /opt/FirefoxSource/mozilla-release/layout/xul/tree/../../generic/nsIFrame.h: In member function 'nsTreeBodyFrame* nsTreeBoxObject::GetTreeBody(bool)':
66:24.80 Warning: -Wmaybe-uninitialized in /opt/FirefoxSource/mozilla-release/layout/generic/nsIFrame.h: 'frame' may be used uninitialized in this function
66:24.80 /opt/FirefoxSource/mozilla-release/layout/xul/tree/../../generic/nsIFrame.h:487:43: warning: 'frame' may be used uninitialized in this function [-Wmaybe-uninitialized]
66:24.80 /opt/FirefoxSource/mozilla-release/layout/xul/tree/nsTreeBoxObject.cpp:87:13: note: 'frame' was declared here
66:25.49 nsTreeContentView.o
66:25.85 PeriodicWave.o
66:26.03 nsTreeImageListener.o
66:27.05 nsGridRow.o
66:30.13 nsGridRowGroupFrame.o
66:30.16 ScriptProcessorNode.o
66:30.31 nsTreeSelection.o
66:30.81 JSStreamWriterTest.o
66:30.81 LulTest.o
66:32.19 nsGridRowGroupLayout.o
66:32.67 ThreeDPoint.o
66:33.29 nsTreeStyleCache.o
66:38.42 WaveShaperNode.o
66:39.53 nsTreeUtils.o
66:39.54 ThreadProfileTest.o
66:39.62 WebAudioUtils.o
66:39.63 nsGridRowLayout.o
66:41.81 nsGridRowLeafFrame.o
66:43.31 nsGridRowLeafLayout.o
66:43.49 jsctypes-test-errno.o
66:43.49 jsctypes-test-finalizer.o
66:43.66 jsctypes-test.o
66:44.97 TestStartupCache.o
66:45.24 StaticXULComponentsEnd.o
66:46.01 nssgtest.o
66:46.01 pkixbuild_tests.o
66:46.02 pkixtestutil.o
66:46.04 Biquad.o
66:46.04 DirectConvolver.o
66:48.18 TestAudioEventTimeline.o
66:48.37 DynamicsCompressor.o
66:48.52 DynamicsCompressorKernel.o
66:48.83 FFTConvolver.o
66:49.15 pkixcert_extension_tests.o
66:49.43 pkixcert_signature_algorithm_tests.o
66:50.01 pkixcheck_CheckKeyUsage_tests.o
66:51.63 pkixcheck_CheckValidity_tests.o
66:51.89 HRTFDatabase.o
66:52.10 pkixder_input_tests.o
66:52.36 pkixder_pki_types_tests.o
66:53.47 pkixder_universal_types_tests.o
66:53.91 pkixocsp_CreateEncodedOCSPRequest_tests.o
66:54.51 HRTFDatabaseLoader.o
66:56.75 pkixocsp_VerifyEncodedOCSPResponse.o
66:57.10 HRTFElevation.o
66:57.89 HRTFKernel.o
66:58.41 HRTFPanner.o
66:60.00 PeriodicWave.o
67:00.27 Reverb.o
67:00.97 ReverbAccumulationBuffer.o
67:01.03 ReverbConvolver.o
67:02.92 ReverbConvolverStage.o
67:03.27 ReverbInputBuffer.o
67:03.55 ZeroPole.o
67:07.08 libstlport_static.a
67:08.40 annotationProcessors.jar
67:10.45 Note: /opt/FirefoxSource/mozilla-release/build/annotationProcessors/utils/GeneratableElementIterator.java uses unchecked or unsafe operations.
67:10.45 Note: Recompile with -Xlint:unchecked for details.
67:10.99 libmfbt.a.desc
67:11.10 TestArrayUtils
67:11.10 TestAtomics
67:11.10 TestBinarySearch
67:11.11 TestBloomFilter
67:11.11 TestCasting
67:11.53 TestCeilingFloor
67:11.53 TestCheckedInt
67:11.53 TestCountPopulation
67:11.54 TestCountZeroes
67:11.64 TestEndian
67:11.65 TestEnumSet
67:11.66 TestFloatingPoint
67:11.68 TestIntegerPrintfMacros
67:11.76 TestMacroArgs
67:11.77 TestMacroForEach
67:11.77 TestPair
67:11.79 TestRollingMean
67:11.88 TestSHA1
67:11.88 TestTypedEnum
67:11.88 TestTypeTraits
67:11.91 TestUniquePtr
67:11.98 TestWeakPtr
67:11.99 TestPoisonArea
67:12.40 libother-licenses_android.a.desc
67:12.70 libjemalloc.a.desc
67:13.49 libmemory.a.desc
67:14.16 liblinker.a.desc
67:14.16 szip
67:14.91 libmozglue_android.a.desc
67:15.35 libmozglue.so
67:16.27 TestZip
67:16.49 libmozalloc.so
67:17.98 libmozsqlite3.a.desc
67:18.08 libmedia_libjpeg.a.desc
67:18.19 libmedia_libtremor_lib.a.desc
67:18.35 libmedia_libopus.a.desc
67:18.54 libmedia_libnestegg_src.a.desc
67:18.72 libmedia_libvpx.a.desc
67:18.96 libmozpng.a.desc
67:19.06 libmedia_kiss_fft.a.desc
67:19.15 libcubeb.a.desc
67:19.23 libmedia_libogg.a.desc
67:19.32 libmedia_libtheora_lib.a.desc
67:19.40 libspeex.a.desc
67:19.52 libmedia_libstagefright.a.desc
67:19.66 libmedia_libsoundtouch_src.a.desc
67:19.94 /opt/FirefoxSource/mozilla-release/security/build/nss.def: WARNING: no preprocessor directives found
67:20.11 /opt/FirefoxSource/mozilla-release/security/build/nspr-dummy.def: WARNING: no preprocessor directives found
67:20.16 quickder.c: In function 'DecodeItem':
67:20.16 quickder.c:611:12: warning: variable 'optional' set but not used [-Wunused-but-set-variable]
67:20.23 sechash.c: In function 'HASH_ResultLen':
67:20.23 sechash.c:263:5: warning: comparison of unsigned expression < 0 is always false [-Wtype-limits]
67:20.23 sechash.c: In function 'HASH_HashBuf':
67:20.23 sechash.c:288:5: warning: comparison of unsigned expression < 0 is always false [-Wtype-limits]
67:20.23 sechash.c: In function 'HASH_Create':
67:20.23 sechash.c:310:5: warning: comparison of unsigned expression < 0 is always false [-Wtype-limits]
67:20.61 derenc.c: In function 'der_encode':
67:20.61 derenc.c:282:22: warning: variable 'optional' set but not used [-Wunused-but-set-variable]
67:21.50 nssb64e.c: In function 'NSSBase64_EncodeItem_Util':
67:21.50 nssb64e.c:684:15: warning: 'out_len' may be used uninitialized in this function [-Wmaybe-uninitialized]
67:21.61 pk11akey.c: In function 'pk11_get_Decoded_ECPoint':
67:21.61 pk11akey.c:406:26: warning: comparison between signed and unsigned integer expressions [-Wsign-compare]
67:21.61 pk11akey.c:420:63: warning: comparison between signed and unsigned integer expressions [-Wsign-compare]
67:21.74 ocsp.c: In function 'ocsp_RemoveCacheItem':
67:21.74 ocsp.c:562:12: warning: variable 'couldRemoveFromHashTable' set but not used [-Wunused-but-set-variable]
67:22.00 certhigh.c: In function 'CERT_MatchNickname':
67:22.00 certhigh.c:28:9: warning: variable 'len' set but not used [-Wunused-but-set-variable]
67:22.47 pk11cert.c: In function 'pk11_fastCert':
67:22.47 pk11cert.c:231:14: warning: variable 'status' set but not used [-Wunused-but-set-variable]
67:22.47 pk11cert.c: In function 'PK11_MakeCertFromHandle':
67:22.47 pk11cert.c:297:12: warning: variable 'swapNickname' set but not used [-Wunused-but-set-variable]
67:22.47 pk11cert.c:296:12: warning: variable 'isFortezzaRootCA' set but not used [-Wunused-but-set-variable]
67:22.47 pk11cert.c: In function 'PK11_TraverseCertsForNicknameInSlot':
67:22.47 pk11cert.c:2012:28: warning: variable 'pk11cb' set but not used [-Wunused-but-set-variable]
67:22.47 pk11cert.c: In function 'PK11_FindCertFromDERCertItem':
67:22.47 pk11cert.c:2156:21: warning: unused variable 'td' [-Wunused-variable]
67:23.04 certvfypkix.c: In function 'setRevocationMethod':
67:23.04 certvfypkix.c:1422:17: warning: comparison between signed and unsigned integer expressions [-Wsign-compare]
67:23.94 secoid.c: In function 'SECOID_Init':
67:23.94 secoid.c:1922:19: warning: variable 'c' set but not used [-Wunused-but-set-variable]
67:23.99 certificate.c: In function 'nssCertificateList_DoCallback':
67:23.99 certificate.c:898:14: warning: variable 'nssrv' set but not used [-Wunused-but-set-variable]
67:23.99 alg1485.c: In function 'cert_AVAOidTagToMaxLen':
67:24.00 alg1485.c:162:57: warning: signed and unsigned type in conditional expression [-Wsign-compare]
67:24.00 alg1485.c: In function 'AppendAVA':
67:24.00 alg1485.c:963:40: warning: signed and unsigned type in conditional expression [-Wsign-compare]
67:24.88 certdb.c: In function 'cert_VerifySubjectAltName':
67:24.88 certdb.c:1428:18: warning: variable 'hnLen' set but not used [-Wunused-but-set-variable]
67:24.88 certdb.c: In function 'CERT_ImportCerts':
67:24.88 certdb.c:2440:15: warning: variable 'rv' set but not used [-Wunused-but-set-variable]
67:24.88 certdb.c: In function 'CERT_UnlockCertRefCount':
67:24.88 certdb.c:2890:14: warning: variable 'prstat' set but not used [-Wunused-but-set-variable]
67:24.88 certdb.c: In function 'CERT_UnlockCertTrust':
67:24.88 certdb.c:2970:14: warning: variable 'prstat' set but not used [-Wunused-but-set-variable]
67:24.93 trustdomain.c: In function 'NSSTrustDomain_TraverseCertificates':
67:24.93 trustdomain.c:998:14: warning: variable 'status' set but not used [-Wunused-but-set-variable]
67:25.21 utilmod.c: In function 'nssutil_DeleteSecmodDBEntry.isra.1':
67:25.21 utilmod.c:545:12: warning: 'lib_len' may be used uninitialized in this function [-Wmaybe-uninitialized]
67:25.22 In file included from pk11load.c:26:0:
67:25.22 debug_module.c: In function 'log_handle':
67:25.22 debug_module.c:339:28: warning: comparison between signed and unsigned integer expressions [-Wsign-compare]
67:25.22 debug_module.c:343:28: warning: comparison between signed and unsigned integer expressions [-Wsign-compare]
67:25.22 pk11load.c: In function 'SECMOD_UnloadModule':
67:25.22 pk11load.c:592:28: warning: unused variable 'status' [-Wunused-variable]
67:25.43 tdcache.c: In function 'add_cert_to_cache':
67:25.43 tdcache.c:773:9: warning: variable 'handle' set but not used [-Wunused-but-set-variable]
67:25.43 tdcache.c: In function 'nssTrustDomain_RemoveCertFromCacheLOCKED':
67:25.43 tdcache.c:272:16: warning: 'nickname' may be used uninitialized in this function [-Wmaybe-uninitialized]
67:25.43 tdcache.c:332:14: note: 'nickname' was declared here
67:25.70 utilpars.c: In function 'nssutil_mkSlotFlags':
67:25.70 utilpars.c:679:17: warning: comparison between signed and unsigned integer expressions [-Wsign-compare]
67:25.70 utilpars.c: In function 'nssutil_mkCipherFlags':
67:25.70 utilpars.c:891:17: warning: comparison between signed and unsigned integer expressions [-Wsign-compare]
67:25.70 utilpars.c:910:17: warning: comparison between signed and unsigned integer expressions [-Wsign-compare]
67:26.42 crl.c: In function 'crl_storeCRL':
67:26.42 crl.c:630:15: warning: variable 'rv' set but not used [-Wunused-but-set-variable]
67:26.42 crl.c: In function 'cert_CheckCertRevocationStatus':
67:26.42 crl.c:2688:27: warning: unused variable 'rv2' [-Wunused-variable]
67:26.42 crl.c: In function 'cert_CacheCRLByGeneralName':
67:26.42 crl.c:3045:32: warning: variable 'rv2' set but not used [-Wunused-but-set-variable]
67:26.76 pk11merge.c: In function 'pk11_matchAcrossTokens':
67:26.76 pk11merge.c:100:32: warning: comparison between signed and unsigned integer expressions [-Wsign-compare]
67:26.88 pkibase.c: In function 'nssPKIObjectCollection_Traverse':
67:26.88 pkibase.c:906:14: warning: variable 'status' set but not used [-Wunused-but-set-variable]
67:26.88 pkibase.c: In function 'nssCertificateCollection_Create':
67:26.88 pkibase.c:1060:14: warning: variable 'status' set but not used [-Wunused-but-set-variable]
67:26.88 pkibase.c: In function 'nssCRLCollection_Create':
67:26.88 pkibase.c:1167:14: warning: variable 'status' set but not used [-Wunused-but-set-variable]
67:27.10 devtoken.c: In function 'nssToken_TraverseCertificates':
67:27.10 devtoken.c:1469:14: warning: variable 'status' set but not used [-Wunused-but-set-variable]
67:27.34 pki3hack.c: In function 'DeleteCertTrustMatchingSlot':
67:27.34 pki3hack.c:1275:27: warning: comparison between signed and unsigned integer expressions [-Wsign-compare]
67:27.34 pki3hack.c: In function 'STAN_DeleteCertTrustMatchingSlot':
67:27.34 pki3hack.c:1333:19: warning: comparison between signed and unsigned integer expressions [-Wsign-compare]
67:27.66 ckhelper.c: In function 'nssCKObject_GetAttributes':
67:27.66 ckhelper.c:139:36: warning: comparison between signed and unsigned integer expressions [-Wsign-compare]
67:27.66 ckhelper.c: In function 'nssCryptokiTrust_GetAttributes':
67:27.67 ckhelper.c:442:36: warning: comparison between signed and unsigned integer expressions [-Wsign-compare]
67:27.73 pk11obj.c: In function 'PK11_MatchItem':
67:27.73 pk11obj.c:1799:72: warning: comparison between signed and unsigned integer expressions [-Wsign-compare]
67:27.73 pk11obj.c:1784:22: warning: variable 'parent' set but not used [-Wunused-but-set-variable]
67:28.08 pk11pars.c: In function 'secmod_ParseModuleSpecForTokens':
67:28.08 pk11pars.c:364:47: warning: suggest braces around empty body in an 'else' statement [-Wempty-body]
67:28.08 pk11pars.c:366:47: warning: suggest braces around empty body in an 'else' statement [-Wempty-body]
67:28.08 pk11pars.c:375:6: warning: suggest braces around empty body in an 'else' statement [-Wempty-body]
67:28.08 pk11pars.c:384:7: warning: suggest braces around empty body in an 'else' statement [-Wempty-body]
67:28.08 pk11pars.c:393:7: warning: suggest braces around empty body in an 'else' statement [-Wempty-body]
67:28.08 pk11pars.c:402:7: warning: suggest braces around empty body in an 'else' statement [-Wempty-body]
67:28.08 pk11pars.c: In function 'secmod_MkAppendTokensList':
67:28.08 pk11pars.c:767:13: warning: comparison between signed and unsigned integer expressions [-Wsign-compare]
67:28.08 pk11pars.c:804:13: warning: comparison between signed and unsigned integer expressions [-Wsign-compare]
67:28.46 pk11pk12.c: In function 'PK11_ImportPrivateKeyInfoAndReturnKey':
67:28.46 pk11pk12.c:425:17: warning: variable 'keyType' set but not used [-Wunused-but-set-variable]
67:29.49 pk11pqg.c: In function 'PK11_PQG_ParamGenSeedLen':
67:29.49 pk11pqg.c:230:56: warning: signed and unsigned type in conditional expression [-Wsign-compare]
67:29.49 pk11pqg.c: In function 'PK11_PQG_ParamGen':
67:29.49 pk11pqg.c:241:56: warning: signed and unsigned type in conditional expression [-Wsign-compare]
67:29.49 pk11pqg.c: In function 'PK11_PQG_VerifyParams':
67:29.49 pk11pqg.c:295:19: warning: comparison between signed and unsigned integer expressions [-Wsign-compare]
67:29.51 list.c: In function 'nssList_Add':
67:29.51 list.c:220:14: warning: variable 'nssrv' set but not used [-Wunused-but-set-variable]
67:30.25 pk11skey.c: In function 'pk11_TokenKeyGenWithFlagsAndKeyType':
67:30.25 pk11skey.c:926:17: warning: comparison between signed and unsigned integer expressions [-Wsign-compare]
67:30.25 pk11skey.c: In function 'pk11_HandUnwrap':
67:30.25 pk11skey.c:2296:40: warning: signed and unsigned type in conditional expression [-Wsign-compare]
67:30.30 pk11slot.c: In function 'PK11_InitToken':
67:30.30 pk11slot.c:1108:11: warning: variable 'tmp' set but not used [-Wunused-but-set-variable]
67:30.30 pk11slot.c: In function 'PK11_InitSlot':
67:30.30 pk11slot.c:1352:11: warning: variable 'tmp' set but not used [-Wunused-but-set-variable]
67:30.30 pk11slot.c: In function 'PK11_GetBestSlotMultipleWithAttributes':
67:30.30 pk11slot.c:2076:17: warning: comparison between signed and unsigned integer expressions [-Wsign-compare]
67:30.30 pk11slot.c:2094:18: warning: comparison between signed and unsigned integer expressions [-Wsign-compare]
67:30.30 pk11slot.c: In function 'PK11_ResetToken':
67:30.30 pk11slot.c:2317:22: warning: comparison between signed and unsigned integer expressions [-Wsign-compare]
67:30.30 pk11slot.c:2322:22: warning: comparison between signed and unsigned integer expressions [-Wsign-compare]
67:30.71 pk11util.c: In function 'SECMOD_UpdateSlotList':
67:30.71 pk11util.c:931:15: warning: comparison between signed and unsigned integer expressions [-Wsign-compare]
67:30.98 pkix_revocationchecker.c: In function 'PKIX_RevocationChecker_Check':
67:30.98 pkix_revocationchecker.c:347:25: warning: comparison between signed and unsigned integer expressions [-Wsign-compare]
67:32.26 pkix_tools.c: In function 'pkix_i2hex':
67:32.26 pkix_tools.c:482:9: warning: comparison is always true due to limited range of data type [-Wtype-limits]
67:33.64 pkix_build.c: In function 'pkix_Build_SelectCertsFromTrustAnchors':
67:33.64 pkix_build.c:1541:38: warning: comparison between signed and unsigned integer expressions [-Wsign-compare]
67:33.95 pkix_errpaths.c: In function 'PKIX_DoReturn':
67:33.95 pkix_errpaths.c:58:2: warning: suggest braces around empty body in an 'if' statement [-Wempty-body]
67:34.64 pkix_pl_lifecycle.c: In function 'pkix_pl_lifecycle_ObjectLeakCheck':
67:34.64 pkix_pl_lifecycle.c:87:55: warning: comparison between signed and unsigned integer expressions [-Wsign-compare]
67:34.64 pkix_pl_lifecycle.c: In function 'PKIX_PL_Shutdown':
67:34.64 pkix_pl_lifecycle.c:248:21: warning: variable 'numLeakedObjects' set but not used [-Wunused-but-set-variable]
67:34.99 pkix_pl_cert.c: In function 'PKIX_PL_Cert_Create':
67:34.99 pkix_pl_cert.c:1518:22: warning: variable 'copyDER' set but not used [-Wunused-but-set-variable]
67:35.14 nssinit.c: In function 'NSS_VersionCheck':
67:35.14 nssinit.c:1250:19: warning: variable 'c' set but not used [-Wunused-but-set-variable]
67:35.22 pkix_pl_httpdefaultclient.c: In function 'pkix_pl_HttpDefaultClient_HdrCheckComplete':
67:35.22 pkix_pl_httpdefaultclient.c:268:32: warning: comparison between signed and unsigned integer expressions [-Wsign-compare]
67:35.22 pkix_pl_httpdefaultclient.c:285:41: warning: comparison between signed and unsigned integer expressions [-Wsign-compare]
67:35.22 pkix_pl_httpdefaultclient.c:293:40: warning: comparison between signed and unsigned integer expressions [-Wsign-compare]
67:35.22 pkix_pl_httpdefaultclient.c: In function 'pkix_pl_HttpDefaultClient_RecvBody':
67:35.22 pkix_pl_httpdefaultclient.c:925:39: warning: comparison between signed and unsigned integer expressions [-Wsign-compare]
67:35.22 pkix_pl_httpdefaultclient.c:940:31: warning: comparison between signed and unsigned integer expressions [-Wsign-compare]
67:35.22 pkix_pl_httpdefaultclient.c:945:31: warning: comparison between signed and unsigned integer expressions [-Wsign-compare]
67:35.22 pkix_pl_httpdefaultclient.c:951:38: warning: comparison between signed and unsigned integer expressions [-Wsign-compare]
67:35.22 pkix_pl_httpdefaultclient.c:995:39: warning: comparison between signed and unsigned integer expressions [-Wsign-compare]
67:35.22 pkix_pl_httpdefaultclient.c:1005:43: warning: comparison between signed and unsigned integer expressions [-Wsign-compare]
67:35.22 pkix_pl_httpdefaultclient.c: In function 'pkix_pl_HttpDefaultClient_KeepAliveSession':
67:35.22 pkix_pl_httpdefaultclient.c:1135:36: warning: variable 'client' set but not used [-Wunused-but-set-variable]
67:35.22 pkix_pl_httpdefaultclient.c: In function 'pkix_pl_HttpDefaultClient_TrySendAndReceive':
67:35.22 pkix_pl_httpdefaultclient.c:1429:63: warning: comparison between signed and unsigned integer expressions [-Wsign-compare]
67:35.22 pkix_pl_httpdefaultclient.c: In function 'pkix_pl_HttpDefaultClient_Cancel':
67:35.22 pkix_pl_httpdefaultclient.c:1487:36: warning: variable 'client' set but not used [-Wunused-but-set-variable]
67:35.68 pkix_pl_object.c: In function 'pkix_pl_Object_GetHeader':
67:35.68 pkix_pl_object.c:115:34: warning: comparison between signed and unsigned integer expressions [-Wsign-compare]
67:36.06 dtlscon.c: In function 'ssl3_DisableNonDTLSSuites':
67:36.06 dtlscon.c:107:19: warning: unused variable 'rv' [-Wunused-variable]
67:36.06 dtlscon.c: In function 'dtls_HandleHandshake':
67:36.06 dtlscon.c:399:37: warning: comparison between signed and unsigned integer expressions [-Wsign-compare]
67:36.06 dtlscon.c:428:48: warning: comparison between signed and unsigned integer expressions [-Wsign-compare]
67:36.06 dtlscon.c: In function 'dtls_TransmitMessageFlight':
67:36.06 dtlscon.c:679:60: warning: comparison between signed and unsigned integer expressions [-Wsign-compare]
67:36.06 dtlscon.c:679:120: warning: signed and unsigned type in conditional expression [-Wsign-compare]
67:36.06 dtlscon.c:717:26: warning: comparison between signed and unsigned integer expressions [-Wsign-compare]
67:36.06 dtlscon.c: In function 'dtls_SetMTU':
67:36.06 dtlscon.c:952:19: warning: comparison between signed and unsigned integer expressions [-Wsign-compare]
67:36.40 pkix_pl_crl.c: In function 'pkix_pl_CRL_ToString':
67:36.40 pkix_pl_crl.c:455:58: warning: 'crlVersion' may be used uninitialized in this function [-Wmaybe-uninitialized]
67:36.40 pkix_pl_crl.c:354:21: note: 'crlVersion' was declared here
67:36.48 pkix_pl_ldaprequest.c: In function 'pkix_pl_LdapRequest_Destroy':
67:36.48 pkix_pl_ldaprequest.c:266:30: warning: variable 'ldapRq' set but not used [-Wunused-but-set-variable]
67:37.22 pkix_pl_ldapdefaultclient.c: In function 'pkix_pl_LdapDefaultClient_VerifyBindResponse':
67:37.22 pkix_pl_ldapdefaultclient.c:371:21: warning: '*((void *)&msg+16).resultCode.data' may be used uninitialized in this function [-Wmaybe-uninitialized]
67:37.22 pkix_pl_ldapdefaultclient.c:354:21: note: '*((void *)&msg+16).resultCode.data' was declared here
67:38.01 pkix_pl_pk11certstore.c: In function 'NameCacheHasFetchedCrlInfo':
67:38.01 pkix_pl_pk11certstore.c:382:22: warning: variable 'cert' set but not used [-Wunused-but-set-variable]
67:38.01 pkix_pl_pk11certstore.c: In function 'RemovePartitionedDpsFromList':
67:38.01 pkix_pl_pk11certstore.c:701:20: warning: comparison between signed and unsigned integer expressions [-Wsign-compare]
67:38.01 pkix_pl_pk11certstore.c: In function 'DownloadCrl':
67:38.01 pkix_pl_pk11certstore.c:782:16: warning: variable 'savedError' set but not used [-Wunused-but-set-variable]
67:38.24 p12e.c: In function 'sec_PKCS12CreateSafeBag':
67:38.24 p12e.c:698:12: warning: variable 'setName' set but not used [-Wunused-but-set-variable]
67:38.24 p12e.c: In function 'sec_pkcs12_encoder_start_context':
67:38.24 p12e.c:1535:12: warning: variable 'rv' set but not used [-Wunused-but-set-variable]
67:39.06 ssl3con.c: In function 'ssl3_CompressMACEncryptRecord':
67:39.06 ssl3con.c:2559:12: warning: comparison between signed and unsigned integer expressions [-Wsign-compare]
67:39.06 ssl3con.c: In function 'ssl3_FlushHandshakeMessages':
67:39.06 ssl3con.c:3122:19: warning: comparison between signed and unsigned integer expressions [-Wsign-compare]
67:39.06 ssl3con.c: In function 'ssl3_HandleClientHello':
67:39.06 ssl3con.c:7782:23: warning: comparison between signed and unsigned integer expressions [-Wsign-compare]
67:39.06 ssl3con.c:8286:28: warning: comparison between signed and unsigned integer expressions [-Wsign-compare]
67:39.06 ssl3con.c: In function 'ssl3_HandleRSAClientKeyExchange':
67:39.06 ssl3con.c:9211:13: warning: variable 'pmsItem' set but not used [-Wunused-but-set-variable]
67:39.06 ssl3con.c:9207:12: warning: variable 'isTLS' set but not used [-Wunused-but-set-variable]
67:39.06 ssl3con.c: In function 'ssl3_HandleCertificateStatus':
67:39.06 ssl3con.c:9779:13: warning: comparison between signed and unsigned integer expressions [-Wsign-compare]
67:39.06 ssl3con.c: In function 'ssl3_HandleHandshakeMessage':
67:39.06 ssl3con.c:6951:22: warning: 'preferSha1' may be used uninitialized in this function [-Wmaybe-uninitialized]
67:39.06 ssl3con.c:6917:12: note: 'preferSha1' was declared here
67:39.06 ssl3con.c: In function 'ssl3_HandleRecord':
67:39.06 ssl3con.c:11589:21: warning: 'dtls_seq_num' may be used uninitialized in this function [-Wmaybe-uninitialized]
67:39.06 ssl3con.c:11309:14: note: 'dtls_seq_num' was declared here
67:39.27 ssl3gthr.c: In function 'ssl3_GatherData':
67:39.27 ssl3gthr.c:75:9: warning: comparison between signed and unsigned integer expressions [-Wsign-compare]
67:39.93 certread.c: In function 'CERT_DecodeCertPackage':
67:39.93 certread.c:419:16: warning: comparison between signed and unsigned integer expressions [-Wsign-compare]
67:39.93 certread.c:447:13: warning: comparison between signed and unsigned integer expressions [-Wsign-compare]
67:39.96 sslauth.c: In function 'SSL_AuthCertificate':
67:39.97 sslauth.c:267:18: warning: unused variable 'error' [-Wunused-variable]
67:40.01 pkix_pl_publickey.c: In function 'pkix_pl_PublicKey_Hashcode':
67:40.01 pkix_pl_publickey.c:214:21: warning: variable 'fullHash' set but not used [-Wunused-but-set-variable]
67:40.48 pkix_pl_x500name.c:37:1: warning: 'pkix_pl_X500Name_ToString_Helper' defined but not used [-Wunused-function]
67:40.80 sslcon.c: In function 'ssl2_SendClear':
67:40.80 sslcon.c:865:17: warning: comparison between signed and unsigned integer expressions [-Wsign-compare]
67:40.80 sslcon.c:894:19: warning: comparison between signed and unsigned integer expressions [-Wsign-compare]
67:40.80 sslcon.c: In function 'ssl2_SendStream':
67:40.80 sslcon.c:944:13: warning: comparison between signed and unsigned integer expressions [-Wsign-compare]
67:40.80 sslcon.c:991:19: warning: comparison between signed and unsigned integer expressions [-Wsign-compare]
67:40.80 sslcon.c: In function 'ssl2_SendBlock':
67:40.80 sslcon.c:1058:13: warning: comparison between signed and unsigned integer expressions [-Wsign-compare]
67:40.80 sslcon.c: In function 'ssl2_ServerSetupSessionCypher':
67:40.80 sslcon.c:1624:15: warning: comparison between signed and unsigned integer expressions [-Wsign-compare]
67:40.80 sslcon.c:1648:20: warning: comparison between signed and unsigned integer expressions [-Wsign-compare]
67:40.80 sslcon.c: In function 'ssl2_HandleMessage':
67:40.80 sslcon.c:2498:9: warning: variable 'rv2' set but not used [-Wunused-but-set-variable]
67:40.80 sslcon.c: In function 'ssl2_HandleServerHelloMessage':
67:40.80 sslcon.c:2802:51: warning: comparison between signed and unsigned integer expressions [-Wsign-compare]
67:40.80 sslcon.c:2813:16: warning: comparison between signed and unsigned integer expressions [-Wsign-compare]
67:40.80 sslcon.c:2815:23: warning: comparison between signed and unsigned integer expressions [-Wsign-compare]
67:40.80 sslcon.c:2815:65: warning: signed and unsigned type in conditional expression [-Wsign-compare]
67:40.80 sslcon.c: In function 'NSSSSL_VersionCheck':
67:40.80 sslcon.c:3687:19: warning: variable 'c' set but not used [-Wunused-but-set-variable]
67:40.81 cmscipher.c: In function 'NSS_CMSCipherContext_Decrypt':
67:40.81 cmscipher.c:525:28: warning: comparison between signed and unsigned integer expressions [-Wsign-compare]
67:40.85 p7decode.c: In function 'sec_pkcs7_verify_signature':
67:40.85 p7decode.c:1293:21: warning: variable 'crls' set but not used [-Wunused-but-set-variable]
67:41.09 p7encode.c: In function 'sec_pkcs7_encoder_start_encrypt':
67:41.09 p7encode.c:62:18: warning: variable 'wincx' set but not used [-Wunused-but-set-variable]
67:41.41 p7local.c: In function 'sec_PKCS7Decrypt':
67:41.41 p7local.c:556:28: warning: comparison between signed and unsigned integer expressions [-Wsign-compare]
67:41.94 cmsencode.c: In function 'nss_cms_encoder_notify':
67:41.94 cmsencode.c:125:18: warning: variable 'poolp' set but not used [-Wunused-but-set-variable]
67:41.94 cmsencode.c: In function 'nss_cms_before_data':
67:41.94 cmsencode.c:204:18: warning: variable 'poolp' set but not used [-Wunused-but-set-variable]
67:42.22 basicutil.c: In function 'SECU_PrintPRandOSError':
67:42.22 basicutil.c:628:30: warning: comparison between signed and unsigned integer expressions [-Wsign-compare]
67:42.22 basicutil.c:632:30: warning: comparison between signed and unsigned integer expressions [-Wsign-compare]
67:42.22 basicutil.c: In function 'SECU_SECItemHexStringToBinary':
67:42.22 basicutil.c:705:16: warning: comparison between signed and unsigned integer expressions [-Wsign-compare]
67:42.22 basicutil.c:716:16: warning: comparison between signed and unsigned integer expressions [-Wsign-compare]
67:42.22 basicutil.c: In function 'SECU_PrintAsHex':
67:42.22 basicutil.c:286:13: warning: 'column' may be used uninitialized in this function [-Wmaybe-uninitialized]
67:42.38 crmfpop.c: In function 'CRMF_CertReqMsgSetRAVerifiedPOP':
67:42.38 crmfpop.c:36:14: warning: variable 'dummy' set but not used [-Wunused-but-set-variable]
67:42.38 crmfpop.c: In function 'crmf_generic_encoder_callback':
67:42.38 crmfpop.c:119:38: warning: comparison between signed and unsigned integer expressions [-Wsign-compare]
67:42.38 crmfpop.c: In function 'crmf_encode_popoprivkey':
67:42.38 crmfpop.c:349:33: warning: comparison between signed and unsigned integer expressions [-Wsign-compare]
67:42.41 cmsrecinfo.c: In function 'NSS_CMSRecipientInfo_UnwrapBulkKey':
67:42.41 cmsrecinfo.c:529:21: warning: variable 'encalg' set but not used [-Wunused-but-set-variable]
67:42.48 ssl3ext.c: In function 'arrayContainsExtension':
67:42.48 ssl3ext.c:310:19: warning: comparison between signed and unsigned integer expressions [-Wsign-compare]
67:42.48 ssl3ext.c: In function 'ssl3_HandleServerNameXtn':
67:42.48 ssl3ext.c:417:43: warning: comparison between signed and unsigned integer expressions [-Wsign-compare]
67:42.48 ssl3ext.c:425:17: warning: variable 'type' set but not used [-Wunused-but-set-variable]
67:42.48 ssl3ext.c:457:22: warning: comparison between signed and unsigned integer expressions [-Wsign-compare]
67:42.48 ssl3ext.c:458:31: warning: comparison between signed and unsigned integer expressions [-Wsign-compare]
67:42.49 ssl3ext.c: In function 'ssl3_SendSessionTicketXtn':
67:42.49 ssl3ext.c:538:28: warning: comparison between signed and unsigned integer expressions [-Wsign-compare]
67:42.49 ssl3ext.c:561:25: warning: comparison between signed and unsigned integer expressions [-Wsign-compare]
67:42.49 ssl3ext.c: In function 'ssl3_ServerHandleAppProtoXtn':
67:42.49 ssl3ext.c:681:15: warning: comparison between signed and unsigned integer expressions [-Wsign-compare]
67:42.49 ssl3ext.c: In function 'ssl3_ClientSendNextProtoNegoXtn':
67:42.49 ssl3ext.c:782:28: warning: comparison between signed and unsigned integer expressions [-Wsign-compare]
67:42.49 ssl3ext.c:792:25: warning: comparison between signed and unsigned integer expressions [-Wsign-compare]
67:42.49 ssl3ext.c: In function 'ssl3_ClientSendAppProtoXtn':
67:42.49 ssl3ext.c:817:28: warning: comparison between signed and unsigned integer expressions [-Wsign-compare]
67:42.49 ssl3ext.c:857:25: warning: comparison between signed and unsigned integer expressions [-Wsign-compare]
67:42.49 ssl3ext.c: In function 'ssl3_ServerSendAppProtoXtn':
67:42.49 ssl3ext.c:886:28: warning: comparison between signed and unsigned integer expressions [-Wsign-compare]
67:42.49 ssl3ext.c:905:25: warning: comparison between signed and unsigned integer expressions [-Wsign-compare]
67:42.49 ssl3ext.c: In function 'ssl3_ServerSendStatusRequestXtn':
67:42.49 ssl3ext.c:952:28: warning: comparison between signed and unsigned integer expressions [-Wsign-compare]
67:42.49 ssl3ext.c: In function 'ssl3_ClientSendStatusRequestXtn':
67:42.49 ssl3ext.c:985:28: warning: comparison between signed and unsigned integer expressions [-Wsign-compare]
67:42.49 ssl3ext.c:1013:25: warning: comparison between signed and unsigned integer expressions [-Wsign-compare]
67:42.49 ssl3ext.c: In function 'ssl3_SendNewSessionTicket':
67:42.49 ssl3ext.c:1249:19: warning: comparison between signed and unsigned integer expressions [-Wsign-compare]
67:42.49 ssl3ext.c: In function 'ssl3_ServerHandleSessionTicketXtn':
67:42.49 ssl3ext.c:1587:23: warning: comparison between signed and unsigned integer expressions [-Wsign-compare]
67:42.49 ssl3ext.c: In function 'ssl3_SendRenegotiationInfoXtn':
67:42.49 ssl3ext.c:1981:28: warning: comparison between signed and unsigned integer expressions [-Wsign-compare]
67:42.49 ssl3ext.c: In function 'ssl3_ClientSendSigAlgsXtn':
67:42.49 ssl3ext.c:2355:28: warning: comparison between signed and unsigned integer expressions [-Wsign-compare]
67:42.49 ssl3ext.c:2369:25: warning: comparison between signed and unsigned integer expressions [-Wsign-compare]
67:42.49 ssl3ext.c: In function 'ssl3_ClientSendDraftVersionXtn':
67:42.49 ssl3ext.c:2445:28: warning: comparison between signed and unsigned integer expressions [-Wsign-compare]
67:42.49 ssl3ext.c:2458:25: warning: comparison between signed and unsigned integer expressions [-Wsign-compare]
67:43.06 crmfcont.c: In function 'CRMF_CreateEncryptedKeyWithEncryptedValue':
67:43.06 crmfcont.c:860:25: warning: variable 'dummy' set but not used [-Wunused-but-set-variable]
67:43.35 secutil.c: In function 'SECU_ChangePW2':
67:43.35 secutil.c:333:15: warning: variable 'rv' set but not used [-Wunused-but-set-variable]
67:43.35 secutil.c: In function 'SECU_PrintDumpDerIssuerAndSerial':
67:43.36 secutil.c:1551:19: warning: comparison between signed and unsigned integer expressions [-Wsign-compare]
67:43.36 secutil.c: In function 'secu_PrintPKCS7Signed':
67:43.36 secutil.c:2703:11: warning: passing argument 5 of 'SECU_PrintSignedData' from incompatible pointer type [enabled by default]
67:43.36 In file included from secutil.c:19:0:
67:43.36 secutil.h:260:12: note: expected 'SECU_PPFunc' but argument is of type 'int (*)(struct FILE *, const struct SECItem *, const char *, int)'
67:43.36 secutil.c: In function 'secu_PrintPKCS7SignedAndEnveloped':
67:43.36 secutil.c:2822:11: warning: passing argument 5 of 'SECU_PrintSignedData' from incompatible pointer type [enabled by default]
67:43.36 In file included from secutil.c:19:0:
67:43.36 secutil.h:260:12: note: expected 'SECU_PPFunc' but argument is of type 'int (*)(struct FILE *, const struct SECItem *, const char *, int)'
67:43.36 secutil.c: In function 'SEC_PrintCertificateAndTrust':
67:43.36 secutil.c:3152:10: warning: passing argument 5 of 'SECU_PrintSignedData' from incompatible pointer type [enabled by default]
67:43.36 secutil.c:3125:5: note: expected 'SECU_PPFunc' but argument is of type 'int (*)(struct FILE *, const struct SECItem *, const char *, int)'
67:43.36 secutil.c: In function 'SECU_StoreCRL':
67:43.36 secutil.c:3324:62: warning: comparison between signed and unsigned integer expressions [-Wsign-compare]
67:44.46 derprint.c: In function 'prettyPrintLength':
67:44.46 derprint.c:454:20: warning: comparison between signed and unsigned integer expressions [-Wsign-compare]
67:44.54 sslsecur.c: In function 'SSL_ConfigSecureServerWithCertChain':
67:44.54 sslsecur.c:847:5: warning: comparison of unsigned expression < 0 is always false [-Wtype-limits]
67:44.54 sslsecur.c: In function 'ssl_SecureRecv':
67:44.54 sslsecur.c:1180:22: warning: variable 'sec' set but not used [-Wunused-but-set-variable]
67:46.81 smimeutil.c: In function 'NSSSMIME_VersionCheck':
67:46.81 smimeutil.c:770:19: warning: variable 'c' set but not used [-Wunused-but-set-variable]
67:46.81 smimeutil.c: In function 'NSS_SMIMEUtil_FindBulkAlgForRecipients':
67:46.81 smimeutil.c:446:9: warning: 'key_type' may be used uninitialized in this function [-Wmaybe-uninitialized]
67:46.81 smimeutil.c:425:14: note: 'key_type' was declared here
67:46.92 cmmfchal.c: In function 'cmmf_create_witness_and_challenge':
67:46.92 cmmfchal.c:33:22: warning: variable 'id' set but not used [-Wunused-but-set-variable]
67:47.31 sslsock.c: In function 'ssl_WriteV':
67:47.31 sslsock.c:2524:30: warning: comparison between signed and unsigned integer expressions [-Wsign-compare]
67:47.31 sslsock.c:2537:68: warning: comparison between signed and unsigned integer expressions [-Wsign-compare]
67:47.32 sslsock.c:2556:28: warning: comparison between signed and unsigned integer expressions [-Wsign-compare]
67:47.32 sslsock.c:2556:59: warning: signed and unsigned type in conditional expression [-Wsign-compare]
67:47.32 sslsock.c:2559:23: warning: comparison between signed and unsigned integer expressions [-Wsign-compare]
67:47.32 sslsock.c:2565:56: warning: comparison between signed and unsigned integer expressions [-Wsign-compare]
67:47.89 jarsign.c: In function 'jar_create_pk7':
67:47.89 jarsign.c:174:11: warning: variable 'errstring' set but not used [-Wunused-but-set-variable]
67:48.11 sslinfo.c: In function 'SSL_DisableDefaultExportCipherSuites':
67:48.11 sslinfo.c:247:15: warning: variable 'rv' set but not used [-Wunused-but-set-variable]
67:48.11 sslinfo.c: In function 'SSL_DisableExportCipherSuites':
67:48.11 sslinfo.c:268:15: warning: variable 'rv' set but not used [-Wunused-but-set-variable]
67:48.13 jar.c: In function 'JAR_find_next':
67:48.13 jar.c:423:30: warning: comparison between signed and unsigned integer expressions [-Wsign-compare]
67:48.13 jar.c: In function 'jar_find_first_cert':
67:48.13 jar.c:462:24: warning: comparison between signed and unsigned integer expressions [-Wsign-compare]
67:49.97 jarfile.c: In function 'jar_physical_inflate':
67:49.97 jarfile.c:341:32: warning: comparison between signed and unsigned integer expressions [-Wsign-compare]
67:49.97 jarfile.c:356:38: warning: comparison between signed and unsigned integer expressions [-Wsign-compare]
67:49.97 jarfile.c: In function 'jar_extract_mf':
67:49.97 jarfile.c:578:14: warning: comparison between signed and unsigned integer expressions [-Wsign-compare]
67:49.97 jarfile.c: In function 'jar_listzip':
67:49.97 jarfile.c:702:47: warning: comparison between signed and unsigned integer expressions [-Wsign-compare]
67:49.97 jarfile.c:768:43: warning: comparison between signed and unsigned integer expressions [-Wsign-compare]
67:49.97 jarfile.c: In function 'jar_listtar':
67:49.97 jarfile.c:830:45: warning: comparison between signed and unsigned integer expressions [-Wsign-compare]
67:49.97 jarfile.c:824:12: warning: variable 'when' set but not used [-Wunused-but-set-variable]
67:49.97 jarfile.c:823:14: warning: variable 'mode' set but not used [-Wunused-but-set-variable]
67:50.18 ssl3ecc.c: In function 'ssl3_DisableECCSuites':
67:50.18 ssl3ecc.c:969:19: warning: unused variable 'rv' [-Wunused-variable]
67:50.18 ssl3ecc.c: In function 'ssl3_SendSupportedCurvesXtn':
67:50.18 ssl3ecc.c:1130:28: warning: comparison between signed and unsigned integer expressions [-Wsign-compare]
67:50.18 ssl3ecc.c: In function 'ssl3_HandleSupportedCurvesXtn':
67:50.18 ssl3ecc.c:1238:35: warning: comparison between signed and unsigned integer expressions [-Wsign-compare]
67:52.42 libnss3.so
67:55.09 shlibsign.c: In function 'writeItem':
67:55.09 shlibsign.c:150:22: warning: comparison between signed and unsigned integer expressions [-Wsign-compare]
67:55.09 shlibsign.c: In function 'main':
67:55.09 shlibsign.c:908:40: warning: comparison between signed and unsigned integer expressions [-Wsign-compare]
67:55.11 cd mangle; /usr/bin/make libs
67:55.71 loader.c: In function 'freebl_LoadDSO':
67:55.71 loader.c:135:14: warning: variable 'status' set but not used [-Wunused-but-set-variable]
67:55.71 loader.c: In function 'BL_Unload':
67:55.71 loader.c:904:20: warning: unused variable 'status' [-Wunused-variable]
67:59.36 mkdir: kann Verzeichnis „/opt/FirefoxSource/mozilla-release/objdir-droid/security/nss/lib/freebl“ nicht anlegen: Die Datei existiert bereits
68:01.34 ldvector.c: In function 'FREEBL_GetVector':
68:01.34 ldvector.c:301:19: warning: variable 'c' set but not used [-Wunused-but-set-variable]
68:02.70 keystuff.c: In function 'UpdateRNG':
68:02.70 keystuff.c:96:18: warning: comparison between signed and unsigned integer expressions [-Wsign-compare]
68:02.70 keystuff.c: In function 'CERTUTIL_GeneratePrivateKey':
68:02.70 keystuff.c:497:15: warning: variable 'algtag' set but not used [-Wunused-but-set-variable]
68:03.29 pk12util.c: In function 'p12u_InitContext':
68:03.29 pk12util.c:104:12: warning: variable 'fileExist' set but not used [-Wunused-but-set-variable]
68:03.29 pk12util.c: In function 'P12U_ListPKCS12File':
68:03.29 pk12util.c:762:30: warning: passing argument 5 of 'SECU_PrintSignedData' from incompatible pointer type [enabled by default]
68:03.29 In file included from pk12util.c:11:0:
68:03.29 /opt/FirefoxSource/mozilla-release/objdir-droid/dist/private/nss/secutil.h:260:12: note: expected 'SECU_PPFunc' but argument is of type 'int (*)(struct FILE *, const struct SECItem *, const char *, int)'
68:04.05 pk11.c: In function 'ListModule':
68:04.05 pk11.c:612:16: warning: comparison between signed and unsigned integer expressions [-Wsign-compare]
68:04.34 ytab.c: In function 'Pk11Install_yyparse':
68:04.34 ytab.c:219:5: warning: suggest parentheses around assignment used as truth value [-Wparentheses]
68:04.42 token.c: In function 'nssCKFWToken_GetUTCTime':
68:04.42 token.c:1261:27: warning: variable 'z' set but not used [-Wunused-but-set-variable]
68:04.48 sha512.c: In function 'SHA512_Compress':
68:04.48 sha512.c:933:14: warning: unused variable 't1' [-Wunused-variable]
68:04.48 sha512.c:955:18: warning: unused variable 't2' [-Wunused-variable]
68:04.48 sha512.c:955:14: warning: unused variable 't1' [-Wunused-variable]
68:04.48 sha512.c: In function 'SHA512_End':
68:04.48 sha512.c:1229:14: warning: unused variable 't1' [-Wunused-variable]
68:04.48 sha512.c: In function 'SHA512_EndRaw':
68:04.48 sha512.c:1274:14: warning: unused variable 't1' [-Wunused-variable]
68:04.57 lex.Pk11Install_yy.cpp:1060:13: warning: 'Pkcs11Install_yyunput' defined but not used [-Wunused-function]
68:04.57 lex.Pk11Install_yy.cpp:1106:12: warning: 'input' defined but not used [-Wunused-function]
68:04.89 rawhash.c: In function 'HASH_GetRawHashObject':
68:04.89 rawhash.c:156:5: warning: comparison of unsigned expression < 0 is always false [-Wtype-limits]
68:05.26 cd builtins; /usr/bin/make libs
68:05.35 cts.c: In function 'CTS_DecryptUpdate':
68:05.35 cts.c:226:23: warning: comparison between signed and unsigned integer expressions [-Wsign-compare]
68:05.57 gcm.c: In function 'gcm_getX':
68:05.57 gcm.c:223:13: warning: comparison between signed and unsigned integer expressions [-Wsign-compare]
68:05.80 bfind.c: In function 'builtins_attrmatch':
68:05.80 bfind.c:122:11: warning: comparison between signed and unsigned integer expressions [-Wsign-compare]
68:05.86 dh.c: In function 'DH_Derive':
68:05.86 dh.c:271:13: warning: comparison between signed and unsigned integer expressions [-Wsign-compare]
68:05.89 binst.c: In function 'builtins_mdInstance_GetLibraryVersion':
68:05.89 binst.c:70:17: warning: variable 'c' set but not used [-Wunused-but-set-variable]
68:06.01 ecdecode.c: In function 'gf_populate_params':
68:06.01 ecdecode.c:120:5: warning: comparison of unsigned expression < 0 is always false [-Wtype-limits]
68:06.13 ec.c: In function 'ec_points_mul':
68:06.13 ec.c:89:17: warning: comparison between signed and unsigned integer expressions [-Wsign-compare]
68:06.13 ec.c: In function 'EC_ValidatePublicKey':
68:06.13 ec.c:450:33: warning: comparison between signed and unsigned integer expressions [-Wsign-compare]
68:06.38 dsa.c: In function 'DSA_VerifyDigest':
68:06.38 dsa.c:518:25: warning: comparison between signed and unsigned integer expressions [-Wsign-compare]
68:06.38 dsa.c:530:27: warning: comparison between signed and unsigned integer expressions [-Wsign-compare]
68:06.59 pqg.c: In function 'makePrimefromPrimesShaweTaylor':
68:06.59 pqg.c:617:34: warning: comparison between signed and unsigned integer expressions [-Wsign-compare]
68:06.59 pqg.c:687:28: warning: comparison between signed and unsigned integer expressions [-Wsign-compare]
68:06.59 pqg.c: In function 'makePrimefromSeedShaweTaylor':
68:06.59 pqg.c:849:28: warning: comparison between signed and unsigned integer expressions [-Wsign-compare]
68:06.59 pqg.c: In function 'pqg_ParamGen':
68:06.59 pqg.c:1232:18: warning: variable 'b' set but not used [-Wunused-but-set-variable]
68:06.59 pqg.c: In function 'PQG_VerifyParams':
68:06.59 pqg.c:1614:50: warning: comparison between signed and unsigned integer expressions [-Wsign-compare]
68:06.59 pqg.c:1672:25: warning: comparison between signed and unsigned integer expressions [-Wsign-compare]
68:06.59 pqg.c:1708:18: warning: comparison between signed and unsigned integer expressions [-Wsign-compare]
68:06.59 pqg.c:1709:25: warning: comparison between signed and unsigned integer expressions [-Wsign-compare]
68:06.59 pqg.c:1710:33: warning: comparison between signed and unsigned integer expressions [-Wsign-compare]
68:06.59 pqg.c:1733:29: warning: comparison between signed and unsigned integer expressions [-Wsign-compare]
68:06.59 pqg.c:1775:27: warning: 'type' may be used uninitialized in this function [-Wmaybe-uninitialized]
68:06.59 pqg.c:1595:16: note: 'type' was declared here
68:06.59 pqg.c:1777:5: warning: 'hashtype' may be used uninitialized in this function [-Wmaybe-uninitialized]
68:06.59 pqg.c:1594:19: note: 'hashtype' was declared here
68:06.73 shvfy.c: In function 'readItem':
68:06.73 shvfy.c:267:19: warning: comparison between signed and unsigned integer expressions [-Wsign-compare]
68:06.91 rsa.c: In function 'RSA_NewKey':
68:06.91 rsa.c:251:29: warning: comparison between signed and unsigned integer expressions [-Wsign-compare]
68:06.91 rsa.c: In function 'rsa_get_primes_from_exponents':
68:06.91 rsa.c:482:52: warning: comparison between signed and unsigned integer expressions [-Wsign-compare]
68:07.12 mpi/mpprime.c: In function 'mpp_make_prime':
68:07.12 mpi/mpprime.c:445:47: warning: comparison between signed and unsigned integer expressions [-Wsign-compare]
68:07.26 mpi/mplogic.c: In function 'mpl_num_set':
68:07.26 mpi/mplogic.c:230:20: warning: comparison between signed and unsigned integer expressions [-Wsign-compare]
68:07.26 mpi/mplogic.c: In function 'mpl_num_clear':
68:07.26 mpi/mplogic.c:260:20: warning: comparison between signed and unsigned integer expressions [-Wsign-compare]
68:07.99 ecl/ecp_521.c: In function 'ec_GFp_nistp521_mod':
68:07.99 ecl/ecp_521.c:42:73: warning: comparison between signed and unsigned integer expressions [-Wsign-compare]
68:07.99 ecl/ecp_521.c:50:18: warning: comparison between signed and unsigned integer expressions [-Wsign-compare]
68:08.14 mpi/mpi.c: In function 'mp_expt':
68:08.14 mpi/mpi.c:1114:20: warning: comparison between signed and unsigned integer expressions [-Wsign-compare]
68:08.14 mpi/mpi.c:1118:22: warning: comparison between signed and unsigned integer expressions [-Wsign-compare]
68:08.14 mpi/mpi.c: In function 's_mp_exptmod':
68:08.14 mpi/mpi.c:1497:20: warning: comparison between signed and unsigned integer expressions [-Wsign-compare]
68:08.14 mpi/mpi.c:1501:22: warning: comparison between signed and unsigned integer expressions [-Wsign-compare]
68:08.14 mpi/mpi.c: In function 'mp_trailing_zeros':
68:08.14 mpi/mpi.c:2012:45: warning: comparison between signed and unsigned integer expressions [-Wsign-compare]
68:08.14 mpi/mpi.c: In function 's_mp_fixup_reciprocal':
68:08.14 mpi/mpi.c:2164:19: warning: comparison between signed and unsigned integer expressions [-Wsign-compare]
68:08.14 mpi/mpi.c:2164:51: warning: signed and unsigned type in conditional expression [-Wsign-compare]
68:08.14 mpi/mpi.c:2166:11: warning: comparison between signed and unsigned integer expressions [-Wsign-compare]
68:08.15 mpi/mpi.c: In function 's_mp_lshd':
68:08.15 mpi/mpi.c:2938:18: warning: comparison between signed and unsigned integer expressions [-Wsign-compare]
68:08.15 mpi/mpi.c: In function 's_mp_mul_2':
68:08.15 mpi/mpi.c:3063:12: warning: comparison between signed and unsigned integer expressions [-Wsign-compare]
68:08.15 mpi/mpi.c: In function 's_mp_todigit':
68:08.15 mpi/mpi.c:4600:10: warning: comparison between signed and unsigned integer expressions [-Wsign-compare]
68:08.15 mpi/mpi.c: In function 'mp_to_unsigned_octets':
68:08.15 mpi/mpi.c:4720:29: warning: comparison between signed and unsigned integer expressions [-Wsign-compare]
68:08.15 mpi/mpi.c: In function 'mp_to_signed_octets':
68:08.15 mpi/mpi.c:4752:29: warning: comparison between signed and unsigned integer expressions [-Wsign-compare]
68:08.15 mpi/mpi.c:4766:20: warning: comparison between signed and unsigned integer expressions [-Wsign-compare]
68:08.15 mpi/mpi.c:4767:18: warning: comparison between signed and unsigned integer expressions [-Wsign-compare]
68:08.15 mpi/mpi.c: In function 'mp_to_fixlen_octets':
68:08.15 mpi/mpi.c:4792:29: warning: comparison between signed and unsigned integer expressions [-Wsign-compare]
68:08.15 mpi/mpi.c:4795:16: warning: comparison between signed and unsigned integer expressions [-Wsign-compare]
68:10.11 lgglue.c: In function 'sftkdb_resolvePath':
68:10.11 lgglue.c:44:24: warning: comparison between signed and unsigned integer expressions [-Wsign-compare]
68:10.39 lowpbe.c: In function 'nsspkcs5_PKCS12PBE':
68:10.39 lowpbe.c:519:22: warning: comparison between signed and unsigned integer expressions [-Wsign-compare]
68:11.27 pkcs11.c: In function 'sftk_GetPubKey':
68:11.27 pkcs11.c:1756:35: warning: comparison between signed and unsigned integer expressions [-Wsign-compare]
68:11.27 pkcs11.c:1764:35: warning: comparison between signed and unsigned integer expressions [-Wsign-compare]
68:11.27 pkcs11.c:1774:27: warning: comparison between signed and unsigned integer expressions [-Wsign-compare]
68:11.27 pkcs11.c: In function 'NSC_GetInfo':
68:11.27 pkcs11.c:3144:19: warning: variable 'c' set but not used [-Wunused-but-set-variable]
68:11.27 pkcs11.c: In function 'NSC_GetAttributeValue':
68:11.27 pkcs11.c:4314:58: warning: comparison between signed and unsigned integer expressions [-Wsign-compare]
68:11.27 pkcs11.c: In function 'sftk_emailhack':
68:11.27 pkcs11.c:4527:17: warning: comparison between signed and unsigned integer expressions [-Wsign-compare]
68:11.27 pkcs11.c: In function 'NSC_FindObjects':
68:11.27 pkcs11.c:4743:54: warning: signed and unsigned type in conditional expression [-Wsign-compare]
68:11.27 pkcs11.c: In function 'NSC_CreateObject':
68:11.27 pkcs11.c:4085:21: warning: 'moduleIndex' may be used uninitialized in this function [-Wmaybe-uninitialized]
68:11.27 pkcs11.c:4005:19: note: 'moduleIndex' was declared here
68:11.87 sdb.c: In function 'sdb_FindObjectsInit':
68:11.87 sdb.c:702:28: warning: comparison between signed and unsigned integer expressions [-Wsign-compare]
68:11.87 sdb.c:727:32: warning: comparison between signed and unsigned integer expressions [-Wsign-compare]
68:11.87 sdb.c: In function 'sdb_GetAttributeValueNoLock':
68:11.87 sdb.c:848:17: warning: comparison between signed and unsigned integer expressions [-Wsign-compare]
68:11.87 sdb.c:900:34: warning: comparison between signed and unsigned integer expressions [-Wsign-compare]
68:11.87 sdb.c: In function 'sdb_SetAttributeValue':
68:11.87 sdb.c:978:27: warning: comparison between signed and unsigned integer expressions [-Wsign-compare]
68:11.87 sdb.c:1007:17: warning: comparison between signed and unsigned integer expressions [-Wsign-compare]
68:11.87 sdb.c: In function 'sdb_CreateObject':
68:11.87 sdb.c:1138:42: warning: comparison between signed and unsigned integer expressions [-Wsign-compare]
68:11.87 sdb.c:1168:17: warning: comparison between signed and unsigned integer expressions [-Wsign-compare]
68:11.90 pkcs11u.c: In function 'sftk_DeleteObject':
68:11.90 pkcs11u.c:1177:22: warning: unused variable 'to' [-Wunused-variable]
68:11.90 pkcs11u.c: In function 'sftk_NewTokenObject':
68:11.90 pkcs11u.c:1902:22: warning: variable 'tokObject' set but not used [-Wunused-but-set-variable]
68:12.02 sftkhmac.c: In function 'sftk_HMACConstantTime_Update':
68:12.02 sftkhmac.c:149:15: warning: unused variable 'rv' [-Wunused-variable]
68:12.02 sftkhmac.c: In function 'sftk_SSLv3MACConstantTime_Update':
68:12.02 sftkhmac.c:163:15: warning: unused variable 'rv' [-Wunused-variable]
68:12.02 sftkdb.c: In function 'sftkdb_fixupTemplateOut':
68:12.02 sftkdb.c:328:22: warning: variable 'data' set but not used [-Wunused-but-set-variable]
68:12.02 sftkdb.c:345:69: warning: comparison between signed and unsigned integer expressions [-Wsign-compare]
68:12.02 sftkdb.c: In function 'sftk_signTemplate':
68:12.02 sftkdb.c:520:17: warning: comparison between signed and unsigned integer expressions [-Wsign-compare]
68:12.02 sftkdb.c: In function 'sftkdb_CreateObject':
68:12.02 sftkdb.c:576:12: warning: variable 'inTransaction' set but not used [-Wunused-but-set-variable]
68:12.02 sftkdb.c: In function 'sftk_ExtractTemplate':
68:12.02 sftkdb.c:619:17: warning: comparison between signed and unsigned integer expressions [-Wsign-compare]
68:12.02 sftkdb.c:632:17: warning: comparison between signed and unsigned integer expressions [-Wsign-compare]
68:12.02 sftkdb.c: In function 'sftkdb_resolveConflicts':
68:12.02 sftkdb.c:1045:13: warning: comparison between signed and unsigned integer expressions [-Wsign-compare]
68:12.02 sftkdb.c: In function 'sftkdb_FindObjects':
68:12.02 sftkdb.c:1261:14: warning: comparison between signed and unsigned integer expressions [-Wsign-compare]
68:12.02 sftkdb.c: In function 'sftkdb_GetObjectTemplate':
68:12.02 sftkdb.c:1613:14: warning: comparison between signed and unsigned integer expressions [-Wsign-compare]
68:12.02 sftkdb.c:1631:63: warning: comparison between signed and unsigned integer expressions [-Wsign-compare]
68:12.02 sftkdb.c: In function 'sftkdb_handleIDAndName':
68:12.02 sftkdb.c:2014:11: warning: variable 'crv' set but not used [-Wunused-but-set-variable]
68:12.02 sftkdb.c: In function 'sftkdb_mergeObject':
68:12.02 sftkdb.c:2196:17: warning: comparison between signed and unsigned integer expressions [-Wsign-compare]
68:12.02 sftkdb.c: In function 'sftkdb_Update':
68:12.02 sftkdb.c:2301:38: warning: comparison between signed and unsigned integer expressions [-Wsign-compare]
68:12.33 sftkpwd.c: In function 'sftk_updateMacs':
68:12.33 sftkpwd.c:908:17: warning: comparison between signed and unsigned integer expressions [-Wsign-compare]
68:12.33 sftkpwd.c:909:31: warning: comparison between signed and unsigned integer expressions [-Wsign-compare]
68:12.33 sftkpwd.c:930:17: warning: comparison between signed and unsigned integer expressions [-Wsign-compare]
68:12.33 sftkpwd.c:935:31: warning: comparison between signed and unsigned integer expressions [-Wsign-compare]
68:12.33 sftkpwd.c:868:11: warning: variable 'crv2' set but not used [-Wunused-but-set-variable]
68:12.33 sftkpwd.c:867:11: warning: variable 'crv' set but not used [-Wunused-but-set-variable]
68:12.33 sftkpwd.c: In function 'sftk_updateEncrypted':
68:12.33 sftkpwd.c:986:17: warning: comparison between signed and unsigned integer expressions [-Wsign-compare]
68:12.33 sftkpwd.c:993:31: warning: comparison between signed and unsigned integer expressions [-Wsign-compare]
68:12.33 sftkpwd.c: In function 'sftkdb_convertObjects':
68:12.33 sftkpwd.c:1125:38: warning: comparison between signed and unsigned integer expressions [-Wsign-compare]
68:13.59 pkcs11c.c: In function 'NSC_GenerateKeyPair':
68:13.59 pkcs11c.c:4340:9: warning: variable 'private_value_bits' set but not used [-Wunused-but-set-variable]
68:13.59 pkcs11c.c: In function 'sftk_PackagePrivateKey':
68:13.59 pkcs11c.c:4862:14: warning: variable 'fordebug' set but not used [-Wunused-but-set-variable]
68:13.59 pkcs11c.c: In function 'NSC_DeriveKey':
68:13.59 pkcs11c.c:6764:18: warning: comparison between signed and unsigned integer expressions [-Wsign-compare]
68:13.59 pkcs11c.c:6769:18: warning: comparison between signed and unsigned integer expressions [-Wsign-compare]
68:13.59 pkcs11c.c:6850:20: warning: comparison between signed and unsigned integer expressions [-Wsign-compare]
68:13.59 pkcs11c.c: In function 'NSC_GenerateKeyPair':
68:13.59 pkcs11c.c:4260:6: warning: 'subPrimeLen' may be used uninitialized in this function [-Wmaybe-uninitialized]
68:13.59 pkcs11c.c:4042:14: note: 'subPrimeLen' was declared here
68:13.59 pkcs11c.c:4212:23: warning: 'modulusLen' may be used uninitialized in this function [-Wmaybe-uninitialized]
68:13.59 pkcs11c.c:4041:14: note: 'modulusLen' was declared here
68:13.59 pkcs11c.c: In function 'NSC_GenerateKey':
68:13.59 pkcs11c.c:3968:13: warning: 'hashType' may be used uninitialized in this function [-Wmaybe-uninitialized]
68:14.89 libjs_static.a
68:30.15 libjs_static.a.desc
68:30.71 libeditline.a.desc
68:30.78 js
68:36.71 jsapi-tests
68:47.09 gdb-tests
68:58.72 libcertverifier.a.desc
68:58.87 libmozillapkix.a.desc
68:58.98 libmozillapkix_gtest.a.desc
68:59.10 libpkixtestutil.a.desc
68:59.17 libsecurity_apps.a.desc
68:59.34 libxpt.a
68:59.47 libxpt.a.desc
68:59.59 libxpcom_string.a.desc
68:59.70 libxpcomglue_s.a
69:00.19 libxpcomglue_s.a.desc
69:00.33 libxpcomglue.a
69:00.39 libxpcomglue.a.desc
69:00.53 libxpcomglue_s_nomozalloc.a
69:00.58 libxpcomglue_s_nomozalloc.a.desc
69:00.71 libxpcom_glue_gtest.a.desc
69:00.83 libxpcom_base.a.desc
69:01.04 libxpcom_ds.a.desc
69:01.26 libxpcom_io.a.desc
69:01.44 libxpcom_components.a.desc
69:01.59 libxpcom_threads.a.desc
69:01.75 libxpcom_reflect_xptinfo.a.desc
69:01.90 libxpcom_reflect_xptcall.a.desc
69:01.98 libxpcom_reflect_xptcall_md_unix.a.desc
69:02.27 libchrome_src.a.desc
69:02.42 libxpcom_core.a.desc
69:02.73 libmodules_libpref_src.a.desc
69:02.78 /opt/FirefoxSource/mozilla-release/netwerk/base/public/security-prefs.js: WARNING: no preprocessor directives found
69:03.09 libintl_hyphenation_src.a.desc
69:03.32 libintl_locale_src.a.desc
69:03.42 libintl_locale_src_unix.a.desc
69:03.83 libintl_lwbrk_src.a.desc
69:04.01 libintl_strres_src.a.desc
69:04.21 libunicharutil_external_s.a
69:04.40 libunicharutil_external_s.a.desc
69:04.48 libintl_unicharutil_util_internal.a
69:04.53 libintl_unicharutil_util_internal.a.desc
69:04.61 libintl_unicharutil_src.a.desc
69:04.97 libintl_uconv_src.a.desc
69:05.25 libi18n.a.desc
69:05.60 libnetwerk_base_src.a.desc
69:05.84 libnetwerk_cookie.a.desc
69:06.00 libnetwerk_dns.a.desc
69:06.16 libnetwerk_socket.a.desc
69:06.29 libnetwerk_mime.a.desc
69:06.52 libnetwerk_streamconv_src.a.desc
69:06.61 libnetwerk_streamconv_converters.a.desc
69:06.74 libnetwerk_cache.a.desc
69:06.95 libnetwerk_cache2.a.desc
69:07.13 libnetwerk_protocol_about.a.desc
69:07.27 libnetwerk_protocol_app.a.desc
69:07.34 libnetwerk_protocol_data.a.desc
69:07.43 libnetwerk_protocol_device.a.desc
69:07.52 libnetwerk_protocol_file.a.desc
69:07.68 libnetwerk_protocol_ftp.a.desc
69:07.97 libnetwerk_protocol_http.a.desc
69:08.28 libnetwerk_protocol_res.a.desc
69:08.41 libnetwerk_protocol_viewsource.a.desc
69:08.55 libnetwerk_protocol_websocket.a.desc
69:08.71 libnetwerk_protocol_wyciwyg.a.desc
69:08.86 libnetwerk_system_android.a.desc
69:08.95 libnetwerk_ipc.a.desc
69:11.12 libnecko.a.desc
69:11.22 libextensions_auth.a.desc
69:11.55 libipc_chromium.a.desc
69:11.84 libipc_glue.a.desc
69:12.06 libipc_ipdl.a.desc
69:12.23 libipc_testshell.a.desc
69:12.35 libjs_ipc.a.desc
69:12.52 libhal.a.desc
69:13.64 libjs_xpconnect_wrappers.a.desc
69:13.75 libjs_xpconnect_loader.a.desc
69:13.92 libxpconnect_s.a.desc
69:14.15 libintl_chardet_src.a.desc
69:14.23 libyuv_neon.a.desc
69:14.31 libyuv.a.desc
69:14.42 libjar.a.desc
69:14.69 libmodules_libjar_zipwriter_src.a.desc
69:14.93 libstorage_src.a.desc
69:15.06 libstoragecomps.a.desc
69:15.16 libextensions_cookie.a.desc
69:15.31 libextensions_permissions.a.desc
69:15.52 librdf_base_src.a.desc
69:15.61 librdfutil_external_s.a
69:15.75 librdfutil_external_s.a.desc
69:15.82 librdf_util_src_internal.a.desc
69:15.89 librdf_datasource_src.a.desc
69:15.98 librdf.a.desc
69:16.05 libutils.so
69:16.19 libstagefright.so
69:16.31 libvideoeditorplayer.so
69:16.46 libutils.so
69:16.59 libstagefright.so
69:16.70 libstagefright_color_conversion.so
69:16.83 libstagefright.so
69:16.95 libstagefright.so
69:17.07 libomxplugin.so
69:17.20 libomxplugingb.so
69:17.34 libomxplugingb235.so
69:17.47 libomxpluginfroyo.so
69:18.57 libstagefright.so
69:18.71 libomxpluginhc.so
69:19.11 libomxpluginkk.so
69:19.64 libgtest.a.desc
69:19.73 liburiloader_base.a.desc
69:19.91 liburiloader_exthandler.a.desc
69:20.10 WriteArgument
69:20.24 liburiloader_prefetch.a.desc
69:20.42 libcaps.a.desc
69:20.56 libparser_expat_lib.a.desc
69:20.75 libparser_xml_src.a.desc
69:20.94 libhtmlpars.a.desc
69:21.12 libparser_html.a.desc
69:21.43 libgfx_cairo_cairo_src.a.desc
69:21.61 libgfx_cairo_libpixman_src.a.desc
69:21.74 libgfx_2d.a.desc
69:21.88 libgfx_ycbcr.a.desc
69:22.08 libgfx_angle.a.desc
69:22.29 libgfx_src.a.desc
69:22.45 libgfx_qcms.a.desc
69:22.57 libgfx_gl.a.desc
69:22.96 libgfx_layers.a.desc
69:23.49 libgfx_graphite2_src.a.desc
69:23.61 libgfx_harfbuzz_src.a.desc
69:23.74 libgfx_ots_src.a.desc
69:23.94 libthebes.a.desc
69:24.14 libgfx_ipc.a.desc
69:24.66 libgfx_skia.a.desc
69:25.34 libgfxtest.a.desc
69:25.64 libimage_src.a.desc
69:25.81 libimage_decoders.a.desc
69:25.92 libimage_decoders_icon_android.a.desc
69:26.00 libimgicon.a.desc
69:26.13 libimage_encoders_ico.a.desc
69:26.20 libimage_encoders_png.a.desc
69:26.28 libimage_encoders_jpeg.a.desc
69:26.35 libimage_encoders_bmp.a.desc
69:26.44 libimglib2.a.desc
69:29.22 libdom_animation.a.desc
69:29.42 libdom_apps_src.a.desc
69:29.79 libdom_base.a.desc
69:30.25 libdom_activities_src.a.desc
69:30.36 libdom_archivereader.a.desc
69:30.76 libdom_bindings.a.desc
69:31.17 libdombindings_test_s.a.desc
69:31.29 libdom_battery.a.desc
69:31.38 libdom_browser-element.a.desc
69:31.64 libdom_crypto.a.desc
69:31.87 libdom_alarm.a.desc
69:32.03 libdom_datastore.a.desc
69:32.22 libdom_devicestorage.a.desc
69:32.32 libdom_encoding.a.desc
69:32.52 libdom_events.a.desc
69:32.86 libdom_filehandle.a.desc
69:32.99 libdom_filesystem.a.desc
69:33.11 libdom_asmjscache.a.desc
69:33.19 libdom_media.a.desc
69:33.71 libdom_power.a.desc
69:34.01 libdom_quota.a.desc
69:34.43 libdom_mobilemessage_src.a.desc
69:34.75 libdom_src_jsurl.a.desc
69:34.84 libdom_src_storage.a.desc
69:34.93 libdom_src_offline.a.desc
69:35.01 libdom_src_json.a.desc
69:35.09 libdom_src_geolocation.a.desc
69:35.18 libdom_src_notification.a.desc
69:35.32 libdom_time.a.desc
69:35.79 libdom_network_src.a.desc
69:36.09 libdom_plugins_base.a.desc
69:36.31 libdom_plugins_base_android.a.desc
69:36.47 libdom_plugins_ipc.a.desc
69:36.71 libdom_indexedDB.a.desc
69:36.91 libdom_indexedDB_ipc.a.desc
69:37.06 /opt/FirefoxSource/mozilla-release/dom/indexedDB/test/extensions/bootstrap.js: WARNING: no preprocessor directives found
69:37.12 libdom_system.a.desc
69:37.29 libdom_system_android.a.desc
69:37.46 libdom_ipc.a.desc
69:37.97 libdom_workers.a.desc
69:38.21 /opt/FirefoxSource/mozilla-release/dom/workers/test/extensions/bootstrap/worker.js: WARNING: no preprocessor directives found
69:38.21 /opt/FirefoxSource/mozilla-release/dom/workers/test/extensions/bootstrap/bootstrap.js: WARNING: no preprocessor directives found
69:38.32 /opt/FirefoxSource/mozilla-release/dom/workers/test/extensions/traditional/worker.js: WARNING: no preprocessor directives found
69:38.47 libdom_camera.a.desc
69:38.89 libdom_audiochannel.a.desc
69:39.04 libdom_promise.a.desc
69:39.17 libdom_smil.a.desc
69:39.33 libdom_telephony.a.desc
69:39.73 libdom_xbl.a.desc
69:40.15 libdom_xslt_base.a.desc
69:40.26 libdom_xslt_xml.a.desc
69:40.41 libdom_xslt_xpath.a.desc
69:40.65 libdom_xslt_xslt.a.desc
69:40.98 libdom_resourcestats.a.desc
69:41.30 libdom_gamepad.a.desc
69:41.55 libnptest.so
69:41.67 libnpsecondtest.so
69:41.79 libnptestjava.so
69:42.05   adding: install.rdf (deflated 52%)
69:42.09   adding: plugins/libnptest.so (deflated 60%)
69:42.12   adding: plugins/libnpsecondtest.so (deflated 60%)
69:42.19 libview_src.a.desc
69:42.39 libwidget_shared.a.desc
69:42.59 libxpwidgets_s.a.desc
69:42.83 libwidget_android.a.desc
69:43.76 libcontent_base_src.a.desc
69:44.65 libcontent_canvas_src.a.desc
69:45.41 libcontent_html_content_src.a.desc
69:46.01 libcontent_html_document_src.a.desc
69:46.14 libcontent_mathml_content_src.a.desc
69:46.34 libcontent_media.a.desc
69:46.60 libcontent_media_encoder.a.desc
69:46.72 libmozgmp.a.desc
69:46.91 libcontent_media_mediasource.a.desc
69:47.01 libcontent_media_ogg.a.desc
69:47.18 libcontent_media_webaudio.a.desc
69:47.42 libcontent_media_webaudio_blink.a.desc
69:47.73 libcontent_media_raw.a.desc
69:47.81 libcontent_media_wave.a.desc
69:47.90 libcontent_media_webm.a.desc
69:48.00 libcontent_media_android.a.desc
69:48.09 libcontent_media_webrtc.a.desc
69:48.41 libcontent_media_webspeech_synth.a.desc
69:48.60 libcontent_media_webspeech_recognition.a.desc
69:48.78 libcontent_media_eme.a.desc
69:48.88 libmedia_gtest.a.desc
69:48.97 libcontent_svg_document_src.a.desc
69:49.46 libcontent_svg_content_src.a.desc
69:50.16 libcontent_xml_content_src.a.desc
69:50.37 libcontent_xml_document_src.a.desc
69:50.58 libcontent_xul_document_src.a.desc
69:50.82 libcontent_xul_content_src.a.desc
69:51.13 libcontent_xul_templates_src.a.desc
69:51.43 libeditor_txtsvc.a.desc
69:51.61 libeditor_libeditor_base.a.desc
69:51.81 libeditor_libeditor_text.a.desc
69:51.95 libeditor_libeditor_html.a.desc
69:52.09 libeditor_txmgr.a.desc
69:52.24 libeditor_composer.a.desc
69:52.51 liblayout_style.a.desc
69:53.18 liblayout_base.a.desc
69:53.65 liblayout_generic.a.desc
69:54.12 liblayout_forms.a.desc
69:54.33 liblayout_tables.a.desc
69:54.56 liblayout_svg.a.desc
69:54.90 liblayout_xul.a.desc
69:55.25 liblayout_xul_tree.a.desc
69:55.45 liblayout_xul_grid.a.desc
69:55.56 liblayout_ipc.a.desc
69:55.78 liblayout_mathml.a.desc
69:56.07 liblayout_inspector.a.desc
69:56.41 liblayout_printing.a.desc
69:56.58 libgklayout.a.desc
69:56.81 libgkmedias.a.desc
69:57.00 libdocshell_base.a.desc
69:57.29 libdocshell_shistory_src.a.desc
69:57.38 libdocshell_build.a.desc
69:57.83 libembedding_components_windowwatcher_src.a.desc
69:57.91 libembedding_components_appstartup_src.a.desc
69:58.10 libembedding_components_find_src.a.desc
69:58.51 libembedding_components_webbrowserpersist_src.a.desc
69:59.08 libembedding_components_commandhandler_src.a.desc
69:59.17 libembedding_components_printingui_src_unixshared.a.desc
69:59.25 libembedcomponents.a.desc
69:59.35 libembedding_browser_webBrowser.a.desc
69:59.50 libwebbrwsr.a.desc
69:59.78 libxpfe_appshell_src.a.desc
69:59.89 libother-licenses_skia-npapi.a.desc
69:59.98 libextensions_universalchardet_src_base.a.desc
70:00.08 libuniversalchardet.a.desc
70:00.15 libaccessible_other.a.desc
70:00.36 libaccessible_base.a.desc
70:00.58 libaccessible_generic.a.desc
70:00.74 libaccessible_html.a.desc
70:01.15 libaccessible_xpcom.a.desc
70:01.28 libaccessible_xul.a.desc
70:01.51 libprofdirserviceprovidersa_s.a.desc
70:01.63 libtools_profiler.a.desc
70:01.82 libsps_test.a.desc
70:01.89 libxpfe_components_windowds.a.desc
70:02.02 libxpfe_components_directory.a.desc
70:02.17 libappcomps.a.desc
70:02.48 libextensions_spellcheck_hunspell_src.a.desc
70:02.61 libspellchecker.a.desc
70:02.83 libsecurity_manager_boot_src.a.desc
70:03.02 libsecurity_manager_ssl_src.a.desc
70:03.34 libtlsserver.a.desc
70:03.42 BadCertServer
70:03.42 GenerateOCSPResponse
70:03.42 OCSPStaplingServer
70:03.55 libssltest.a.desc
70:04.45 libsecurity_manager_pki_src.a.desc
70:04.97 libtoolkit_components_alerts.a.desc
70:05.37 libtoolkit_components_commandlines.a.desc
70:06.06 libtoolkit_components_diskspacewatcher.a.desc
70:06.21 libtoolkit_components_downloads.a.desc
70:06.62 libtoolkit_components_finalizationwitness.a.desc
70:06.94 libtoolkit_components_find.a.desc
70:07.16 libtoolkit_components_jsdownloads_src.a.desc
70:07.36 libtoolkit_components_mediasniffer.a.desc
70:07.49 libtoolkit_components_osfile.a.desc
70:07.67 libtoolkit_components_parentalcontrols.a.desc
70:08.12 libtoolkit_components_perf.a.desc
70:09.46 libtoolkit_components_protobuf.a.desc
70:09.54 libtoolkit_components_reflect.a.desc
70:09.75 libtoolkit_components_startup.a.desc
70:09.96 libtoolkit_components_statusfilter.a.desc
70:10.03 libtoolkit_components_telemetry.a.desc
70:10.77 libtoolkit_components_typeaheadfind.a.desc
70:11.89 libtoolkit_components_workerlz4.a.desc
70:11.96 libtoolkit_components_ctypes.a.desc
70:12.04 libjsctypes-test.so
70:12.63 libtoolkit_components_autocomplete.a.desc
70:12.76 libtoolkit_components_satchel.a.desc
70:13.61 libtoolkit_components_url-classifier.a.desc
70:14.17 libtoolkitcomps.a.desc
70:16.02 libtoolkit_devtools_server.a.desc
70:17.19 libtoolkit_identity.a.desc
70:18.19 libtoolkit_mozapps_extensions.a.desc
70:20.83 BadPlugin
70:20.83 GoodPlugin
70:21.07 libtoolkit_profile.a.desc
70:22.53 TestWebappRT
70:22.63 libtoolkit_system_androidproxy.a.desc
70:22.73 libbreakpad_common_s.a.desc
70:22.90 libtoolkit_crashreporter_google-breakpad_src_processor.a.desc
70:22.99 libbreakpad_linux_common_s.a.desc
70:23.74 libxulapp_s.a.desc
70:24.03 libextensions_pref_autoconfig_src.a.desc
70:24.35 libservices_crypto_component.a.desc
70:24.75 libstartupcache.a.desc
70:24.90 libjs_ductwork_debugger.a.desc
70:25.02 libother-licenses_snappy.a.desc
70:25.11 libbrowsercomps.a.desc
70:25.25 libxul.a.desc
70:26.54 libStaticXULComponentsEnd.a.desc
70:26.61 libxul.so
75:35.23 /opt/FirefoxSource/mozilla-release/tools/quitter/chrome.manifest: WARNING: no preprocessor directives found
75:37.73 ssltunnel
75:40.73 /opt/FirefoxSource/mozilla-release/mobile/android/thirdparty/jap/branding/locales/en-US/brand.properties: WARNING: no useful preprocessor directives found
75:42.10 /opt/FirefoxSource/mozilla-release/mobile/locales/en-US/overrides/netError.dtd: WARNING: no preprocessor directives found
75:42.10 /opt/FirefoxSource/mozilla-release/mobile/locales/en-US/overrides/appstrings.properties: WARNING: no useful preprocessor directives found
75:42.10 /opt/FirefoxSource/mozilla-release/mobile/locales/en-US/overrides/passwordmgr.properties: WARNING: no useful preprocessor directives found
75:43.98 /opt/FirefoxSource/mozilla-release/mobile/android/base/WebappManifestFragment.xml.frag.in: WARNING: no preprocessor directives found
75:47.48 gecko-mozglue.jar
75:47.50 squareup-picasso.jar
75:47.81 sync-thirdparty.jar
75:47.82 websockets.jar
75:48.18 Reading 0 suggested sites: []
75:48.18 /opt/FirefoxSource/mozilla-release/objdir-droid/mobile/android/base/res/raw/suggestedsites.json updated
75:48.28 make[5]: *** Keine Regel vorhanden, um das Target »/opt/FirefoxSource/mozilla-release/mobile/android/thirdparty/jap/jar_dependencies/ANONDroidLib-0.1.1-SNAPSHOT.jar«,
75:48.28   benötigt von »gecko-browser.jar«, zu erstellen.  Schluss.
75:48.28 make[5]: *** Warte auf noch nicht beendete Prozesse...
75:51.55 generated/org/mozilla/gecko/mozglue/GeckoLoader.java:284: warning: [deprecation] CPU_ABI in Build has been deprecated
75:51.55         final String abi = android.os.Build.CPU_ABI;
75:51.55                                            ^
75:51.57 generated/org/mozilla/gecko/mozglue/GeckoLoader.java:346: warning: [deprecation] CPU_ABI in Build has been deprecated
75:51.57         message.append(": ABI: " + MOZ_APP_ABI + ", " + android.os.Build.CPU_ABI);
75:51.57                                                                         ^
75:51.66 2 warnings
75:52.50 Note: /opt/FirefoxSource/mozilla-release/mobile/android/thirdparty/com/squareup/picasso/Utils.java uses or overrides a deprecated API.
75:52.50 Note: Recompile with -Xlint:deprecation for details.
75:55.40 Note: Some input files use or override a deprecated API.
75:55.40 Note: Recompile with -Xlint:deprecation for details.
75:55.40 Note: Some input files use unchecked or unsafe operations.
75:55.40 Note: Recompile with -Xlint:unchecked for details.
75:55.65 make[4]: *** [mobile/android/base/libs] Fehler 2
75:55.65 make[3]: *** [libs] Fehler 2
75:55.65 make[2]: *** [default] Fehler 2
75:55.66 make[1]: *** [realbuild] Fehler 2
75:55.66 make: *** [build] Fehler 2
75:55.67 452 compiler warnings present.
Build step 'Shell ausführen' marked build as failure
[PostBuildScript] - Execution post build scripts.
[PostBuildScript] Build is not success : do not execute script
Finished: FAILURE