Console Output

Skipping 544 KB.. Full Log
64:31.87 WebGLExtensionElementIndexUint.o
64:34.84 nsCrossSiteListenerProxy.o
64:35.85 HTMLMenuItemElement.o
64:36.04 MediaTaskQueue.o
64:39.69 WebGLExtensionFragDepth.o
64:40.63 MediaTrack.o
64:41.82 MediaTrackList.o
64:41.93 HTMLMetaElement.o
64:42.84 nsDOMAttributeMap.o
64:46.17 WebGLExtensionInstancedArrays.o
64:46.48 RtspMediaResource.o
64:46.94 HTMLMeterElement.o
64:48.02 nsDOMBlobBuilder.o
64:52.97 HTMLModElement.o
64:53.04 nsDOMCaretPosition.o
64:53.20 WebGLExtensionLoseContext.o
64:56.15 SharedThreadPool.o
64:56.49 nsDOMFile.o
64:57.83 HTMLObjectElement.o
65:00.50 nsDOMFileReader.o
65:00.71 WebGLExtensionSRGB.o
65:02.92 StreamBuffer.o
65:03.10 HTMLOptGroupElement.o
65:03.94 TextTrack.o
65:05.22 TextTrackCue.o
65:06.57 nsDOMMutationObserver.o
65:06.60 WebGLExtensionStandardDerivatives.o
65:13.49 HTMLOptionElement.o
65:13.61 TextTrackCueList.o
65:13.83 nsDOMSerializer.o
65:15.84 WebGLExtensionTextureFilterAnisotropic.o
65:20.14 TextTrackList.o
65:22.09 nsDOMSettableTokenList.o
65:22.41 WebGLExtensionTextureFloat.o
65:22.75 HTMLOptionsCollection.o
65:25.60 nsDOMTokenList.o
65:27.65 WebGLExtensionTextureFloatLinear.o
65:27.85 TextTrackRegion.o
65:30.10 nsDataDocumentContentPolicy.o
65:30.22 HTMLOutputElement.o
65:33.57 WebGLExtensionTextureHalfFloat.o
65:34.06 VideoFrameContainer.o
65:34.87 nsDocumentEncoder.o
65:37.60 nsElementFrameLoaderOwner.o
65:38.00 WebGLExtensionTextureHalfFloatLinear.o
65:38.28 HTMLParagraphElement.o
65:38.31 VideoPlaybackQuality.o
65:44.62 nsFormData.o
65:44.80 HTMLPictureElement.o
65:44.80 WebGLExtensionVertexArray.o
65:48.13 VideoSegment.o
65:49.18 nsFrameLoader.o
65:49.23 HTMLPreElement.o
65:49.27 WebGLFramebuffer.o
65:52.47 nsFrameMessageManager.o
65:53.28 HTMLProgressElement.o
65:53.34 VideoStreamTrack.o
65:55.39 WebGLFramebufferAttachable.o
65:55.74 VideoTrack.o
65:57.46 HTMLPropertiesCollection.o
65:59.32 VideoTrackList.o
66:01.64 HTMLScriptElement.o
66:02.19 WebGLObjectModel.o
66:05.11 VideoUtils.o
66:07.20 HTMLSelectElement.o
66:07.83 WebVTTListener.o
66:08.06 WebGLProgram.o
66:08.89 nsGenConImageContent.o
66:13.83 HTMLShadowElement.o
66:15.20 WebGLQuery.o
66:19.33 /opt/FirefoxSource/mozilla-release/content/media/WebVTTListener.cpp: In member function 'virtual nsresult mozilla::dom::WebVTTListener::OnCue(JS::Handle<JS::Value>, JSContext*)':
66:19.33 Warning: -Wmaybe-uninitialized in /opt/FirefoxSource/mozilla-release/content/media/WebVTTListener.cpp: 'cue' may be used uninitialized in this function
66:19.33 /opt/FirefoxSource/mozilla-release/content/media/WebVTTListener.cpp:173:33: warning: 'cue' may be used uninitialized in this function [-Wmaybe-uninitialized]
66:19.34 HTMLSharedElement.o
66:21.02 In file included from ../../../dist/include/nsDataHashtable.h:11:0,
66:21.02                  from /opt/FirefoxSource/mozilla-release/content/base/src/nsFrameMessageManager.h:21,
66:21.02                  from /opt/FirefoxSource/mozilla-release/content/base/src/nsFrameMessageManager.cpp:8:
66:21.02 ../../../dist/include/nsBaseHashtable.h: In member function 'void nsFrameScriptExecutor::TryCacheLoadAndCompileScript(const nsAString_internal&, bool, bool, JS::MutableHandle<JSScript*>)':
66:21.02 Warning: -Wmaybe-uninitialized in /opt/FirefoxSource/mozilla-release/objdir-droid/dist/include/nsBaseHashtable.h: 'holder' may be used uninitialized in this function
66:21.02 ../../../dist/include/nsBaseHashtable.h:138:5: warning: 'holder' may be used uninitialized in this function [-Wmaybe-uninitialized]
66:21.02 /opt/FirefoxSource/mozilla-release/content/base/src/nsFrameMessageManager.cpp:1550:44: note: 'holder' was declared here
66:21.03 nsGenericDOMDataNode.o
66:24.24 WebGLRenderbuffer.o
66:24.70 SVGDocument.o
66:25.30 nsGkAtoms.o
66:26.92 HTMLSharedListElement.o
66:59.97 WebGLShader.o
66:59.98 nsHTMLContentSerializer.o
66:59.99 HTMLSharedObjectElement.o
66:60.00 nsHostObjectProtocolHandler.o
67:02.01 HTMLSourceElement.o
67:04.01 nsHostObjectURI.o
67:06.51 WebGLShaderPrecisionFormat.o
67:08.14 DOMSVGAnimatedLengthList.o
67:08.15 DOMSVGAnimatedNumberList.o
67:09.34 nsINode.o
67:09.37 HTMLSpanElement.o
67:10.60 nsInProcessTabChildGlobal.o
67:12.27 DOMSVGLength.o
67:14.71 WebGLTexelConversions.o
67:16.24 DOMSVGLengthList.o
67:18.09 HTMLStyleElement.o
67:22.30 DOMSVGNumber.o
67:22.96 WebGLTexture.o
67:24.61 HTMLTableCaptionElement.o
67:25.93 nsLineBreaker.o
67:27.34 DOMSVGNumberList.o
67:30.57 HTMLTableCellElement.o
67:31.58 DOMSVGPathSeg.o
67:33.63 nsMappedAttributeElement.o
67:36.12 DOMSVGPathSegList.o
67:36.70 HTMLTableColElement.o
67:37.97 nsMappedAttributes.o
67:39.44 WebGLUniformLocation.o
67:42.12 HTMLTableElement.o
67:42.19 DOMSVGPoint.o
67:42.38 nsMixedContentBlocker.o
67:45.90 DOMSVGPointList.o
67:48.18 nsNameSpaceManager.o
67:48.55 HTMLTableRowElement.o
67:49.63 WebGLVertexArray.o
67:50.42 DOMSVGStringList.o
67:52.39 nsNoDataProtocolContentPolicy.o
67:54.49 DOMSVGTransformList.o
67:56.97 nsNodeUtils.o
67:57.07 WebGLVertexArrayFake.o
67:58.47 nsPlainTextSerializer.o
67:58.53 HTMLTableSectionElement.o
67:59.86 SVGAElement.o
68:04.49 SVGAltGlyphElement.o
68:17.46 WebGLVertexArrayGL.o
68:17.52 nsPropertyTable.o
68:17.68 HTMLTemplateElement.o
68:22.67 SVGAngle.o
68:23.73 nsRange.o
68:24.57 nsReferencedElement.o
68:25.20 HTMLTextAreaElement.o
68:27.33 SVGAnimateElement.o
68:30.64 SVGAnimateMotionElement.o
68:30.92 HTMLTimeElement.o
68:33.36 CDATASection.o
68:33.37 ProcessingInstruction.o
68:35.99 SVGAnimateTransformElement.o
68:37.26 nsScriptElement.o
68:37.64 XMLStylesheetProcessingInstruction.o
68:41.10 HTMLTitleElement.o
68:41.46 SVGAnimatedAngle.o
68:42.21 nsScriptLoader.o
68:42.54 nsXMLElement.o
68:46.38 HTMLTrackElement.o
68:47.57 SVGAnimatedBoolean.o
68:47.59 nsStubDocumentObserver.o
68:51.64 SVGAnimatedEnumeration.o
68:51.73 HTMLUnknownElement.o
68:53.60 XMLDocument.o
68:53.61 nsXMLContentSink.o
68:56.26 SVGAnimatedInteger.o
68:56.80 nsStubMutationObserver.o
68:57.23 nsStyleLinkElement.o
68:57.64 nsStyledElement.o
69:00.40 SVGAnimatedLength.o
69:02.78 nsXMLFragmentContentSink.o
69:03.24 HTMLVideoElement.o
69:04.27 SVGAnimatedLengthList.o
69:05.84 nsSyncLoadService.o
69:09.40 nsTextFragment.o
69:10.03 SVGAnimatedNumber.o
69:10.62 MediaError.o
69:13.36 nsXMLPrettyPrinter.o
69:13.69 nsTextNode.o
69:14.23 SVGAnimatedNumberList.o
69:14.52 nsTraversal.o
69:18.37 SVGAnimatedPathSegList.o
69:18.53 nsTreeSanitizer.o
69:18.68 RadioNodeList.o
69:23.06 nsViewportInfo.o
69:23.48 SVGAnimatedPointList.o
69:24.48 nsXHTMLContentSerializer.o
69:25.02 TextTrackManager.o
69:25.79 TimeRanges.o
69:28.30 SVGAnimatedPreserveAspectRatio.o
69:29.05 nsXMLContentSerializer.o
69:30.71 XULDocument.o
69:30.71 nsXULCommandDispatcher.o
69:33.33 SVGAnimatedRect.o
69:34.55 nsXMLHttpRequest.o
69:37.14 UndoManager.o
69:38.51 SVGAnimatedString.o
69:40.31 nsXMLNameSpaceMap.o
69:42.89 SVGAnimatedTransformList.o
69:43.63 ValidityState.o
69:47.11 SVGAnimationElement.o
69:50.83 nsXULContentSink.o
69:51.56 nsDOMStringMap.o
69:52.18 SVGAttrValueWrapper.o
69:53.00 nsFormSubmission.o
69:55.10 nsXULControllers.o
69:55.65 nsXULPrototypeCache.o
69:57.23 nsGenericHTMLElement.o
70:20.84 SVGCircleElement.o
70:20.85 nsXULPrototypeDocument.o
70:20.85 nsGenericHTMLFrameElement.o
70:24.86 SVGClipPathElement.o
70:25.88 nsXULContextMenuBuilder.o
70:25.89 nsXULElement.o
70:28.84 SVGContentUtils.o
70:29.65 nsXULPopupListener.o
70:32.76 SVGDefsElement.o
70:39.54 nsHTMLDNSPrefetch.o
70:42.89 SVGDescElement.o
70:43.09 nsContentSupportMap.o
70:43.10 nsContentTestNode.o
70:45.55 nsIConstraintValidation.o
70:46.11 nsFilteredContentIterator.o
70:46.12 nsTextServicesDocument.o
70:48.31 SVGElementFactory.o
70:49.29 nsInstantiationNode.o
70:50.06 nsRadioVisitor.o
70:50.50 nsRDFBinding.o
70:52.62 nsRDFConInstanceTestNode.o
70:53.01 SVGEllipseElement.o
70:53.98 nsRDFConMemberTestNode.o
70:55.18 nsTextEditorState.o
70:55.35 nsRDFPropertyTestNode.o
70:56.58 SVGFEBlendElement.o
70:57.25 nsRDFQuery.o
70:58.57 /opt/FirefoxSource/mozilla-release/editor/txtsvc/nsTextServicesDocument.cpp: In member function 'nsresult nsTextServicesDocument::GetUncollapsedSelection(nsITextServicesDocument::TSDBlockSelectionStatus*, int32_t*, int32_t*)':
70:58.57 Warning: -Wmaybe-uninitialized in /opt/FirefoxSource/mozilla-release/editor/txtsvc/nsTextServicesDocument.cpp: 'e2s1' may be used uninitialized in this function
70:58.57 /opt/FirefoxSource/mozilla-release/editor/txtsvc/nsTextServicesDocument.cpp:2826:3: warning: 'e2s1' may be used uninitialized in this function [-Wmaybe-uninitialized]
70:58.57 Warning: -Wmaybe-uninitialized in /opt/FirefoxSource/mozilla-release/editor/txtsvc/nsTextServicesDocument.cpp: 'e1s2' may be used uninitialized in this function
70:58.57 /opt/FirefoxSource/mozilla-release/editor/txtsvc/nsTextServicesDocument.cpp:2826:3: warning: 'e1s2' may be used uninitialized in this function [-Wmaybe-uninitialized]
70:58.58 nsResourceSet.o
70:59.10 ChangeAttributeTxn.o
70:59.11 ChangeCSSInlineStyleTxn.o
70:59.78 nsRuleNetwork.o
71:00.14 CreateElementTxn.o
71:00.25 nsTemplateMatch.o
71:01.92 DeleteNodeTxn.o
71:01.96 nsTemplateRule.o
71:02.18 SVGFEColorMatrixElement.o
71:03.29 nsTreeRows.o
71:05.85 nsXMLBinding.o
71:06.70 DeleteRangeTxn.o
71:08.36 nsXULContentBuilder.o
71:08.76 SVGFEComponentTransferElement.o
71:10.81 DeleteTextTxn.o
71:12.63 nsXULContentUtils.o
71:13.47 SVGFECompositeElement.o
71:15.84 EditAggregateTxn.o
71:16.90 SVGFEConvolveMatrixElement.o
71:20.88 nsXULSortService.o
71:21.35 SVGFEDiffuseLightingElement.o
71:21.78 EditTxn.o
71:22.75 IMETextTxn.o
71:22.98 SVGFEDisplacementMapElement.o
71:23.38 InsertElementTxn.o
71:25.51 nsXULTemplateBuilder.o
71:28.54 SVGFEDistantLightElement.o
71:28.66 nsXULTemplateQueryProcessorRDF.o
71:29.41 InsertTextTxn.o
71:30.39 SVGFEDropShadowElement.o
71:34.02 JoinElementTxn.o
71:34.41 SVGFEFloodElement.o
71:35.00 PlaceholderTxn.o
71:37.44 SetDocTitleTxn.o
71:38.67 SVGFEGaussianBlurElement.o
71:40.30 nsXULTemplateQueryProcessorStorage.o
71:40.35 SVGFEImageElement.o
71:42.59 SplitElementTxn.o
71:44.66 nsEditor.o
71:46.69 SVGFEMergeElement.o
71:46.78 nsXULTemplateQueryProcessorXML.o
71:48.17 SVGFEMergeNodeElement.o
71:48.91 nsEditorCommands.o
71:50.44 nsXULTemplateResultRDF.o
71:53.96 SVGFEMorphologyElement.o
71:53.99 nsInternetCiter.o
71:54.00 nsPlaintextDataTransfer.o
71:54.93 nsPlaintextEditor.o
71:56.09 nsXULTemplateResultSetRDF.o
71:57.57 nsXULTemplateResultStorage.o
71:58.77 nsXULTemplateResultXML.o
71:59.71 nsTextEditRules.o
71:59.90 SVGFEOffsetElement.o
71:59.98 nsXULTreeBuilder.o
72:02.44 nsEditorController.o
72:06.77 nsEditorEventListener.o
72:07.29 nsEditorUtils.o
72:07.41 SVGFEPointLightElement.o
72:07.92 nsTextEditRulesBidi.o
72:11.05 SVGFESpecularLightingElement.o
72:13.76 TextEditorTest.o
72:13.77 TypeInState.o
72:13.90 nsEditProperty.o
72:16.11 nsSelectionState.o
72:16.34 nsTextEditUtils.o
72:17.75 nsHTMLAbsPosition.o
72:17.89 SVGFESpotLightElement.o
72:18.33 nsHTMLAnonymousUtils.o
72:21.94 nsStyleSheetTxns.o
72:23.08 nsHTMLCSSUtils.o
72:25.38 SVGFETileElement.o
72:26.29 nsHTMLDataTransfer.o
72:28.74 nsTransactionItem.o
72:28.75 nsTransactionList.o
72:30.13 nsTransactionManager.o
72:31.46 nsTransactionManagerFactory.o
72:32.39 nsHTMLEditRules.o
72:32.99 SVGFETurbulenceElement.o
72:33.19 nsTransactionStack.o
72:33.90 nsComposeTxtSrvFilter.o
72:33.92 nsComposerCommands.o
72:35.36 nsComposerCommandsUpdater.o
72:36.06 nsCSSRuleProcessor.o
72:36.07 nsFontFaceLoader.o
72:38.93 nsComposerController.o
72:39.22 SVGFilterElement.o
72:40.59 nsComposerDocumentCommands.o
72:41.57 nsComposerRegistration.o
72:42.98 nsHTMLEditUtils.o
72:44.20 nsEditingSession.o
72:44.81 nsEditorSpellCheck.o
72:45.66 /opt/FirefoxSource/mozilla-release/layout/style/nsCSSRuleProcessor.cpp: In member function 'nsRestyleHint nsCSSRuleProcessor::HasStateDependentStyle(ElementDependentRuleProcessorData*, mozilla::dom::Element*, nsCSSPseudoElements::Type, mozilla::EventStates)':
72:45.67 Warning: -Wmaybe-uninitialized in /opt/FirefoxSource/mozilla-release/layout/style/nsCSSRuleProcessor.cpp: 'selectorForPseudo' may be used uninitialized in this function
72:45.67 /opt/FirefoxSource/mozilla-release/layout/style/nsCSSRuleProcessor.cpp:2682:52: warning: 'selectorForPseudo' may be used uninitialized in this function [-Wmaybe-uninitialized]
72:45.67 /opt/FirefoxSource/mozilla-release/layout/style/nsCSSRuleProcessor.cpp:2643:22: note: 'selectorForPseudo' was declared here
72:45.68 AnimationCommon.o
72:46.42 SVGForeignObjectElement.o
72:53.14 SVGFragmentIdentifier.o
72:53.98 CSS.o
72:55.37 nsHTMLEditor.o
72:57.63 CSSRuleList.o
72:59.01 nsHTMLEditorEventListener.o
73:01.38 SVGGElement.o
73:01.55 CSSStyleSheet.o
73:03.00 CSSVariableDeclarations.o
73:03.23 CSSVariableResolver.o
73:05.77 CSSVariableValues.o
73:06.47 SVGGradientElement.o
73:06.83 CounterStyleManager.o
73:07.94 Declaration.o
73:11.80 SVGGraphicsElement.o
73:12.10 /opt/FirefoxSource/mozilla-release/layout/style/CSSStyleSheet.cpp: In member function 'bool nsMediaExpression::Matches(nsPresContext*, const nsCSSValue&) const':
73:12.10 Warning: -Wmaybe-uninitialized in /opt/FirefoxSource/mozilla-release/layout/style/CSSStyleSheet.cpp: 'cmp' may be used uninitialized in this function
73:12.10 /opt/FirefoxSource/mozilla-release/layout/style/CSSStyleSheet.cpp:277:21: warning: 'cmp' may be used uninitialized in this function [-Wmaybe-uninitialized]
73:12.11 ErrorReporter.o
73:12.92 ImageLoader.o
73:14.69 Loader.o
73:15.71 nsHTMLEditorStyle.o
73:19.23 SVGIFrameElement.o
73:19.25 MediaQueryList.o
73:19.26 nsHTMLInlineTableEditor.o
73:21.46 nsHTMLObjectResizer.o
73:24.66 SVGImageElement.o
73:25.50 StyleAnimationValue.o
73:25.89 nsHTMLURIRefObject.o
73:30.16 StyleRule.o
73:30.17 SVGIntegerPairSMILType.o
73:31.71 nsTableEditor.o
73:32.18 SVGLength.o
73:32.60 SVGLengthList.o
73:32.72 nsWSRunObject.o
73:36.81 /opt/FirefoxSource/mozilla-release/layout/style/StyleAnimationValue.cpp: In function 'void ExtractBorderColor(nsStyleContext*, const void*, mozilla::css::Side, mozilla::StyleAnimationValue&)':
73:36.82 Warning: -Wmaybe-uninitialized in /opt/FirefoxSource/mozilla-release/layout/style/StyleAnimationValue.cpp: 'color' may be used uninitialized in this function
73:36.82 /opt/FirefoxSource/mozilla-release/layout/style/StyleAnimationValue.cpp:3702:25: warning: 'color' may be used uninitialized in this function [-Wmaybe-uninitialized]
73:36.82 /opt/FirefoxSource/mozilla-release/layout/style/StyleAnimationValue.cpp:2726:11: note: 'color' was declared here
73:36.82 /opt/FirefoxSource/mozilla-release/layout/style/StyleAnimationValue.cpp: In static member function 'static bool mozilla::StyleAnimationValue::ExtractComputedValue(nsCSSProperty, nsStyleContext*, mozilla::StyleAnimationValue&)':
73:36.82 Warning: -Wmaybe-uninitialized in /opt/FirefoxSource/mozilla-release/layout/style/StyleAnimationValue.cpp: 'color' may be used uninitialized in this function
73:36.82 /opt/FirefoxSource/mozilla-release/layout/style/StyleAnimationValue.cpp:3702:25: warning: 'color' may be used uninitialized in this function [-Wmaybe-uninitialized]
73:36.82 /opt/FirefoxSource/mozilla-release/layout/style/StyleAnimationValue.cpp:2959:19: note: 'color' was declared here
73:36.83 nsAnimationManager.o
73:37.24 SVGLengthListSMILType.o
73:37.63 nsCSSAnonBoxes.o
73:43.71 SVGLineElement.o
73:45.71 nsCSSDataBlock.o
73:46.40 nsCSSKeywords.o
73:47.93 SVGMPathElement.o
73:48.19 SVGMarkerElement.o
74:11.51 SVGMaskElement.o
74:11.51 SVGMatrix.o
74:11.51 nsCSSParser.o
74:11.57 nsDocumentViewer.o
74:11.58 nsPresArena.o
74:12.20 nsCSSProps.o
74:18.01 SVGMetadataElement.o
74:18.34 SVGMotionSMILAnimationFunction.o
74:22.68 SVGMotionSMILAttr.o
74:23.94 SVGMotionSMILPathUtils.o
74:28.06 nsLineLayout.o
74:28.08 nsObjectFrame.o
74:29.30 SVGMotionSMILType.o
74:32.06 nsPresShell.o
74:32.35 SVGNumberList.o
74:33.53 nsRefreshDriver.o
74:33.89 /opt/FirefoxSource/mozilla-release/layout/style/nsCSSParser.cpp: In member function 'bool {anonymous}::CSSParserImpl::ParseGridLine(nsCSSValue&)':
74:33.90 Warning: -Wmaybe-uninitialized in /opt/FirefoxSource/mozilla-release/layout/style/nsCSSParser.cpp: 'integer' may be used uninitialized in this function
74:33.90 /opt/FirefoxSource/mozilla-release/layout/style/nsCSSParser.cpp:8583:56: warning: 'integer' may be used uninitialized in this function [-Wmaybe-uninitialized]
74:33.90 /opt/FirefoxSource/mozilla-release/layout/style/nsCSSParser.cpp:8525:11: note: 'integer' was declared here
74:33.94 nsCSSPseudoClasses.o
74:35.18 SVGNumberListSMILType.o
74:38.03 FrameChildList.o
74:39.17 SVGNumberPairSMILType.o
74:39.65 nsCSSPseudoElements.o
74:40.44 nsCSSRules.o
74:41.04 nsCSSScanner.o
74:42.14 SVGOrientSMILType.o
74:42.57 SVGPathData.o
74:47.59 SVGPathElement.o
74:48.54 MathMLTextRunFactory.o
74:50.61 nsCSSValue.o
74:51.41 ScrollbarActivity.o
74:52.05 nsComputedDOMStyle.o
74:55.13 /opt/FirefoxSource/mozilla-release/layout/generic/MathMLTextRunFactory.cpp: In member function 'virtual void MathMLTextRunFactory::RebuildTextRun(nsTransformedTextRun*, gfxContext*)':
74:55.13 Warning: -Wmaybe-uninitialized in /opt/FirefoxSource/mozilla-release/layout/generic/MathMLTextRunFactory.cpp: 'mathVar' may be used uninitialized in this function
74:55.13 /opt/FirefoxSource/mozilla-release/layout/generic/MathMLTextRunFactory.cpp:692:10: warning: 'mathVar' may be used uninitialized in this function [-Wmaybe-uninitialized]
74:55.13 /opt/FirefoxSource/mozilla-release/layout/generic/MathMLTextRunFactory.cpp:590:11: note: 'mathVar' was declared here
74:55.13 StickyScrollContainer.o
74:55.87 SVGPathSegListSMILType.o
74:58.68 nsDOMCSSAttrDeclaration.o
75:01.34 TextOverflow.o
75:03.69 SVGPathSegUtils.o
75:03.79 ActiveLayerTracker.o
75:07.76 SVGPatternElement.o
75:07.92 nsAbsoluteContainingBlock.o
75:09.83 SVGPointList.o
75:11.28 /opt/FirefoxSource/mozilla-release/layout/style/nsComputedDOMStyle.cpp: In member function 'mozilla::dom::CSSValue* nsComputedDOMStyle::DoGetOutlineWidth()':
75:11.28 Warning: -Wmaybe-uninitialized in /opt/FirefoxSource/mozilla-release/layout/style/nsComputedDOMStyle.cpp: 'width' may be used uninitialized in this function
75:11.28 /opt/FirefoxSource/mozilla-release/layout/style/nsComputedDOMStyle.cpp:2696:26: warning: 'width' may be used uninitialized in this function [-Wmaybe-uninitialized]
75:11.28 /opt/FirefoxSource/mozilla-release/layout/style/nsComputedDOMStyle.cpp: In member function 'mozilla::dom::CSSValue* nsComputedDOMStyle::DoGetTextDecorationColor()':
75:11.28 Warning: -Wmaybe-uninitialized in /opt/FirefoxSource/mozilla-release/layout/style/nsComputedDOMStyle.cpp: 'color' may be used uninitialized in this function
75:11.28 /opt/FirefoxSource/mozilla-release/layout/style/nsComputedDOMStyle.cpp:3121:29: warning: 'color' may be used uninitialized in this function [-Wmaybe-uninitialized]
75:11.28 /opt/FirefoxSource/mozilla-release/layout/style/nsComputedDOMStyle.cpp: In member function 'mozilla::dom::CSSValue* nsComputedDOMStyle::GetBorderColorFor(mozilla::css::Side)':
75:11.28 Warning: -Wmaybe-uninitialized in /opt/FirefoxSource/mozilla-release/layout/style/nsComputedDOMStyle.cpp: 'color' may be used uninitialized in this function
75:11.28 /opt/FirefoxSource/mozilla-release/layout/style/nsComputedDOMStyle.cpp:4426:29: warning: 'color' may be used uninitialized in this function [-Wmaybe-uninitialized]
75:11.30 nsDOMCSSDeclaration.o
75:13.29 DisplayItemClip.o
75:15.69 SVGPointListSMILType.o
75:18.01 nsDOMCSSRGBColor.o
75:18.12 nsBRFrame.o
75:20.35 DisplayListClipState.o
75:20.73 SVGPolygonElement.o
75:23.60 nsBlockFrame.o
75:24.26 SVGPolylineElement.o
75:25.12 nsDOMCSSRect.o
75:25.21 FrameLayerBuilder.o
75:26.80 nsDOMCSSValueList.o
75:28.34 nsHTMLCSSStyleSheet.o
75:29.57 SVGPreserveAspectRatio.o
75:29.80 nsBlockReflowContext.o
75:29.85 nsHTMLStyleSheet.o
75:30.64 FramePropertyTable.o
75:34.37 SVGRect.o
75:35.50 nsLayoutStylesheetCache.o
75:38.69 SVGRectElement.o
75:41.43 nsMediaFeatures.o
75:42.53 SVGSVGElement.o
75:44.41 /opt/FirefoxSource/mozilla-release/layout/generic/nsBlockFrame.cpp: In member function 'void nsBlockFrame::AddFrames(nsFrameList&, nsIFrame*)':
75:44.41 Warning: -Wmaybe-uninitialized in /opt/FirefoxSource/mozilla-release/layout/generic/nsBlockFrame.cpp: 'overflowLines' may be used uninitialized in this function
75:44.41 /opt/FirefoxSource/mozilla-release/layout/generic/nsBlockFrame.cpp:4959:72: warning: 'overflowLines' may be used uninitialized in this function [-Wmaybe-uninitialized]
75:44.43 nsBlockReflowState.o
75:44.89 GeometryUtils.o
75:45.74 MaskLayerImageCache.o
75:46.90 nsNthIndexCache.o
75:48.66 SVGScriptElement.o
75:49.85 nsBulletFrame.o
75:52.33 nsROCSSPrimitiveValue.o
75:55.21 nsRuleData.o
75:55.58 nsCanvasFrame.o
76:19.50 PaintTracker.o
76:19.50 nsColumnSetFrame.o
76:19.86 SVGSetElement.o
76:22.45 PositionedEventTargeting.o
76:22.54 nsRuleNode.o
76:22.72 RestyleManager.o
76:24.42 nsStyleContext.o
76:25.89 SVGStopElement.o
76:27.82 nsContainerFrame.o
76:30.95 SVGStringList.o
76:31.00 RestyleTracker.o
76:35.98 SVGStyleElement.o
76:36.21 nsFirstLetterFrame.o
76:38.81 SVGSwitchElement.o
76:40.04 /opt/FirefoxSource/mozilla-release/layout/style/nsRuleNode.cpp: In static member function 'static nscoord nsRuleNode::CalcFontPointSize(int32_t, int32_t, nsPresContext*, nsFontSizeType)':
76:40.04 Warning: -Wmaybe-uninitialized in /opt/FirefoxSource/mozilla-release/layout/style/nsRuleNode.cpp: 'column' may be used uninitialized in this function
76:40.04 /opt/FirefoxSource/mozilla-release/layout/style/nsRuleNode.cpp:2884:55: warning: 'column' may be used uninitialized in this function [-Wmaybe-uninitialized]
76:40.04 /opt/FirefoxSource/mozilla-release/layout/style/nsRuleNode.cpp:2862:12: note: 'column' was declared here
76:40.04 /opt/FirefoxSource/mozilla-release/layout/style/nsRuleNode.cpp: In static member function 'static bool nsRuleNode::HasAuthorSpecifiedRules(nsStyleContext*, uint32_t, bool)':
76:40.05 Warning: -Wmaybe-uninitialized in /opt/FirefoxSource/mozilla-release/layout/style/nsRuleNode.cpp: 'textShadowOffset' may be used uninitialized in this function
76:40.05 /opt/FirefoxSource/mozilla-release/layout/style/nsRuleNode.cpp:9096:65: warning: 'textShadowOffset' may be used uninitialized in this function [-Wmaybe-uninitialized]
76:40.05 Warning: -Wmaybe-uninitialized in /opt/FirefoxSource/mozilla-release/layout/style/nsRuleNode.cpp: 'paddingOffset' may be used uninitialized in this function
76:40.05 /opt/FirefoxSource/mozilla-release/layout/style/nsRuleNode.cpp:9092:65: warning: 'paddingOffset' may be used uninitialized in this function [-Wmaybe-uninitialized]
76:40.05 Warning: -Wmaybe-uninitialized in /opt/FirefoxSource/mozilla-release/layout/style/nsRuleNode.cpp: 'borderOffset' may be used uninitialized in this function
76:40.05 /opt/FirefoxSource/mozilla-release/layout/style/nsRuleNode.cpp:9088:63: warning: 'borderOffset' may be used uninitialized in this function [-Wmaybe-uninitialized]
76:40.07 nsStyleCoord.o
76:44.41 SVGSymbolElement.o
76:44.43 /opt/FirefoxSource/mozilla-release/layout/base/RestyleManager.cpp: In member function 'void mozilla::ElementRestyler::RestyleChildren(nsRestyleHint)':
76:44.43 Warning: -Wmaybe-uninitialized in /opt/FirefoxSource/mozilla-release/layout/base/RestyleManager.cpp: 'lastContinuation' may be used uninitialized in this function
76:44.43 /opt/FirefoxSource/mozilla-release/layout/base/RestyleManager.cpp:2622:41: warning: 'lastContinuation' may be used uninitialized in this function [-Wmaybe-uninitialized]
76:44.43 /opt/FirefoxSource/mozilla-release/layout/base/RestyleManager.cpp:2605:13: note: 'lastContinuation' was declared here
76:44.45 SelectionCarets.o
76:46.28 nsFlexContainerFrame.o
76:46.88 /opt/FirefoxSource/mozilla-release/layout/style/nsStyleContext.cpp: In member function 'nsChangeHint nsStyleContext::CalcStyleDifference(nsStyleContext*, nsChangeHint)':
76:46.88 Warning: -Wmaybe-uninitialized in /opt/FirefoxSource/mozilla-release/layout/style/nsStyleContext.cpp: 'otherVisDecColor' may be used uninitialized in this function
76:46.88 /opt/FirefoxSource/mozilla-release/layout/style/nsStyleContext.cpp:610:7: warning: 'otherVisDecColor' may be used uninitialized in this function [-Wmaybe-uninitialized]
76:46.88 /opt/FirefoxSource/mozilla-release/layout/style/nsStyleContext.cpp:604:32: note: 'otherVisDecColor' was declared here
76:46.88 Warning: -Wmaybe-uninitialized in /opt/FirefoxSource/mozilla-release/layout/style/nsStyleContext.cpp: 'thisVisDecColor' may be used uninitialized in this function
76:46.88 /opt/FirefoxSource/mozilla-release/layout/style/nsStyleContext.cpp:610:7: warning: 'thisVisDecColor' may be used uninitialized in this function [-Wmaybe-uninitialized]
76:46.88 /opt/FirefoxSource/mozilla-release/layout/style/nsStyleContext.cpp:604:15: note: 'thisVisDecColor' was declared here
76:46.88 Warning: -Wmaybe-uninitialized in /opt/FirefoxSource/mozilla-release/layout/style/nsStyleContext.cpp: 'otherColor' may be used uninitialized in this function
76:46.88 /opt/FirefoxSource/mozilla-release/layout/style/nsStyleContext.cpp:580:7: warning: 'otherColor' may be used uninitialized in this function [-Wmaybe-uninitialized]
76:46.88 /opt/FirefoxSource/mozilla-release/layout/style/nsStyleContext.cpp:579:26: note: 'otherColor' was declared here
76:46.88 Warning: -Wmaybe-uninitialized in /opt/FirefoxSource/mozilla-release/layout/style/nsStyleContext.cpp: 'otherColor' may be used uninitialized in this function
76:46.88 /opt/FirefoxSource/mozilla-release/layout/style/nsStyleContext.cpp:567:9: warning: 'otherColor' may be used uninitialized in this function [-Wmaybe-uninitialized]
76:46.88 /opt/FirefoxSource/mozilla-release/layout/style/nsStyleContext.cpp:564:28: note: 'otherColor' was declared here
76:46.88 Warning: -Wmaybe-uninitialized in /opt/FirefoxSource/mozilla-release/layout/style/nsStyleContext.cpp: 'thisColor' may be used uninitialized in this function
76:46.88 /opt/FirefoxSource/mozilla-release/layout/style/nsStyleContext.cpp:567:9: warning: 'thisColor' may be used uninitialized in this function [-Wmaybe-uninitialized]
76:46.88 /opt/FirefoxSource/mozilla-release/layout/style/nsStyleContext.cpp:564:17: note: 'thisColor' was declared here
76:46.89 nsStyleSet.o
76:48.11 nsStyleStruct.o
76:50.03 StackArena.o
76:52.44 SVGTSpanElement.o
76:52.83 nsFloatManager.o
76:57.64 SVGTests.o
76:58.74 nsStyleTransformMatrix.o
76:59.85 TouchCaret.o
77:00.42 nsBidi.o
77:01.38 /opt/FirefoxSource/mozilla-release/layout/generic/nsFlexContainerFrame.cpp: In member function 'void nsFlexContainerFrame::DoFlexLayout(nsPresContext*, nsHTMLReflowMetrics&, const nsHTMLReflowState&, nsReflowStatus&, nscoord, nscoord, nsTArray<nsFlexContainerFrame::StrutInfo>&, const nsFlexContainerFrame::FlexboxAxisTracker&)':
77:01.38 Warning: -Wmaybe-uninitialized in /opt/FirefoxSource/mozilla-release/layout/generic/nsFlexContainerFrame.cpp: 'flexContainerAscent' may be used uninitialized in this function
77:01.38 /opt/FirefoxSource/mozilla-release/layout/generic/nsFlexContainerFrame.cpp:3392:3: warning: 'flexContainerAscent' may be used uninitialized in this function [-Wmaybe-uninitialized]
77:01.38 /opt/FirefoxSource/mozilla-release/layout/generic/nsFlexContainerFrame.cpp:3214:11: note: 'flexContainerAscent' was declared here
77:01.41 nsFontInflationData.o
77:03.41 SVGTextContentElement.o
77:06.66 /opt/FirefoxSource/mozilla-release/layout/style/nsStyleStruct.cpp: In member function 'nsChangeHint nsStyleTextReset::CalcDifference(const nsStyleTextReset&) const':
77:06.66 Warning: -Wmaybe-uninitialized in /opt/FirefoxSource/mozilla-release/layout/style/nsStyleStruct.cpp: 'otherDecColor' may be used uninitialized in this function
77:06.66 /opt/FirefoxSource/mozilla-release/layout/style/nsStyleStruct.cpp:3037:5: warning: 'otherDecColor' may be used uninitialized in this function [-Wmaybe-uninitialized]
77:06.66 Warning: -Wmaybe-uninitialized in /opt/FirefoxSource/mozilla-release/layout/style/nsStyleStruct.cpp: 'decColor' may be used uninitialized in this function
77:06.66 /opt/FirefoxSource/mozilla-release/layout/style/nsStyleStruct.cpp:3037:5: warning: 'decColor' may be used uninitialized in this function [-Wmaybe-uninitialized]
77:06.67 nsStyleUtil.o
77:07.04 nsFrame.o
77:08.50 SVGTextElement.o
77:09.99 nsTransitionManager.o
77:11.25 nsBidiPresUtils.o
77:12.54 nsCSSColorUtils.o
77:13.27 nsFrameList.o
77:15.63 SVGTextPathElement.o
77:21.48 nsCSSFrameConstructor.o
77:21.52 SVGTextPositioningElement.o
77:21.94 nsCSSRendering.o
77:22.50 nsFrameSetFrame.o
77:25.35 nsButtonFrameRenderer.o
77:25.36 nsColorControlFrame.o
77:27.96 SVGTitleElement.o
77:33.82 SVGTransform.o
77:34.23 /opt/FirefoxSource/mozilla-release/layout/generic/nsFrame.cpp: In static member function 'static int32_t nsFrame::GetLineNumber(nsIFrame*, bool, nsIFrame**)':
77:34.23 Warning: -Wmaybe-uninitialized in /opt/FirefoxSource/mozilla-release/layout/generic/nsFrame.cpp: 'thisBlock' may be used uninitialized in this function
77:34.23 /opt/FirefoxSource/mozilla-release/layout/generic/nsFrame.cpp:6747:42: warning: 'thisBlock' may be used uninitialized in this function [-Wmaybe-uninitialized]
77:34.23 /opt/FirefoxSource/mozilla-release/layout/generic/nsFrame.cpp: In member function 'nsresult nsIFrame::PeekOffsetParagraph(nsPeekOffsetStruct*)':
77:34.24 Warning: -Wmaybe-uninitialized in /opt/FirefoxSource/mozilla-release/layout/generic/nsFrame.cpp: 'blockFrameOrBR.nsContentAndOffset::mOffset' may be used uninitialized in this function
77:34.24 /opt/FirefoxSource/mozilla-release/layout/generic/nsFrame.cpp:6225:54: warning: 'blockFrameOrBR.nsContentAndOffset::mOffset' may be used uninitialized in this function [-Wmaybe-uninitialized]
77:34.24 /opt/FirefoxSource/mozilla-release/layout/generic/nsFrame.cpp: In member function 'bool nsIFrame::FinishAndStoreOverflow(nsOverflowAreas&, nsSize, nsSize*)':
77:34.24 Warning: -Wmaybe-uninitialized in /opt/FirefoxSource/mozilla-release/layout/generic/nsFrame.cpp: 'width' may be used uninitialized in this function
77:34.24 /opt/FirefoxSource/mozilla-release/layout/generic/nsFrame.cpp:7189:37: warning: 'width' may be used uninitialized in this function [-Wmaybe-uninitialized]
77:34.24 /opt/FirefoxSource/mozilla-release/layout/generic/nsFrame.cpp:7110:11: note: 'width' was declared here
77:34.26 nsComboboxControlFrame.o
77:34.28 nsFrameState.o
77:38.90 SVGTransformList.o
77:42.11 nsCSSRenderingBorders.o
77:42.96 nsFieldSetFrame.o
77:43.65 SVGTransformListParser.o
77:45.34 SVGTransformListSMILType.o
77:46.07 nsFrameUtil.o
77:49.04 SVGTransformableElement.o
77:50.66 SVGUseElement.o
77:54.52 nsGfxScrollFrame.o
77:54.66 nsFileControlFrame.o
77:55.62 /opt/FirefoxSource/mozilla-release/layout/base/nsCSSRendering.cpp: In function 'bool _ZL14IsOpaqueBorderRK13nsStyleBorder.part.39(const nsStyleBorder&)':
77:55.62 Warning: -Wmaybe-uninitialized in /opt/FirefoxSource/mozilla-release/layout/base/nsCSSRendering.cpp: 'color' may be used uninitialized in this function
77:55.62 /opt/FirefoxSource/mozilla-release/layout/base/nsCSSRendering.cpp:1667:50: warning: 'color' may be used uninitialized in this function [-Wmaybe-uninitialized]
77:55.62 /opt/FirefoxSource/mozilla-release/layout/base/nsCSSRendering.cpp:1658:11: note: 'color' was declared here
77:55.62 /opt/FirefoxSource/mozilla-release/layout/base/nsCSSRendering.cpp: In static member function 'static void nsCSSRendering::PaintOutline(nsPresContext*, nsRenderingContext&, nsIFrame*, const nsRect&, const nsRect&, nsStyleContext*)':
77:55.62 Warning: -Wmaybe-uninitialized in /opt/FirefoxSource/mozilla-release/layout/base/nsCSSRendering.cpp: 'width' may be used uninitialized in this function
77:55.62 /opt/FirefoxSource/mozilla-release/layout/base/nsCSSRendering.cpp:852:65: warning: 'width' may be used uninitialized in this function [-Wmaybe-uninitialized]
77:55.62 /opt/FirefoxSource/mozilla-release/layout/base/nsCSSRendering.cpp: In static member function 'static void nsCSSRendering::PaintGradient(nsPresContext*, nsRenderingContext&, nsStyleGradient*, const nsRect&, const nsRect&, const nsRect&, const CSSIntRect&, const nsSize&)':
77:55.62 Warning: -Wmaybe-uninitialized in /opt/FirefoxSource/mozilla-release/layout/base/nsCSSRendering.cpp: 'position' may be used uninitialized in this function
77:55.62 /opt/FirefoxSource/mozilla-release/layout/base/nsCSSRendering.cpp:353:40: warning: 'position' may be used uninitialized in this function [-Wmaybe-uninitialized]
77:55.62 /opt/FirefoxSource/mozilla-release/layout/base/nsCSSRendering.cpp:2287:12: note: 'position' was declared here
77:55.62 /opt/FirefoxSource/mozilla-release/layout/base/nsCSSRendering.cpp: In static member function 'static void nsCSSRendering::PaintBackgroundWithSC(nsPresContext*, nsRenderingContext&, nsIFrame*, const nsRect&, const nsRect&, nsStyleContext*, const nsStyleBorder&, uint32_t, nsRect*, int32_t)':
77:55.62 Warning: -Wmaybe-uninitialized in /opt/FirefoxSource/mozilla-release/layout/base/nsCSSRendering.cpp: 'isSolidBorder' may be used uninitialized in this function
77:55.62 /opt/FirefoxSource/mozilla-release/layout/base/nsCSSRendering.cpp:2805:9: warning: 'isSolidBorder' may be used uninitialized in this function [-Wmaybe-uninitialized]
77:55.62 /opt/FirefoxSource/mozilla-release/layout/base/nsCSSRendering.cpp:2718:8: note: 'isSolidBorder' was declared here
77:55.63 Warning: -Wmaybe-uninitialized in /opt/FirefoxSource/mozilla-release/layout/base/nsCSSRendering.cpp: 'currentBackgroundClip' may be used uninitialized in this function
77:55.63 /opt/FirefoxSource/mozilla-release/layout/base/nsCSSRendering.cpp:2809:9: warning: 'currentBackgroundClip' may be used uninitialized in this function [-Wmaybe-uninitialized]
77:55.63 /opt/FirefoxSource/mozilla-release/layout/base/nsCSSRendering.cpp:2717:11: note: 'currentBackgroundClip' was declared here
77:55.63 nsCaret.o
77:59.31 nsGridContainerFrame.o
77:59.31 SVGViewBoxSMILType.o
78:02.27 nsCounterManager.o
78:03.23 nsFormControlFrame.o
78:06.50 SVGViewElement.o
78:11.04 nsDisplayList.o
78:11.08 SVGZoomEvent.o
78:12.58 nsGfxButtonControlFrame.o
78:16.37 nsHTMLCanvasFrame.o
78:16.68 nsISVGPoint.o
78:16.80 In file included from ../../dist/include/nsAString.h:23:0,
78:16.80                  from ../../dist/include/nsSubstring.h:10,
78:16.80                  from ../../dist/include/nsString.h:12,
78:16.80                  from ../../dist/include/nsStringGlue.h:18,
78:16.80                  from ../../dist/include/nsHashKeys.h:18,
78:16.80                  from /opt/FirefoxSource/mozilla-release/layout/base/nsIPresShell.h:28,
78:16.80                  from /opt/FirefoxSource/mozilla-release/layout/base/nsPresContext.h:16,
78:16.80                  from /opt/FirefoxSource/mozilla-release/layout/base/../style/nsRuleNode.h:14,
78:16.80                  from /opt/FirefoxSource/mozilla-release/layout/base/../style/nsStyleContext.h:11,
78:16.80                  from /opt/FirefoxSource/mozilla-release/layout/base/../generic/nsIFrame.h:25,
78:16.80                  from /opt/FirefoxSource/mozilla-release/layout/base/nsGenConList.h:11,
78:16.80                  from /opt/FirefoxSource/mozilla-release/layout/base/nsCounterManager.h:13,
78:16.80                  from /opt/FirefoxSource/mozilla-release/layout/base/nsCounterManager.cpp:9:
78:16.80 ../../dist/include/nsTSubstring.h: In member function 'void nsCounterUseNode::GetText(nsString&)':
78:16.80 Warning: -Wmaybe-uninitialized in /opt/FirefoxSource/mozilla-release/objdir-droid/dist/include/nsTSubstring.h: 'separator' may be used uninitialized in this function
78:16.80 ../../dist/include/nsTSubstring.h:526:40: warning: 'separator' may be used uninitialized in this function [-Wmaybe-uninitialized]
78:16.80 /opt/FirefoxSource/mozilla-release/layout/base/nsCounterManager.cpp:94:21: note: 'separator' was declared here
78:16.81 nsDisplayListInvalidation.o
78:18.71 nsGfxCheckboxControlFrame.o
78:21.09 nsHTMLReflowMetrics.o
78:22.96 nsSVGAngle.o
78:26.30 nsGfxRadioControlFrame.o
78:27.54 nsSVGAnimatedTransformList.o
78:29.06 nsHTMLReflowState.o
78:32.05 nsSVGBoolean.o
78:33.20 nsImageFrame.o
78:34.52 nsHTMLButtonControlFrame.o
78:36.22 nsSVGClass.o
78:41.00 nsImageControlFrame.o
78:41.18 /opt/FirefoxSource/mozilla-release/content/svg/content/src/nsSVGBoolean.cpp: In member function 'nsresult nsSVGBoolean::SetBaseValueAtom(const nsIAtom*, nsSVGElement*)':
78:41.18 Warning: -Wmaybe-uninitialized in /opt/FirefoxSource/mozilla-release/content/svg/content/src/nsSVGBoolean.cpp: 'val' may be used uninitialized in this function
78:41.18 /opt/FirefoxSource/mozilla-release/content/svg/content/src/nsSVGBoolean.cpp:68:24: warning: 'val' may be used uninitialized in this function [-Wmaybe-uninitialized]
78:41.20 nsSVGDataParser.o
78:41.85 /opt/FirefoxSource/mozilla-release/layout/base/nsDisplayList.cpp: In static member function 'static bool nsDisplayBackgroundImage::AppendBackgroundItemsToTop(nsDisplayListBuilder*, nsIFrame*, nsDisplayList*)':
78:41.85 Warning: -Wmaybe-uninitialized in /opt/FirefoxSource/mozilla-release/layout/base/nsDisplayList.cpp: 'color' may be used uninitialized in this function
78:41.85 /opt/FirefoxSource/mozilla-release/layout/base/nsDisplayList.cpp:1880:3: warning: 'color' may be used uninitialized in this function [-Wmaybe-uninitialized]
78:41.86 nsFrameManager.o
78:43.10 /opt/FirefoxSource/mozilla-release/layout/generic/nsHTMLReflowState.cpp: In member function 'void nsHTMLReflowState::InitConstraints(nsPresContext*, nscoord, nscoord, const nsMargin*, const nsMargin*, nsIAtom*)':
78:43.10 Warning: -Wmaybe-uninitialized in /opt/FirefoxSource/mozilla-release/layout/generic/nsHTMLReflowState.cpp: 'fType' may be used uninitialized in this function
78:43.10 /opt/FirefoxSource/mozilla-release/layout/generic/nsHTMLReflowState.cpp:1992:37: warning: 'fType' may be used uninitialized in this function [-Wmaybe-uninitialized]
78:43.13 nsImageMap.o
78:45.31 nsSVGElement.o
78:47.59 nsSVGEnum.o
78:48.34 nsFrameTraversal.o
78:49.52 nsLegendFrame.o
78:55.02 nsGenConList.o
78:56.78 nsSVGFeatures.o
78:57.21 nsInlineFrame.o
78:57.32 nsListControlFrame.o
78:58.40 nsLayoutDebugger.o
79:01.05 nsSVGFilters.o
79:03.40 nsLayoutHistoryState.o
79:03.99 nsSVGInteger.o
79:04.48 nsIntervalSet.o
79:05.97 nsMeterFrame.o
79:08.10 nsLayoutUtils.o
79:09.28 nsPresContext.o
79:13.40 nsSVGIntegerPair.o
79:13.42 nsLeafFrame.o
79:14.22 nsLineBox.o
79:16.70 nsSVGLength2.o
79:22.12 nsNumberControlFrame.o
79:26.44 /opt/FirefoxSource/mozilla-release/layout/base/nsLayoutUtils.cpp: In static member function 'static nscoord nsLayoutUtils::ComputeWidthValue(nsRenderingContext*, nsIFrame*, nscoord, nscoord, nscoord, const nsStyleCoord&)':
79:26.44 Warning: -Wmaybe-uninitialized in /opt/FirefoxSource/mozilla-release/layout/base/nsLayoutUtils.cpp: 'result' may be used uninitialized in this function
79:26.44 /opt/FirefoxSource/mozilla-release/layout/base/nsLayoutUtils.cpp:3971:11: warning: 'result' may be used uninitialized in this function [-Wmaybe-uninitialized]
79:31.68 nsPageContentFrame.o
79:31.69 nsQuoteList.o
79:31.89 nsSVGNumber2.o
79:35.74 nsPageFrame.o
79:37.86 nsSVGNumberPair.o
79:38.79 nsProgressFrame.o
79:41.89 nsPlaceholderFrame.o
79:42.72 nsSVGPathDataParser.o
79:45.99 nsSVGPathGeometryElement.o
79:48.11 nsRangeFrame.o
79:48.35 nsSelection.o
79:50.78 nsSVGPolyElement.o
79:53.61 nsSimplePageSequenceFrame.o
79:54.97 nsSelectsAreaFrame.o
79:57.05 nsSVGString.o
80:07.56 nsSplittableFrame.o
80:31.48 nsTextControlFrame.o
80:31.53 nsSVGTransform.o
80:31.58 nsStyleChangeList.o
80:36.28 nsSVGViewBox.o
80:37.85 nsStyleSheetService.o
80:40.89 nsSubDocumentFrame.o
80:43.85 nsTextFrame.o
80:44.12 BasicTableLayoutStrategy.o
80:44.13 FixedTableLayoutStrategy.o
80:45.93 SpanningCellSorter.o
80:47.04 /opt/FirefoxSource/mozilla-release/layout/base/nsStyleSheetService.cpp: In member function 'virtual nsresult nsStyleSheetService::UnregisterSheet(nsIURI*, uint32_t)':
80:47.04 Warning: -Wmaybe-uninitialized in /opt/FirefoxSource/mozilla-release/layout/base/nsStyleSheetService.cpp: 'message' may be used uninitialized in this function
80:47.04 /opt/FirefoxSource/mozilla-release/layout/base/nsStyleSheetService.cpp:266:51: warning: 'message' may be used uninitialized in this function [-Wmaybe-uninitialized]
80:47.04 nsCellMap.o
80:48.63 SVGFEContainerFrame.o
80:48.63 SVGFEImageFrame.o
80:50.14 nsTextFrameUtils.o
80:52.46 nsTableCellFrame.o
80:52.82 nsTableColFrame.o
80:55.58 SVGFELeafFrame.o
80:59.98 SVGFEUnstyledLeafFrame.o
81:02.03 nsTextRunTransformations.o
81:03.40 nsTableColGroupFrame.o
81:06.74 SVGTextFrame.o
81:06.93 nsVideoFrame.o
81:08.07 nsViewportFrame.o
81:12.43 nsTableFrame.o
81:12.73 SVGViewFrame.o
81:19.54 nsTableOuterFrame.o
81:19.91 nsTablePainter.o
81:21.45 nsBox.o
81:21.46 nsBoxFrame.o
81:25.89 nsBoxLayout.o
81:26.22 nsFilterInstance.o
81:27.94 /opt/FirefoxSource/mozilla-release/layout/tables/nsTableOuterFrame.cpp: In member function 'virtual void nsTableOuterFrame::Reflow(nsPresContext*, nsHTMLReflowMetrics&, const nsHTMLReflowState&, nsReflowStatus&)':
81:27.94 Warning: -Wmaybe-uninitialized in /opt/FirefoxSource/mozilla-release/layout/tables/nsTableOuterFrame.cpp: 'captionFirstReflow' may be used uninitialized in this function
81:27.94 /opt/FirefoxSource/mozilla-release/layout/tables/nsTableOuterFrame.cpp:1036:59: warning: 'captionFirstReflow' may be used uninitialized in this function [-Wmaybe-uninitialized]
81:27.94 /opt/FirefoxSource/mozilla-release/layout/tables/nsTableOuterFrame.cpp:903:8: note: 'captionFirstReflow' was declared here
81:27.95 nsTableRowFrame.o
81:30.37 /opt/FirefoxSource/mozilla-release/layout/tables/nsTableFrame.cpp: In member function 'void nsTableFrame::HomogenousInsertFrames(nsIFrame::ChildListID, nsIFrame*, nsFrameList&)':
81:30.37 Warning: -Wmaybe-uninitialized in /opt/FirefoxSource/mozilla-release/layout/tables/nsTableFrame.cpp: 'content' may be used uninitialized in this function
81:30.37 /opt/FirefoxSource/mozilla-release/layout/tables/nsTableFrame.cpp:2343:59: warning: 'content' may be used uninitialized in this function [-Wmaybe-uninitialized]
81:30.37 /opt/FirefoxSource/mozilla-release/layout/tables/nsTableFrame.cpp:2337:19: note: 'content' was declared here
81:30.38 nsTableRowGroupFrame.o
81:32.85 nsSVGAFrame.o
81:34.46 nsBoxLayoutState.o
81:38.25 nsBoxObject.o
81:38.76 nsButtonBoxFrame.o
81:40.56 nsContainerBoxObject.o
81:40.62 nsSVGClipPathFrame.o
81:44.49 RenderFrameChild.o
81:44.50 RenderFrameParent.o
81:45.31 nsDeckFrame.o
81:46.60 nsSVGContainerFrame.o
81:48.08 nsDocElementBoxFrame.o
81:51.59 nsSVGEffects.o
81:53.87 nsGroupBoxFrame.o
81:54.64 nsImageBoxFrame.o
81:58.45 nsMathMLChar.o
81:58.47 nsMathMLContainerFrame.o
81:58.86 nsSVGFilterFrame.o
82:01.14 nsLeafBoxFrame.o
82:01.89 nsListBoxBodyFrame.o
82:07.09 nsSVGFilterInstance.o
82:07.28 nsMathMLFrame.o
82:08.05 nsSVGForeignObjectFrame.o
82:08.16 nsListBoxLayout.o
82:13.66 nsMathMLOperators.o
82:14.97 nsListBoxObject.o
82:16.03 nsSVGGFrame.o
82:16.64 nsMathMLSelectedFrame.o
82:18.71 nsMathMLTokenFrame.o
82:19.41 nsListItemFrame.o
82:21.59 nsMathMLmactionFrame.o
82:22.72 nsSVGGenericContainerFrame.o
82:23.54 nsMenuBarFrame.o
82:26.09 nsMathMLmencloseFrame.o
82:29.31 nsMenuBarListener.o
82:29.44 nsSVGGradientFrame.o
82:29.58 nsMathMLmfencedFrame.o
82:31.57 nsMathMLmfracFrame.o
82:33.82 nsSVGImageFrame.o
82:36.06 nsMenuBoxObject.o
82:36.47 nsMathMLmmultiscriptsFrame.o
82:38.09 nsMenuFrame.o
82:40.22 nsSVGInnerSVGFrame.o
82:40.95 nsMathMLmoFrame.o
82:42.77 nsMenuPopupFrame.o
82:44.96 nsMathMLmpaddedFrame.o
82:45.66 nsSVGIntegrationUtils.o
82:48.36 inCSSValueSearch.o
82:48.36 inDOMUtils.o
82:49.76 nsMathMLmphantomFrame.o
82:51.22 inDOMView.o
82:51.78 nsPopupBoxObject.o
82:53.03 nsSVGMarkerFrame.o
82:56.65 nsMathMLmrootFrame.o
82:59.01 inDeepTreeWalker.o
83:00.37 nsSVGMaskFrame.o
83:01.16 nsPopupSetFrame.o
83:03.13 nsMathMLmrowFrame.o
83:03.52 inFlasher.o
83:05.57 nsSVGOuterSVGFrame.o
83:05.77 nsProgressMeterFrame.o
83:08.47 inLayoutUtils.o
83:10.66 nsMathMLmspaceFrame.o
83:10.94 nsRepeatService.o
83:11.96 nsSVGPaintServerFrame.o
83:12.90 inSearchLoop.o
83:15.77 nsResizerFrame.o
83:16.24 nsRootBoxFrame.o
83:16.33 nsFontFace.o
83:16.80 nsFontFaceList.o
83:17.20 nsMathMLmsqrtFrame.o
83:21.46 nsSVGPathGeometryFrame.o
83:22.79 nsScrollBoxFrame.o
83:23.90 nsMathMLmtableFrame.o
83:25.79 nsSVGPatternFrame.o
83:27.16 nsScrollBoxObject.o
83:27.77 nsMathMLmunderoverFrame.o
83:29.69 nsScrollbarButtonFrame.o
83:32.96 nsPrintData.o
83:32.97 nsPrintEngine.o
83:32.97 nsScrollbarFrame.o
83:34.47 nsSVGStopFrame.o
83:37.23 nsMathMLsemanticsFrame.o
83:37.69 nsPagePrintTimer.o
83:38.46 nsSliderFrame.o
83:42.54 nsSVGSwitchFrame.o
83:44.50 nsSplitterFrame.o
83:46.05 nsSVGUseFrame.o
83:48.22 nsPrintObject.o
83:50.55 nsSprocketLayout.o
83:51.12 nsSVGUtils.o
83:52.49 nsPrintPreviewListener.o
83:58.15 nsStackFrame.o
83:58.93 nsStackLayout.o
84:01.31 nsContentDLF.o
84:01.33 nsLayoutModule.o
84:02.30 nsDocShell.o
84:02.32 LoadContext.o
84:03.96 /opt/FirefoxSource/mozilla-release/layout/xul/nsSprocketLayout.cpp: In member function 'void nsSprocketLayout::AlignChildren(nsIFrame*, nsBoxLayoutState&)':
84:03.96 Warning: -Wmaybe-uninitialized in /opt/FirefoxSource/mozilla-release/layout/xul/nsSprocketLayout.cpp: 'y' may be used uninitialized in this function
84:03.96 /opt/FirefoxSource/mozilla-release/layout/xul/nsSprocketLayout.cpp:973:22: warning: 'y' may be used uninitialized in this function [-Wmaybe-uninitialized]
84:03.96 Warning: -Wmaybe-uninitialized in /opt/FirefoxSource/mozilla-release/layout/xul/nsSprocketLayout.cpp: 'x' may be used uninitialized in this function
84:03.96 /opt/FirefoxSource/mozilla-release/layout/xul/nsSprocketLayout.cpp:993:22: warning: 'x' may be used uninitialized in this function [-Wmaybe-uninitialized]
84:03.96 Warning: -Wmaybe-uninitialized in /opt/FirefoxSource/mozilla-release/layout/xul/nsSprocketLayout.cpp: 'isLTR' may be used uninitialized in this function
84:03.96 /opt/FirefoxSource/mozilla-release/layout/xul/nsSprocketLayout.cpp:989:45: warning: 'isLTR' may be used uninitialized in this function [-Wmaybe-uninitialized]
84:03.97 Warning: -Wmaybe-uninitialized in /opt/FirefoxSource/mozilla-release/layout/xul/nsSprocketLayout.cpp: 'maxAscent' may be used uninitialized in this function
84:03.97 /opt/FirefoxSource/mozilla-release/layout/xul/nsSprocketLayout.cpp:967:54: warning: 'maxAscent' may be used uninitialized in this function [-Wmaybe-uninitialized]
84:03.98 nsTextBoxFrame.o
84:05.21 LoadInfo.o
84:05.74 nsLayoutStatics.o
84:08.43 nsTitleBarFrame.o
84:09.10 SerializedLoadContext.o
84:09.58 nsAboutRedirector.o
84:12.18 nsDSURIContentListener.o
84:13.33 nsDefaultURIFixup.o
84:16.83 /opt/FirefoxSource/mozilla-release/layout/xul/nsTextBoxFrame.cpp: In member function 'void nsTextBoxFrame::DrawText(nsRenderingContext&, const nsRect&, const nsRect&, const nscolor*)':
84:16.83 Warning: -Wmaybe-uninitialized in /opt/FirefoxSource/mozilla-release/layout/xul/nsTextBoxFrame.cpp: 'underColor' may be used uninitialized in this function
84:16.83 /opt/FirefoxSource/mozilla-release/layout/xul/nsTextBoxFrame.cpp:488:43: warning: 'underColor' may be used uninitialized in this function [-Wmaybe-uninitialized]
84:16.83 Warning: -Wmaybe-uninitialized in /opt/FirefoxSource/mozilla-release/layout/xul/nsTextBoxFrame.cpp: 'overColor' may be used uninitialized in this function
84:16.83 /opt/FirefoxSource/mozilla-release/layout/xul/nsTextBoxFrame.cpp:495:42: warning: 'overColor' may be used uninitialized in this function [-Wmaybe-uninitialized]
84:16.83 Warning: -Wmaybe-uninitialized in /opt/FirefoxSource/mozilla-release/layout/xul/nsTextBoxFrame.cpp: 'strikeColor' may be used uninitialized in this function
84:16.83 /opt/FirefoxSource/mozilla-release/layout/xul/nsTextBoxFrame.cpp:573:37: warning: 'strikeColor' may be used uninitialized in this function [-Wmaybe-uninitialized]
84:16.83 Warning: -Wmaybe-uninitialized in /opt/FirefoxSource/mozilla-release/layout/xul/nsTextBoxFrame.cpp: 'strikeStyle' may be used uninitialized in this function
84:16.83 /opt/FirefoxSource/mozilla-release/layout/xul/nsTextBoxFrame.cpp:573:37: warning: 'strikeStyle' may be used uninitialized in this function [-Wmaybe-uninitialized]
84:16.83 Warning: -Wmaybe-uninitialized in /opt/FirefoxSource/mozilla-release/layout/xul/nsTextBoxFrame.cpp: 'underStyle' may be used uninitialized in this function
84:16.83 /opt/FirefoxSource/mozilla-release/layout/xul/nsTextBoxFrame.cpp:488:43: warning: 'underStyle' may be used uninitialized in this function [-Wmaybe-uninitialized]
84:16.83 Warning: -Wmaybe-uninitialized in /opt/FirefoxSource/mozilla-release/layout/xul/nsTextBoxFrame.cpp: 'overStyle' may be used uninitialized in this function
84:16.83 /opt/FirefoxSource/mozilla-release/layout/xul/nsTextBoxFrame.cpp:495:42: warning: 'overStyle' may be used uninitialized in this function [-Wmaybe-uninitialized]
84:16.83 nsXULLabelFrame.o
84:18.17 nsDocShellEditorData.o
84:22.53 nsDocShellEnumerator.o
84:23.68 nsXULPopupManager.o
84:24.04 nsDocShellLoadInfo.o
84:25.17 nsDocShellTransferableHooks.o
84:26.30 nsDownloadHistory.o
84:26.86 nsWebNavigationInfo.o
84:27.54 nsXULTooltipListener.o
84:34.24 nsSHEntry.o
84:34.25 nsSHEntryShared.o
84:35.70 nsSHTransaction.o
84:37.08 nsSHistory.o
84:39.54 nsDocShellModule.o
84:39.73 nsAutoWindowStateHelper.o
84:39.74 nsDialogParamBlock.o
84:40.18 nsAppStartupNotifier.o
84:42.07 nsFind.o
84:42.07 nsWebBrowserFind.o
84:42.19 nsWindowWatcher.o
84:42.97 nsWebBrowserPersist.o
84:49.15 nsBaseCommandController.o
84:49.16 nsCommandGroup.o
84:49.76 nsPrintProgress.o
84:49.76 nsPrintProgressParams.o
84:50.09 nsCommandManager.o
84:50.45 nsEmbeddingModule.o
84:51.28 nsPrintingPromptService.o
84:51.56 nsCommandParams.o
84:52.25 nsCommandHandler.o
84:52.27 nsContextMenuInfo.o
84:53.36 nsDocShellTreeOwner.o
84:54.21 nsControllerCommandTable.o
84:54.36 nsWebBrowserModule.o
84:56.09 nsEmbedStream.o
84:56.51 nsAppShellFactory.o
84:56.52 nsAppShellService.o
84:56.69 ANPCanvas.o
84:56.69 ANPPaint.o
84:57.54 ANPPath.o
84:58.20 nsAppShellWindowEnumerator.o
84:58.22 ANPTypeface.o
84:58.34 nsWebBrowser.o
84:58.98 SkANP.o
84:59.30 CharDistribution.o
84:59.32 JpCntx.o
84:59.77 /opt/FirefoxSource/mozilla-release/other-licenses/skia-npapi/ANPTypeface.cpp: In function 'int32_t anp_getFontPath(const ANPTypeface*, char*, int32_t, int32_t*)':
84:59.77 Warning: -Wunused-variable in /opt/FirefoxSource/mozilla-release/other-licenses/skia-npapi/ANPTypeface.cpp: unused variable 'stream'
84:59.77 /opt/FirefoxSource/mozilla-release/other-licenses/skia-npapi/ANPTypeface.cpp:63:15: warning: unused variable 'stream' [-Wunused-variable]
84:59.98 LangBulgarianModel.o
85:00.27 LangCyrillicModel.o
85:00.48 LangGreekModel.o
85:00.57 LangHebrewModel.o
85:00.71 nsWebBrowserContentPolicy.o
85:00.81 LangHungarianModel.o
85:01.03 LangThaiModel.o
85:01.30 nsBig5Prober.o
85:01.60 nsChromeTreeOwner.o
85:01.60 nsCharSetProber.o
85:01.94 nsEUCJPProber.o
85:02.23 nsEUCKRProber.o
85:02.61 nsEUCTWProber.o
85:02.97 nsEscCharsetProber.o
85:03.38 nsEscSM.o
85:03.75 nsGB2312Prober.o
85:04.09 nsHebrewProber.o
85:04.38 nsContentTreeOwner.o
85:04.43 nsLatin1Prober.o
85:04.74 nsMBCSGroupProber.o
85:05.08 nsMBCSSM.o
85:05.59 nsSBCSGroupProber.o
85:05.98 nsSBCharSetProber.o
85:06.06 nsWebShellWindow.o
85:06.56 nsSJISProber.o
85:06.85 nsUTF8Prober.o
85:07.22 nsUniversalDetector.o
85:08.11 nsUdetXPCOMWrapper.o
85:08.13 nsUniversalCharDetModule.o
85:09.13 nsWindowMediator.o
85:09.74 AccessibleWrap.o
85:09.76 Platform.o
85:11.17 ARIAMap.o
85:11.18 ARIAStateMap.o
85:11.21 ARIAGridAccessible.o
85:11.22 Accessible.o
85:11.62 nsXULWindow.o
85:13.92 HTMLCanvasAccessible.o
85:13.93 HTMLElementAccessibles.o
85:16.08 AccCollector.o
85:17.83 HTMLFormControlAccessible.o
85:18.04 ApplicationAccessible.o
85:21.31 AccEvent.o
85:23.11 xpcAccEvents.o
85:23.12 nsAccessibleRelation.o
85:23.27 AccGroupInfo.o
85:24.28 HTMLImageMapAccessible.o
85:24.61 xpcAccessibleHyperText.o
85:27.13 AccIterator.o
85:30.00 xpcAccessibleSelectable.o
85:32.05 Asserts.o
85:32.45 HTMLLinkAccessible.o
85:35.42 xpcAccessibleTable.o
85:35.82 BaseAccessibles.o
85:36.63 DocManager.o
85:36.92 EventQueue.o
85:37.04 xpcAccessibleTableCell.o
85:38.13 HTMLListAccessible.o
85:39.31 xpcAccessibleTextRange.o
85:40.37 DocAccessible.o
85:41.35 xpcAccessibleValue.o
85:43.32 Filters.o
85:43.40 HTMLSelectAccessible.o
85:45.97 FormControlAccessible.o
85:47.04 HyperTextAccessible.o
85:48.29 HTMLTableAccessible.o
85:48.37 FocusManager.o
85:53.43 Logging.o
85:55.41 XULAlertAccessible.o
85:55.42 XULColorPickerAccessible.o
85:55.87 ImageAccessible.o
85:57.18 XULComboboxAccessible.o
85:59.83 NotificationController.o
86:02.03 nsProfileDirServiceProvider.o
86:02.05 nsProfileLock.o
86:02.68 XULElementAccessibles.o
86:04.49 OuterDocAccessible.o
86:04.98 SelectionManager.o
86:05.06 local_debug_info_symbolizer.o
86:05.07 platform-linux.o
86:07.90 XULFormControlAccessible.o
86:10.04 RootAccessible.o
86:10.35 shared-libraries-linux.o
86:10.94 StyleInfo.o
86:12.17 EHABIStackWalk.o
86:14.55 AutoObjectMapper.o
86:14.82 XULListboxAccessible.o
86:15.44 TableCellAccessible.o
86:16.36 BreakpadSampler.o
86:16.56 TextAttrs.o
86:17.78 JSStreamWriter.o
86:20.05 LulCommon.o
86:21.07 TextLeafAccessible.o
86:21.49 LulDwarf.o
86:21.67 XULMenuAccessible.o
86:22.32 TextRange.o
86:22.86 LulDwarfSummariser.o
86:26.34 LulElf.o
86:26.80 LulExidx.o
86:27.66 LulMain.o
86:28.32 nsWindowDataSource.o
86:28.49 XULSelectControlAccessible.o
86:28.84 TextUpdater.o
86:29.12 LulRWLock.o
86:30.59 nsDirectoryViewer.o
86:31.16 ProfileEntry.o
86:31.42 ProfilerBacktrace.o
86:34.40 TreeWalker.o
86:35.11 ProfilerIOInterposeObserver.o
86:35.12 XULSliderAccessible.o
86:35.92 XULTabAccessible.o
86:36.15 ProfilerMarkers.o
86:38.03 SaveProfileTask.o
86:39.30 SyncProfile.o
86:40.16 TableTicker.o
86:40.54 nsAccUtils.o
86:40.93 XULTreeAccessible.o
86:41.11 nsAccessibilityService.o
86:41.37 ThreadResponsiveness.o
86:46.38 XULTreeGridAccessible.o
86:46.54 UnwinderThread2.o
86:47.35 nsAccessiblePivot.o
86:47.90 nsProfiler.o
86:50.12 nsProfilerFactory.o
86:52.84 platform.o
86:53.79 nsModule.o
86:54.07 nsCoreUtils.o
86:55.25 nsEventShell.o
86:57.72 nsTextEquivUtils.o
86:58.53 mozHunspell.o
86:58.55 mozHunspellDirProvider.o
87:00.93 RemoteSpellCheckEngineChild.o
87:01.94 RemoteSpellCheckEngineParent.o
87:03.07 mozEnglishWordUtils.o
87:03.08 mozGenericWordUtils.o
87:04.24 mozInlineSpellChecker.o
87:04.79 mozInlineSpellWordUtil.o
87:04.80 nsSecureBrowserUIImpl.o
87:04.81 PublicKeyPinningService.o
87:04.87 affentry.o
87:06.40 affixmgr.o
87:07.82 csutil.o
87:08.34 mozPersonalDictionary.o
87:09.88 nsBOOTModule.o
87:11.09 nsEntropyCollector.o
87:12.15 nsSecurityHeaderParser.o
87:12.51 dictmgr.o
87:12.83 nsSecurityWarningDialogs.o
87:12.93 mozSpellChecker.o
87:13.37 nsSiteSecurityService.o
87:13.57 mozSpellCheckerFactory.o
87:14.26 filemgr.o
87:15.03 hashmgr.o
87:15.50 hunspell.o
87:15.83 mozSpellI18NManager.o
87:16.88 hunzip.o
87:17.05 phonet.o
87:17.96 replist.o
87:19.04 suggestmgr.o
87:19.97 md4.o
87:19.97 CryptoTask.o
87:20.14 nsCertificatePrincipal.o
87:20.33 nsCertOverrideService.o
87:20.81 OCSPCommon.o
87:20.82 TLSServer.o
87:21.37 nsCertPicker.o
87:21.64 nsCertVerificationThread.o
87:21.91 BadCertServer.o
87:21.94 GenerateOCSPResponse.o
87:22.08 OCSPStaplingServer.o
87:22.59 OCSPCacheTest.o
87:22.62 TLSIntoleranceTest.o
87:23.00 nsClientAuthRemember.o
87:23.21 TestCertDB.o
87:23.61 nsASN1Tree.o
87:23.62 nsFormSigningDialog.o
87:24.33 nsCrypto.o
87:24.72 nsNSSDialogHelper.o
87:25.62 nsDataSignatureVerifier.o
87:25.67 nsNSSDialogs.o
87:26.37 nsPKIModule.o
87:26.84 nsAlertsService.o
87:26.85 nsXULAlerts.o
87:26.89 nsKeygenHandler.o
87:27.16 nsCommandLine.o
87:27.87 nsKeygenThread.o
87:27.90 nsPKIParamBlock.o
87:28.90 DiskSpaceWatcher.o
87:29.60 SQLFunctions.o
87:29.61 ApplicationReputation.o
87:30.20 nsKeyModule.o
87:30.98 csd.pb.o
87:31.28 nsNSSASN1Object.o
87:31.82 nsDownloadManager.o
87:32.28 nsNSSCallbacks.o
87:32.95 /opt/FirefoxSource/mozilla-release/security/manager/ssl/src/nsNSSASN1Object.cpp: In function 'nsresult buildASN1ObjectFromDER(unsigned char*, unsigned char*, nsIASN1Sequence*)':
87:32.95 Warning: -Wmaybe-uninitialized in /opt/FirefoxSource/mozilla-release/security/manager/ssl/src/nsNSSASN1Object.cpp: 'bytesUsed' may be used uninitialized in this function
87:32.95 /opt/FirefoxSource/mozilla-release/security/manager/ssl/src/nsNSSASN1Object.cpp:131:22: warning: 'bytesUsed' may be used uninitialized in this function [-Wmaybe-uninitialized]
87:32.95 nsNSSCertCache.o
87:35.17 FinalizationWitnessService.o
87:35.87 nsNSSCertHelper.o
87:36.50 nsNSSCertificate.o
87:39.34 nsNSSCertificateFakeTransport.o
87:39.49 nsFindService.o
87:40.55 DownloadPlatform.o
87:41.71 mp3sniff.o
87:41.72 nsMediaSniffer.o
87:41.95 nsMediaSnifferModule.o
87:43.07 NativeOSFileInternals.o
87:43.16 nsParentalControlsServiceDefault.o
87:43.80 PerfMeasurement.o
87:43.95 nsNSSCertTrust.o
87:44.94 extension_set.o
87:44.94 generated_message_util.o
87:45.24 nsNSSCertValidity.o
87:45.42 reflect.o
87:45.73 nsNSSCleaner.o
88:14.64 coded_stream.o
88:14.85 StartupTimeline.o
88:14.86 nsAppStartup.o
88:15.40 nsNSSErrors.o
88:15.55 nsUserInfoUnix.o
88:15.78 nsNSSIOLayer.o
88:15.99 zero_copy_stream.o
88:16.59 zero_copy_stream_impl_lite.o
88:17.02 nsNSSModule.o
88:17.35 nsBrowserStatusFilter.o
88:17.47 message_lite.o
88:18.27 Telemetry.o
88:18.44 repeated_field.o
88:18.60 common.o
88:19.49 once.o
88:20.19 nsTypeAheadFind.o
88:20.89 wire_format_lite.o
88:21.85 nsNSSShutDown.o
88:23.25 lz4.o
88:23.56 ctypes.o
88:24.16 nsNTLMAuthModule.o
88:24.97 nsPK11TokenDB.o
88:25.41 nsAutoCompleteController.o
88:25.43 nsAutoCompleteSimpleResult.o
88:26.31 nsPKCS11Slot.o
88:28.07 nsPKCS12Blob.o
88:29.02 nsFormFillController.o
88:29.35 nsUrlClassifierPrefixSet.o
88:29.36 nsUrlClassifierStreamUpdater.o
88:29.67 nsProtectedAuthThread.o
88:29.70 HashStore.o
88:31.37 nsPSMBackgroundThread.o
88:31.65 nsToolkitCompsModule.o
88:32.53 nsRandomGenerator.o
88:33.22 ChunkSet.o
88:34.37 nsSDR.o
88:35.74 Classifier.o
88:35.79 NSSErrorsService.o
88:36.13 nsJSInspector.o
88:36.94 nsSSLSocketProvider.o
88:37.70 LookupCache.o
88:37.89 ProtocolParser.o
88:38.22 nsSSLStatus.o
88:38.39 nsCheckSummedOutputStream.o
88:39.23 nsStreamCipher.o
88:40.16 IdentityCryptoService.o
88:40.36 nsTLSSocketProvider.o
88:40.38 nsUrlClassifierDBService.o
88:40.91 nsUrlClassifierProxies.o
88:40.96 nsUrlClassifierUtils.o
88:41.13 nsUsageArrayHelper.o
88:41.82 AddonPathService.o
88:42.10 PSMRunnable.o
88:43.32 SharedSSLState.o
88:44.15 SSLServerCertVerification.o
88:44.21 TransportSecurityInfo.o
88:44.52 BadPlugin.o
88:44.54 GoodPlugin.o
88:44.79 nsProfileLock.o
88:44.81 nsToolkitProfileService.o
88:45.37 nsCryptoHash.o
88:45.44 nsNSSCertificateDB.o
88:46.67 nsNSSComponent.o
88:46.95 nsNSSVersion.o
88:47.68 PSMContentListener.o
88:47.83 TestWebappRT.o
88:48.09 nsAndroidSystemProxySettings.o
88:48.52 convert_UTF.o
88:48.53 breakpad_getcontext.o
88:48.79 arm_ex_reader.o
88:48.91 arm_ex_to_module.o
88:49.23 bytereader.o
88:49.25 nsCertTree.o
88:51.02 dwarf2diehandler.o
88:51.15 /opt/FirefoxSource/mozilla-release/toolkit/system/androidproxy/nsAndroidSystemProxySettings.cpp: In member function 'virtual MozExternalRefCountType nsAndroidSystemProxySettings::Release()':
88:51.15 Warning: -Wdelete-non-virtual-dtor in /opt/FirefoxSource/mozilla-release/toolkit/system/androidproxy/nsAndroidSystemProxySettings.cpp: deleting object of polymorphic class type 'nsAndroidSystemProxySettings' which has non-virtual destructor might cause undefined behaviour
88:51.15 /opt/FirefoxSource/mozilla-release/toolkit/system/androidproxy/nsAndroidSystemProxySettings.cpp:32:409: warning: deleting object of polymorphic class type 'nsAndroidSystemProxySettings' which has non-virtual destructor might cause undefined behaviour [-Wdelete-non-virtual-dtor]
88:51.21 basic_code_modules.o
88:51.21 basic_source_line_resolver.o
88:51.32 dwarf2reader.o
88:51.95 dwarf_cfi_to_module.o
88:52.62 dwarf_cu_to_module.o
88:52.65 file_id.o
88:52.67 elfutils.o
88:52.85 call_stack.o
88:53.30 guid_creator.o
88:53.53 linux_libc_support.o
88:53.75 memory_mapped_file.o
88:54.00 safe_readlink.o
88:55.22 dwarf_line_to_module.o
88:55.63 nsAppRunner.o
88:55.69 nsEmbedFunctions.o
88:55.82 CreateAppData.o
88:56.86 cfi_frame_info.o
88:57.66 minidump.o
88:59.75 /opt/FirefoxSource/mozilla-release/toolkit/crashreporter/google-breakpad/src/common/dwarf_cu_to_module.cc: In member function 'std::string google_breakpad::DwarfCUToModule::GenericDIEHandler::ComputeQualifiedName()':
88:59.75 Warning: -Wmaybe-uninitialized in /opt/FirefoxSource/mozilla-release/toolkit/crashreporter/google-breakpad/src/common/dwarf_cu_to_module.cc: 'enclosing_name' may be used uninitialized in this function
88:59.75 /opt/FirefoxSource/mozilla-release/toolkit/crashreporter/google-breakpad/src/common/dwarf_cu_to_module.cc:386:68: warning: 'enclosing_name' may be used uninitialized in this function [-Wmaybe-uninitialized]
88:59.75 Warning: -Wmaybe-uninitialized in /opt/FirefoxSource/mozilla-release/toolkit/crashreporter/google-breakpad/src/common/dwarf_cu_to_module.cc: 'unqualified_name' may be used uninitialized in this function
88:59.76 /opt/FirefoxSource/mozilla-release/toolkit/crashreporter/google-breakpad/src/common/dwarf_cu_to_module.cc:386:68: warning: 'unqualified_name' may be used uninitialized in this function [-Wmaybe-uninitialized]
88:59.78 language.o
89:02.16 nsAutoConfig.o
89:02.18 nsConfigFactory.o
89:02.22 dump_symbols.o
89:02.90 source_line_resolver_base.o
89:03.35 elf_symbols_to_module.o
89:04.38 nsJSConfigTriggers.o
89:05.17 nsReadConfig.o
89:05.39 /opt/FirefoxSource/mozilla-release/toolkit/xre/nsAppRunner.cpp: In member function 'int XREMain::XRE_mainStartup(bool*)':
89:05.39 Warning: -Wmaybe-uninitialized in /opt/FirefoxSource/mozilla-release/toolkit/xre/nsAppRunner.cpp: 'currentIsSelected' may be used uninitialized in this function
89:05.39 /opt/FirefoxSource/mozilla-release/toolkit/xre/nsAppRunner.cpp:2096:7: warning: 'currentIsSelected' may be used uninitialized in this function [-Wmaybe-uninitialized]
89:05.39 /opt/FirefoxSource/mozilla-release/toolkit/xre/nsAppRunner.cpp:2094:12: note: 'currentIsSelected' was declared here
89:05.39 EventTracer.o
89:06.08 ProfileReset.o
89:06.60 logging.o
89:06.77 nsAndroidStartup.o
89:07.78 md5.o
89:08.04 nsConsoleWriter.o
89:09.60 nsNativeAppSupportBase.o
89:09.63 module.o
89:10.01 pathname_stripper.o
89:10.43 string_conversion.o
89:11.39 nsSyncJPAKE.o
89:11.70 nsNativeAppSupportDefault.o
89:11.93 stack_frame_symbolizer.o
89:12.05 nsSigHandlers.o
89:12.35 nsXREDirProvider.o
89:12.51 StartupCache.o
89:12.51 StartupCacheModule.o
89:13.32 unique_string.o
89:14.75 stackwalker.o
89:14.98 StartupCacheUtils.o
89:14.98 JSDebugger.o
89:15.70 snappy-c.o
89:15.72 snappy-sinksource.o
89:16.19 stackwalker_amd64.o
89:16.38 snappy-stubs-internal.o
89:16.46 snappy.o
89:17.32 stackwalker_arm.o
89:17.38 nsBrowserModule.o
89:17.39 nsShellService.o
89:18.05 stackwalker_ppc.o
89:19.37 nsAndroidHistory.o
89:19.52 StaticXULComponentsStart.o
89:19.79 ssltunnel.o
89:20.33 stackwalker_sparc.o
89:21.80 stackwalker_x86.o
89:22.02 /opt/FirefoxSource/mozilla-release/mobile/android/components/build/nsShellService.cpp: In member function 'virtual MozExternalRefCountType nsShellService::Release()':
89:22.02 Warning: -Wdelete-non-virtual-dtor in /opt/FirefoxSource/mozilla-release/mobile/android/components/build/nsShellService.cpp: deleting object of polymorphic class type 'nsShellService' which has non-virtual destructor might cause undefined behaviour
89:22.02 /opt/FirefoxSource/mozilla-release/mobile/android/components/build/nsShellService.cpp:13:381: warning: deleting object of polymorphic class type 'nsShellService' which has non-virtual destructor might cause undefined behaviour [-Wdelete-non-virtual-dtor]
89:22.03 tokenize.o
89:22.95 TestArrayUtils.o
89:22.96 TestAtomics.o
89:23.35 TestBinarySearch.o
89:23.79 /opt/FirefoxSource/mozilla-release/mobile/android/components/build/nsAndroidHistory.cpp: In member function 'virtual MozExternalRefCountType nsAndroidHistory::Release()':
89:23.79 Warning: -Wdelete-non-virtual-dtor in /opt/FirefoxSource/mozilla-release/mobile/android/components/build/nsAndroidHistory.cpp: deleting object of polymorphic class type 'nsAndroidHistory' which has non-virtual destructor might cause undefined behaviour
89:23.79 /opt/FirefoxSource/mozilla-release/mobile/android/components/build/nsAndroidHistory.cpp:18:385: warning: deleting object of polymorphic class type 'nsAndroidHistory' which has non-virtual destructor might cause undefined behaviour [-Wdelete-non-virtual-dtor]
89:23.80 TestBloomFilter.o
89:24.54 TestCasting.o
89:24.86 TestCeilingFloor.o
89:24.89 TestVolatileBuffer.o
89:25.13 TestCheckedInt.o
89:25.50 TestCountPopulation.o
89:25.95 TestCountZeroes.o
89:26.19 TestEndian.o
89:26.45 TestEnumSet.o
89:26.47 editline.o
89:26.48 sysunix.o
89:27.39 TestFloatingPoint.o
89:27.86 TestIntegerPrintfMacros.o
89:27.98 TestMacroArgs.o
89:28.75 TestMacroForEach.o
89:28.84 TestPair.o
89:28.88 TestRollingMean.o
89:28.98 js.o
89:29.00 jsheaptools.o
89:29.04 TestSHA1.o
89:29.14 TestTypedEnum.o
89:29.34 TestTypeTraits.o
89:29.72 TestUniquePtr.o
89:30.00 TestWeakPtr.o
89:31.69 TestPoisonArea.o
89:32.66 selfTest.o
89:32.68 testAddPropertyPropcache.o
89:37.32 testArgumentsObject.o
89:41.63 testArrayBuffer.o
89:42.76 In file included from /opt/FirefoxSource/mozilla-release/js/src/shell/../jsweakmap.h:10:0,
89:42.76                  from /opt/FirefoxSource/mozilla-release/js/src/shell/../vm/ScopeObject.h:12,
89:42.76                  from /opt/FirefoxSource/mozilla-release/js/src/shell/../frontend/SharedContext.h:19,
89:42.76                  from /opt/FirefoxSource/mozilla-release/js/src/shell/../frontend/FullParseHandler.h:13,
89:42.76                  from /opt/FirefoxSource/mozilla-release/js/src/shell/../frontend/Parser.h:17,
89:42.76                  from /opt/FirefoxSource/mozilla-release/js/src/shell/js.cpp:58:
89:42.76 /opt/FirefoxSource/mozilla-release/js/src/shell/../jscompartment.h: In function 'bool EvalInFrame(JSContext*, unsigned int, jsval*)':
89:42.76 Warning: -Wmaybe-uninitialized in /opt/FirefoxSource/mozilla-release/js/src/jscompartment.h: 'ac.js::AutoCompartment::origin_' may be used uninitialized in this function
89:42.76 /opt/FirefoxSource/mozilla-release/js/src/shell/../jscompartment.h:157:31: warning: 'ac.js::AutoCompartment::origin_' may be used uninitialized in this function [-Wmaybe-uninitialized]
89:42.76 /opt/FirefoxSource/mozilla-release/js/src/shell/js.cpp:2775:37: note: 'ac.js::AutoCompartment::origin_' was declared here
89:42.76 In file included from /opt/FirefoxSource/mozilla-release/js/src/shell/../jscompartmentinlines.h:14:0,
89:42.76                  from /opt/FirefoxSource/mozilla-release/js/src/shell/js.cpp:73:
89:42.76 Warning: -Wmaybe-uninitialized in /opt/FirefoxSource/mozilla-release/js/src/jscntxtinlines.h: 'ac.js::AutoCompartment::cx_' may be used uninitialized in this function
89:42.76 /opt/FirefoxSource/mozilla-release/js/src/shell/../jscntxtinlines.h:413:29: warning: 'ac.js::AutoCompartment::cx_' may be used uninitialized in this function [-Wmaybe-uninitialized]
89:42.76 /opt/FirefoxSource/mozilla-release/js/src/shell/js.cpp:2775:37: note: 'ac.js::AutoCompartment::cx_' was declared here
89:42.76 In file included from /opt/FirefoxSource/mozilla-release/js/src/shell/../jsweakmap.h:10:0,
89:42.76                  from /opt/FirefoxSource/mozilla-release/js/src/shell/../vm/ScopeObject.h:12,
89:42.76                  from /opt/FirefoxSource/mozilla-release/js/src/shell/../frontend/SharedContext.h:19,
89:42.76                  from /opt/FirefoxSource/mozilla-release/js/src/shell/../frontend/FullParseHandler.h:13,
89:42.76                  from /opt/FirefoxSource/mozilla-release/js/src/shell/../frontend/Parser.h:17,
89:42.76                  from /opt/FirefoxSource/mozilla-release/js/src/shell/js.cpp:58:
89:42.76 /opt/FirefoxSource/mozilla-release/js/src/shell/../jscompartment.h: In function 'bool Evaluate(JSContext*, unsigned int, jsval*)':
89:42.76 Warning: -Wmaybe-uninitialized in /opt/FirefoxSource/mozilla-release/js/src/jscompartment.h: '*((void*)(& ancx)+24).js::AutoCompartment::origin_' may be used uninitialized in this function
89:42.76 /opt/FirefoxSource/mozilla-release/js/src/shell/../jscompartment.h:157:31: warning: '*((void*)(& ancx)+24).js::AutoCompartment::origin_' may be used uninitialized in this function [-Wmaybe-uninitialized]
89:42.76 /opt/FirefoxSource/mozilla-release/js/src/shell/js.cpp:1229:20: note: '*((void*)(& ancx)+24).js::AutoCompartment::origin_' was declared here
89:42.76 In file included from /opt/FirefoxSource/mozilla-release/js/src/shell/../jscompartmentinlines.h:14:0,
89:42.76                  from /opt/FirefoxSource/mozilla-release/js/src/shell/js.cpp:73:
89:42.76 Warning: -Wmaybe-uninitialized in /opt/FirefoxSource/mozilla-release/js/src/jscntxtinlines.h: '*((void*)(& ancx)+24).js::AutoCompartment::cx_' may be used uninitialized in this function
89:42.76 /opt/FirefoxSource/mozilla-release/js/src/shell/../jscntxtinlines.h:449:53: warning: '*((void*)(& ancx)+24).js::AutoCompartment::cx_' may be used uninitialized in this function [-Wmaybe-uninitialized]
89:42.76 /opt/FirefoxSource/mozilla-release/js/src/shell/js.cpp:1229:20: note: '*((void*)(& ancx)+24).js::AutoCompartment::cx_' was declared here
89:42.76 In file included from /opt/FirefoxSource/mozilla-release/js/src/shell/js.cpp:38:0:
89:42.76 Warning: -Wmaybe-uninitialized in /opt/FirefoxSource/mozilla-release/js/src/jsapi.h: '*((void*)(& ancx)+8).JSAutoRequest::mContext' may be used uninitialized in this function
89:42.76 /opt/FirefoxSource/mozilla-release/js/src/shell/../jsapi.h:1327:32: warning: '*((void*)(& ancx)+8).JSAutoRequest::mContext' may be used uninitialized in this function [-Wmaybe-uninitialized]
89:42.76 /opt/FirefoxSource/mozilla-release/js/src/shell/js.cpp:1229:20: note: '*((void*)(& ancx)+8).JSAutoRequest::mContext' was declared here
89:42.78 jsoptparse.o
89:48.42 gdb-tests.o
89:48.43 test-JSObject.o
89:49.55 test-JSString.o
89:49.94 testBindCallable.o
89:50.53 test-JSSymbol.o
89:51.26 testBug604087.o
89:52.87 pkixbind.o
89:52.89 pkixbuild.o
89:53.24 pkixcert.o
89:53.29 test-Root.o
89:53.87 pkixcheck.o
89:54.22 test-jsid.o
89:54.43 pkixder.o
89:54.66 testCallNonGenericMethodOnProxy.o
89:55.62 In file included from /opt/FirefoxSource/mozilla-release/security/pkix/lib/pkixutil.h:28:0,
89:55.62                  from /opt/FirefoxSource/mozilla-release/security/pkix/lib/pkixcheck.h:29,
89:55.62                  from /opt/FirefoxSource/mozilla-release/security/pkix/lib/pkixcheck.cpp:29:
89:55.62 /opt/FirefoxSource/mozilla-release/security/pkix/lib/pkixder.h: In function 'mozilla::pkix::Result mozilla::pkix::DecodeBasicConstraints(mozilla::pkix::Input&, bool&, long int&)':
89:55.62 Warning: -Wmaybe-uninitialized in /opt/FirefoxSource/mozilla-release/security/pkix/lib/pkixder.h: 'parsedValue' may be used uninitialized in this function
89:55.62 /opt/FirefoxSource/mozilla-release/security/pkix/lib/pkixder.h:396:22: warning: 'parsedValue' may be used uninitialized in this function [-Wmaybe-uninitialized]
89:55.62 /opt/FirefoxSource/mozilla-release/security/pkix/lib/pkixder.h:391:11: note: 'parsedValue' was declared here
89:55.64 pkixnss.o
89:55.72 test-jsval.o
89:56.24 pkixocsp.o
89:56.29 testChromeBuffer.o
89:56.65 test-prettyprinters.o
89:57.24 /opt/FirefoxSource/mozilla-release/security/pkix/lib/pkixocsp.cpp: In function 'mozilla::pkix::Result mozilla::pkix::BasicResponse(mozilla::pkix::Input&, mozilla::pkix::Context&)':
89:57.24 Warning: -Wmaybe-uninitialized in /opt/FirefoxSource/mozilla-release/security/pkix/lib/pkixocsp.cpp: 'version' may be used uninitialized in this function
89:57.24 /opt/FirefoxSource/mozilla-release/security/pkix/lib/pkixocsp.cpp:470:3: warning: 'version' may be used uninitialized in this function [-Wmaybe-uninitialized]
89:57.24 /opt/FirefoxSource/mozilla-release/security/pkix/lib/pkixocsp.cpp:465:16: note: 'version' was declared here
89:57.25 AppData.o
89:57.25 FileUtils.o
89:57.50 typedef-printers.o
89:57.61 nsArrayEnumerator.o
89:58.15 nsArrayUtils.o
89:58.66 nsCategoryCache.o
89:58.68 GenericModule.o
89:58.69 nsStringAPI.o
89:58.74 nsClassInfoImpl.o
89:58.90 nsCOMArray.o
89:59.19 AppData.o
89:59.24 nsComponentManagerUtils.o
89:59.79 TestFileUtils.o
89:59.80 TestGCPostBarriers.o
90:00.30 nsCOMPtr.o
90:00.46 BlockingResourceBase.o
90:00.74 nsCRTGlue.o
90:00.85 testClassGetter.o
90:00.96 nsCycleCollectionParticipant.o
90:01.03 DeadlockDetector.o
90:01.26 nsDeque.o
90:01.30 FileUtils.o
90:01.64 GenericFactory.o
90:01.87 nsEnumeratorUtils.o
90:02.13 nsID.o
90:02.20 nsArrayEnumerator.o
90:02.43 nsIInterfaceRequestorUtils.o
90:02.48 nsArrayUtils.o
90:02.77 nsINIParser.o
90:02.88 nsCOMArray.o
90:03.12 nsISupportsImpl.o
90:03.22 nsCOMPtr.o
90:04.06 nsMemory.o
90:04.19 nsCRTGlue.o
90:04.31 nsQuickSort.o
90:04.40 nsCategoryCache.o
90:04.78 nsClassInfoImpl.o
90:04.97 testCloneScript.o
90:04.99 nsTArray.o
90:05.36 nsTHashtable.o
90:05.59 nsComponentManagerUtils.o
90:05.73 nsThreadUtils.o
90:05.76 nsCycleCollectionParticipant.o
90:05.97 nsTObserverArray.o
90:06.26 nsDeque.o
90:06.43 xptcinvoke_arm.o
90:06.44 xptcstubs_arm.o
90:06.62 nsVersionComparator.o
90:06.95 nsVoidArray.o
90:07.09 nsEnumeratorUtils.o
90:07.20 nsWeakReference.o
90:07.44 nsID.o
90:07.92 nsIInterfaceRequestorUtils.o
90:08.00 pldhash.o
90:08.13 TestMinStringAPI.o
90:08.27 nsINIParser.o
90:08.38 nsStringAPI.o
90:08.62 nsISupportsImpl.o
90:08.96 nsXPCOMGlue.o
90:09.20 testConservativeGC.o
90:09.40 TestComponent.o
90:09.50 nsMemory.o
90:09.78 nsProxyRelease.o
90:10.39 TestComponent.o
90:10.43 nsQuickSort.o
90:10.81 TestComponent.o
90:10.86 testContexts.o
90:11.00 nsTArray.o
90:11.19 nsTestSample.o
90:11.40 nsTHashtable.o
90:11.61 testCustomIterator.o
90:11.79 nsTObserverArray.o
90:12.04 nsTextFormatter.o
90:12.40 nsThreadUtils.o
90:13.73 nsVersionComparator.o
90:14.62 nsVoidArray.o
90:14.74 testDebugger.o
90:14.82 testDeepFreeze.o
90:14.86 nsWeakReference.o
90:15.20 nsCollationUnix.o
90:15.22 nsDateTimeFormatUnix.o
90:15.71 pldhash.o
90:16.11 unused.o
90:16.44 nsPosixLocale.o
90:16.87 nsAndroidCharset.o
90:17.45 testDefineGetterSetterNonEnumerable.o
90:17.63 testDefineProperty.o
90:18.66 testEnclosingFunction.o
90:20.54 GreekCasing.o
90:20.55 IrishCasing.o
90:21.07 nsBidiUtils.o
90:21.58 nsSpecialCasingData.o
90:21.83 testErrorCopying.o
90:21.98 nsUnicharUtils.o
90:22.05 nsUnicodeProperties.o
90:22.15 testException.o
90:22.92 testExternalStrings.o
90:24.35 testFindSCCs.o
90:25.60 StreamFunctions.o
90:25.62 ZipWriterModule.o
90:25.72 nsRDFResource.o
90:25.73 nsDeflateConverter.o
90:25.99 WriteArgument.o
90:26.28 nsIconChannel.o
90:26.53 testFreshGlobalEvalRedefinition.o
90:26.55 nsZipDataStream.o
90:27.10 nsZipHeader.o
90:27.51 testFuncCallback.o
90:28.70 nsZipWriter.o
90:31.02 testFunctionProperties.o
90:33.10 nsIconModule.o
90:33.10 nsIconProtocolHandler.o
90:33.98 nsIconURI.o
90:34.01 testGCAllocator.o
90:34.24 testGCExactRooting.o
90:34.71 testGCFinalizeCallback.o
90:35.47 TestCodeGenBinding.o
90:35.48 TestDictionaryBinding.o
90:37.86 testGCHeapPostBarriers.o
90:38.37 testGCOutOfMemory.o
90:38.47 testGCStoreBufferRemoval.o
90:40.03 testHashTable.o
90:40.22 testHashTableInit.o
90:42.79 testIndexToString.o
90:46.15 testIntString.o
90:47.89 testIntTypesABI.o
90:49.55 testIntern.o
90:52.06 testIsInsideNursery.o
90:52.42 testJSEvaluateScript.o
90:52.65 testJitFoldsTo.o
90:55.33 testJitMoveEmitterCycles.o
90:56.00 testJitRValueAlloc.o
90:56.09 testLookup.o
90:57.90 testLooselyEqual.o
90:59.83 testMappedArrayBuffer.o
91:04.16 testNewObject.o
91:06.55 testNullRoot.o
91:11.69 testOOM.o
91:11.96 testObjectEmulatingUndefined.o
91:14.96 testOps.o
91:15.17 testOriginPrincipals.o
91:15.38 testParseJSON.o
91:18.30 testPersistentRooted.o
91:19.83 testProfileStrings.o
91:19.97 testPropCache.o
91:23.73 testRegExp.o
91:25.13 testResolveRecursion.o
91:27.23 ANPAudio.o
91:27.24 ANPBitmap.o
91:27.31 TestExampleGenBinding.o
91:27.42 IndexedDBChild.o
91:27.43 IndexedDBParent.o
91:29.41 testSameValue.o
91:30.09 TestJSImplGenBinding.o
91:31.18 ANPEvent.o
91:31.64 ANPLog.o
91:35.12 testScriptInfo.o
91:36.05 ANPMatrix.o
91:36.51 ANPNativeWindow.o
91:36.88 ANPOpenGL.o
91:38.57 testScriptObject.o
91:40.26 ANPSurface.o
91:43.42 testSetProperty.o
91:45.26 ANPSystem.o
91:45.86 ANPVideo.o
91:48.45 In file included from ../../../dist/include/mozilla/dom/indexedDB/IndexedDatabase.h:14:0,
91:48.45                  from /opt/FirefoxSource/mozilla-release/dom/indexedDB/ipc/IndexedDBParent.h:11,
91:48.45                  from /opt/FirefoxSource/mozilla-release/dom/indexedDB/ipc/IndexedDBParent.cpp:6:
91:48.45 ../../../dist/include/nsAutoPtr.h: In member function 'nsresult mozilla::dom::indexedDB::IndexedDBDatabaseParent::HandleRequestEvent(nsIDOMEvent*, const nsAString_internal&)':
91:48.45 Warning: -Wmaybe-uninitialized in /opt/FirefoxSource/mozilla-release/objdir-droid/dist/include/nsAutoPtr.h: 'database' may be used uninitialized in this function
91:48.45 ../../../dist/include/nsAutoPtr.h:926:5: warning: 'database' may be used uninitialized in this function [-Wmaybe-uninitialized]
91:48.45 /opt/FirefoxSource/mozilla-release/dom/indexedDB/ipc/IndexedDBParent.cpp:417:16: note: 'database' was declared here
91:48.47 testSetPropertyIgnoringNamedGetter.o
91:50.10 ANPWindow.o
91:51.65 TestJSImplInheritanceGenBinding.o
91:52.77 testSourcePolicy.o
91:57.52 testStringBuffer.o
91:57.71 TestTypedefBinding.o
91:58.71 AndroidLocationProvider.o
91:58.72 nsHapticFeedback.o
92:01.19 testStructuredClone.o
92:02.95 TestAudioChannelService.o
92:04.97 testSymbol.o
92:06.39 nptest.o
92:06.40 nptest_droid.o
92:10.45 nptest_utils.o
92:10.82 testToIntWidth.o
92:11.32 nptest_name.o
92:12.16 testTrap.o
92:12.41 nptest.o
92:12.42 nptest_droid.o
92:14.16 MediaEncoder.o
92:14.16 OpusTrackEncoder.o
92:16.01 testTypedArrays.o
92:17.40 nptest_utils.o
92:17.96 TrackEncoder.o
92:18.22 nptest_name.o
92:19.28 GMPChild.o
92:19.29 GMPParent.o
92:22.02 testUTF8.o
92:22.73 GMPPlatform.o
92:25.87 testUncaughtError.o
92:27.82 GMPProcessChild.o
92:29.60 GMPProcessParent.o
92:29.67 testWeakMap.o
92:30.14 testXDR.o
92:32.78 tests.o
92:32.86 GMPService.o
92:35.14 GMPSharedMemManager.o
92:36.54 GMPVideoDecoderChild.o
92:38.66 GMPVideoDecoderParent.o
92:39.51 GMPVideoEncodedFrameImpl.o
92:41.64 GMPVideoEncoderChild.o
92:43.14 GMPVideoEncoderParent.o
92:44.48 GMPVideoHost.o
92:45.77 MediaSource.o
92:45.77 MediaSourceDecoder.o
92:46.27 SourceBuffer.o
92:48.50 GMPVideoPlaneImpl.o
92:50.80 GMPVideoi420FrameImpl.o
92:53.19 SourceBufferList.o
92:53.92 SourceBufferResource.o
92:54.01 OggCodecState.o
92:54.02 OggDecoder.o
92:59.28 AnalyserNode.o
92:59.30 AudioBuffer.o
93:00.04 RawDecoder.o
93:00.06 RawReader.o
93:01.72 OggReader.o
93:06.01 AudioBufferSourceNode.o
93:07.21 AudioContext.o
93:09.26 OggWriter.o
93:09.27 WaveDecoder.o
93:09.29 WaveReader.o
93:13.64 AudioDestinationNode.o
93:13.68 AudioListener.o
93:17.25 OpusParser.o
93:18.75 AudioNode.o
93:20.57 WebMBufferedParser.o
93:20.59 WebMDecoder.o
93:21.82 AudioParam.o
93:22.05 AudioProcessingEvent.o
93:22.05 WebMReader.o
93:23.70 BiquadFilterNode.o
93:27.58 ChannelMergerNode.o
93:27.65 ChannelSplitterNode.o
93:28.16 ConvolverNode.o
93:33.10 DelayBuffer.o
93:33.54 DelayNode.o
93:33.81 DynamicsCompressorNode.o
93:33.92 AndroidMediaDecoder.o
93:33.93 AndroidMediaPluginHost.o
93:37.13 AndroidMediaReader.o
93:39.08 FFTBlock.o
93:39.11 GainNode.o
93:40.46 MediaBufferDecoder.o
93:44.00 MediaElementAudioSourceNode.o
93:44.09 AndroidMediaResourceServer.o
93:44.18 MediaStreamAudioDestinationNode.o
93:44.86 MediaStreamAudioSourceNode.o
93:49.04 OfflineAudioCompletionEvent.o
93:49.88 /opt/FirefoxSource/mozilla-release/content/media/webaudio/MediaBufferDecoder.cpp: In member function 'void mozilla::WebAudioDecodeJob::OnFailure(mozilla::WebAudioDecodeJob::ErrorCode)':
93:49.88 Warning: -Wmaybe-uninitialized in /opt/FirefoxSource/mozilla-release/content/media/webaudio/MediaBufferDecoder.cpp: 'errorMessage' may be used uninitialized in this function
93:49.88 /opt/FirefoxSource/mozilla-release/content/media/webaudio/MediaBufferDecoder.cpp:583:48: warning: 'errorMessage' may be used uninitialized in this function [-Wmaybe-uninitialized]
93:49.90 OscillatorNode.o
93:50.29 MediaEngineDefault.o
93:50.31 PeerIdentity.o
93:52.43 PannerNode.o
93:53.55 PeriodicWave.o
93:54.71 ScriptProcessorNode.o
93:56.94 SpeechSynthesis.o
93:56.95 SpeechSynthesisUtterance.o
93:58.59 ThreeDPoint.o
93:59.45 WaveShaperNode.o
93:59.53 WebAudioUtils.o
94:02.57 SpeechSynthesisVoice.o
94:04.06 SpeechSynthesisChild.o
94:05.32 SpeechGrammar.o
94:05.33 SpeechGrammarList.o
94:06.30 SpeechRecognition.o
94:06.43 SpeechRecognitionAlternative.o
94:07.14 SpeechRecognitionResult.o
94:07.52 SpeechSynthesisParent.o
94:08.71 nsSpeechTask.o
94:11.79 SpeechRecognitionResultList.o
94:12.57 nsSynthVoiceRegistry.o
94:14.19 SpeechStreamListener.o
94:15.98 endpointer.o
94:18.87 energy_endpointer.o
94:19.25 energy_endpointer_params.o
94:19.99 FakeSpeechRecognitionService.o
94:20.30 CDMProxy.o
94:20.31 EMELog.o
94:20.69 MediaKeyError.o
94:20.86 MediaKeyMessageEvent.o
94:22.32 TestAudioCompactor.o
94:22.32 TestTrackEncoder.o
94:22.97 MediaKeyNeededEvent.o
94:24.34 MediaKeySession.o
94:25.59 TestAudioMixer.o
94:25.64 MediaKeys.o
94:26.56 TestTXMgr.o
94:26.57 TestVideoSegment.o
94:30.61 host_ListCSSProperties.o
94:31.16 nsTreeBodyFrame.o
94:31.18 nsTreeBoxObject.o
94:31.85 nsTreeColFrame.o
94:32.33 nsGrid.o
94:32.35 nsGridCell.o
94:37.21 nsGridLayout2.o
94:38.73 In file included from /opt/FirefoxSource/mozilla-release/layout/xul/tree/../nsBox.h:10:0,
94:38.73                  from /opt/FirefoxSource/mozilla-release/layout/xul/tree/../../generic/nsFrame.h:14,
94:38.73                  from /opt/FirefoxSource/mozilla-release/layout/xul/tree/../../generic/nsLeafFrame.h:12,
94:38.73                  from /opt/FirefoxSource/mozilla-release/layout/xul/tree/../nsLeafBoxFrame.h:9,
94:38.73                  from /opt/FirefoxSource/mozilla-release/layout/xul/tree/nsTreeBodyFrame.h:11,
94:38.73                  from /opt/FirefoxSource/mozilla-release/layout/xul/tree/nsTreeBoxObject.cpp:15:
94:38.73 /opt/FirefoxSource/mozilla-release/layout/xul/tree/../../generic/nsIFrame.h: In member function 'nsTreeBodyFrame* nsTreeBoxObject::GetTreeBody(bool)':
94:38.73 Warning: -Wmaybe-uninitialized in /opt/FirefoxSource/mozilla-release/layout/generic/nsIFrame.h: 'frame' may be used uninitialized in this function
94:38.73 /opt/FirefoxSource/mozilla-release/layout/xul/tree/../../generic/nsIFrame.h:487:43: warning: 'frame' may be used uninitialized in this function [-Wmaybe-uninitialized]
94:38.73 /opt/FirefoxSource/mozilla-release/layout/xul/tree/nsTreeBoxObject.cpp:87:13: note: 'frame' was declared here
94:38.74 nsTreeColumns.o
94:39.33 JSStreamWriterTest.o
94:39.34 LulTest.o
94:41.42 nsGridRow.o
94:42.74 ThreadProfileTest.o
94:44.33 jsctypes-test-errno.o
94:44.35 jsctypes-test-finalizer.o
94:44.59 jsctypes-test.o
94:44.84 nsGridRowGroupFrame.o
94:45.57 /opt/FirefoxSource/mozilla-release/layout/xul/tree/nsTreeBodyFrame.cpp: In member function 'void nsTreeBodyFrame::PaintCell(int32_t, nsTreeColumn*, const nsRect&, nsPresContext*, nsRenderingContext&, const nsRect&, nscoord&, nsPoint)':
94:45.57 Warning: -Wmaybe-uninitialized in /opt/FirefoxSource/mozilla-release/layout/xul/tree/nsTreeBodyFrame.cpp: 'color' may be used uninitialized in this function
94:45.57 /opt/FirefoxSource/mozilla-release/layout/xul/tree/nsTreeBodyFrame.cpp:3209:40: warning: 'color' may be used uninitialized in this function [-Wmaybe-uninitialized]
94:45.58 nsTreeContentView.o
94:46.48 nsTreeImageListener.o
94:48.43 TestStartupCache.o
94:48.91 nsGridRowGroupLayout.o
94:50.20 nsGridRowLayout.o
94:53.39 nsTreeSelection.o
94:53.42 nsGridRowLeafFrame.o
94:54.11 nsTreeStyleCache.o
94:54.20 nsGridRowLeafLayout.o
94:58.09 nsTreeUtils.o
94:58.33 StaticXULComponentsEnd.o
95:00.26 nssgtest.o
95:00.27 pkixbuild_tests.o
95:00.29 pkixtestutil.o
95:01.30 pkixcert_extension_tests.o
95:01.62 Biquad.o
95:01.62 DirectConvolver.o
95:02.20 TestAudioEventTimeline.o
95:02.78 DynamicsCompressor.o
95:03.52 pkixcert_signature_algorithm_tests.o
95:03.81 DynamicsCompressorKernel.o
95:04.95 FFTConvolver.o
95:05.41 pkixcheck_CheckKeyUsage_tests.o
95:06.28 HRTFDatabase.o
95:07.44 pkixcheck_CheckValidity_tests.o
95:07.78 HRTFDatabaseLoader.o
95:09.66 pkixder_input_tests.o
95:10.07 pkixder_pki_types_tests.o
95:11.68 HRTFElevation.o
95:12.76 HRTFKernel.o
95:13.50 pkixder_universal_types_tests.o
95:17.55 HRTFPanner.o
95:19.40 PeriodicWave.o
95:20.56 pkixocsp_CreateEncodedOCSPRequest_tests.o
95:20.78 pkixocsp_VerifyEncodedOCSPResponse.o
95:23.65 Reverb.o
95:25.20 ReverbAccumulationBuffer.o
95:29.61 ReverbConvolver.o
95:29.65 ReverbConvolverStage.o
95:31.60 ReverbInputBuffer.o
95:32.07 ZeroPole.o
95:39.58 libstlport_static.a
95:40.85 annotationProcessors.jar
95:43.35 Note: /opt/FirefoxSource/mozilla-release/build/annotationProcessors/utils/GeneratableElementIterator.java uses unchecked or unsafe operations.
95:43.35 Note: Recompile with -Xlint:unchecked for details.
95:43.95 libmfbt.a.desc
95:44.09 TestArrayUtils
95:44.09 TestAtomics
95:44.11 TestBinarySearch
95:44.12 TestBloomFilter
95:44.13 TestCasting
95:44.88 TestCeilingFloor
95:44.90 TestCheckedInt
95:44.92 TestCountPopulation
95:44.93 TestCountZeroes
95:45.03 TestEndian
95:45.15 TestEnumSet
95:45.16 TestFloatingPoint
95:45.24 TestIntegerPrintfMacros
95:45.33 TestMacroArgs
95:45.36 TestMacroForEach
95:45.44 TestPair
95:45.47 TestRollingMean
95:45.59 TestSHA1
95:45.62 TestTypedEnum
95:45.62 TestTypeTraits
95:45.80 TestUniquePtr
95:45.82 TestWeakPtr
95:45.83 TestPoisonArea
95:46.35 libother-licenses_android.a.desc
95:46.44 libjemalloc.a.desc
95:46.52 libmemory.a.desc
95:46.63 liblinker.a.desc
95:46.67 szip
95:47.03 libmozglue_android.a.desc
95:47.12 libmozglue.so
95:53.27 TestZip
95:53.44 libmozalloc.so
95:54.32 libmozsqlite3.a.desc
95:54.41 libmedia_libjpeg.a.desc
95:54.54 libmedia_libtremor_lib.a.desc
95:54.86 libmedia_libopus.a.desc
95:55.18 libmedia_libnestegg_src.a.desc
95:55.53 libmedia_libvpx.a.desc
95:55.79 libmozpng.a.desc
95:55.91 libmedia_kiss_fft.a.desc
95:56.00 libcubeb.a.desc
95:56.09 libmedia_libogg.a.desc
95:56.20 libmedia_libtheora_lib.a.desc
95:56.29 libspeex.a.desc
95:56.45 libmedia_libstagefright.a.desc
95:56.69 libmedia_libsoundtouch_src.a.desc
95:56.93 /opt/FirefoxSource/mozilla-release/security/build/nss.def: WARNING: no preprocessor directives found
95:56.98 /opt/FirefoxSource/mozilla-release/security/build/nspr-dummy.def: WARNING: no preprocessor directives found
95:57.35 quickder.c: In function 'DecodeItem':
95:57.35 quickder.c:611:12: warning: variable 'optional' set but not used [-Wunused-but-set-variable]
95:57.39 sechash.c: In function 'HASH_ResultLen':
95:57.39 sechash.c:263:5: warning: comparison of unsigned expression < 0 is always false [-Wtype-limits]
95:57.39 sechash.c: In function 'HASH_HashBuf':
95:57.39 sechash.c:288:5: warning: comparison of unsigned expression < 0 is always false [-Wtype-limits]
95:57.39 sechash.c: In function 'HASH_Create':
95:57.39 sechash.c:310:5: warning: comparison of unsigned expression < 0 is always false [-Wtype-limits]
95:58.01 derenc.c: In function 'der_encode':
95:58.02 derenc.c:282:22: warning: variable 'optional' set but not used [-Wunused-but-set-variable]
95:58.48 pk11akey.c: In function 'pk11_get_Decoded_ECPoint':
95:58.48 pk11akey.c:406:26: warning: comparison between signed and unsigned integer expressions [-Wsign-compare]
95:58.48 pk11akey.c:420:63: warning: comparison between signed and unsigned integer expressions [-Wsign-compare]
95:59.35 nssb64e.c: In function 'NSSBase64_EncodeItem_Util':
95:59.35 nssb64e.c:684:15: warning: 'out_len' may be used uninitialized in this function [-Wmaybe-uninitialized]
95:59.93 ocsp.c: In function 'ocsp_RemoveCacheItem':
95:59.93 ocsp.c:562:12: warning: variable 'couldRemoveFromHashTable' set but not used [-Wunused-but-set-variable]
96:00.36 alg1485.c: In function 'cert_AVAOidTagToMaxLen':
96:00.36 alg1485.c:162:57: warning: signed and unsigned type in conditional expression [-Wsign-compare]
96:00.36 alg1485.c: In function 'AppendAVA':
96:00.36 alg1485.c:963:40: warning: signed and unsigned type in conditional expression [-Wsign-compare]
96:00.49 pk11cert.c: In function 'pk11_fastCert':
96:00.49 pk11cert.c:231:14: warning: variable 'status' set but not used [-Wunused-but-set-variable]
96:00.49 pk11cert.c: In function 'PK11_MakeCertFromHandle':
96:00.49 pk11cert.c:297:12: warning: variable 'swapNickname' set but not used [-Wunused-but-set-variable]
96:00.49 pk11cert.c:296:12: warning: variable 'isFortezzaRootCA' set but not used [-Wunused-but-set-variable]
96:00.49 pk11cert.c: In function 'PK11_TraverseCertsForNicknameInSlot':
96:00.49 pk11cert.c:2012:28: warning: variable 'pk11cb' set but not used [-Wunused-but-set-variable]
96:00.49 pk11cert.c: In function 'PK11_FindCertFromDERCertItem':
96:00.49 pk11cert.c:2156:21: warning: unused variable 'td' [-Wunused-variable]
96:01.03 certhigh.c: In function 'CERT_MatchNickname':
96:01.03 certhigh.c:28:9: warning: variable 'len' set but not used [-Wunused-but-set-variable]
96:01.51 certdb.c: In function 'cert_VerifySubjectAltName':
96:01.51 certdb.c:1428:18: warning: variable 'hnLen' set but not used [-Wunused-but-set-variable]
96:01.51 certdb.c: In function 'CERT_ImportCerts':
96:01.51 certdb.c:2440:15: warning: variable 'rv' set but not used [-Wunused-but-set-variable]
96:01.51 certdb.c: In function 'CERT_UnlockCertRefCount':
96:01.51 certdb.c:2890:14: warning: variable 'prstat' set but not used [-Wunused-but-set-variable]
96:01.51 certdb.c: In function 'CERT_UnlockCertTrust':
96:01.51 certdb.c:2970:14: warning: variable 'prstat' set but not used [-Wunused-but-set-variable]
96:03.31 crl.c: In function 'crl_storeCRL':
96:03.31 crl.c:630:15: warning: variable 'rv' set but not used [-Wunused-but-set-variable]
96:03.31 crl.c: In function 'cert_CheckCertRevocationStatus':
96:03.31 crl.c:2688:27: warning: unused variable 'rv2' [-Wunused-variable]
96:03.31 crl.c: In function 'cert_CacheCRLByGeneralName':
96:03.31 crl.c:3045:32: warning: variable 'rv2' set but not used [-Wunused-but-set-variable]
96:03.46 secoid.c: In function 'SECOID_Init':
96:03.46 secoid.c:1922:19: warning: variable 'c' set but not used [-Wunused-but-set-variable]
96:03.60 certvfypkix.c: In function 'setRevocationMethod':
96:03.60 certvfypkix.c:1422:17: warning: comparison between signed and unsigned integer expressions [-Wsign-compare]
96:04.47 In file included from pk11load.c:26:0:
96:04.47 debug_module.c: In function 'log_handle':
96:04.47 debug_module.c:339:28: warning: comparison between signed and unsigned integer expressions [-Wsign-compare]
96:04.47 debug_module.c:343:28: warning: comparison between signed and unsigned integer expressions [-Wsign-compare]
96:04.47 pk11load.c: In function 'SECMOD_UnloadModule':
96:04.47 pk11load.c:592:28: warning: unused variable 'status' [-Wunused-variable]
96:04.92 utilmod.c: In function 'nssutil_DeleteSecmodDBEntry.isra.1':
96:04.92 utilmod.c:545:12: warning: 'lib_len' may be used uninitialized in this function [-Wmaybe-uninitialized]
96:05.64 pk11merge.c: In function 'pk11_matchAcrossTokens':
96:05.64 pk11merge.c:100:32: warning: comparison between signed and unsigned integer expressions [-Wsign-compare]
96:05.66 certificate.c: In function 'nssCertificateList_DoCallback':
96:05.66 certificate.c:898:14: warning: variable 'nssrv' set but not used [-Wunused-but-set-variable]
96:05.72 utilpars.c: In function 'nssutil_mkSlotFlags':
96:05.72 utilpars.c:679:17: warning: comparison between signed and unsigned integer expressions [-Wsign-compare]
96:05.72 utilpars.c: In function 'nssutil_mkCipherFlags':
96:05.72 utilpars.c:891:17: warning: comparison between signed and unsigned integer expressions [-Wsign-compare]
96:05.72 utilpars.c:910:17: warning: comparison between signed and unsigned integer expressions [-Wsign-compare]
96:06.82 trustdomain.c: In function 'NSSTrustDomain_TraverseCertificates':
96:06.82 trustdomain.c:998:14: warning: variable 'status' set but not used [-Wunused-but-set-variable]
96:07.29 tdcache.c: In function 'add_cert_to_cache':
96:07.29 tdcache.c:773:9: warning: variable 'handle' set but not used [-Wunused-but-set-variable]
96:07.29 tdcache.c: In function 'nssTrustDomain_RemoveCertFromCacheLOCKED':
96:07.29 tdcache.c:272:16: warning: 'nickname' may be used uninitialized in this function [-Wmaybe-uninitialized]
96:07.29 tdcache.c:332:14: note: 'nickname' was declared here
96:07.57 pk11obj.c: In function 'PK11_MatchItem':
96:07.57 pk11obj.c:1799:72: warning: comparison between signed and unsigned integer expressions [-Wsign-compare]
96:07.57 pk11obj.c:1784:22: warning: variable 'parent' set but not used [-Wunused-but-set-variable]
96:07.82 devtoken.c: In function 'nssToken_TraverseCertificates':
96:07.82 devtoken.c:1469:14: warning: variable 'status' set but not used [-Wunused-but-set-variable]
96:08.19 pk11pars.c: In function 'secmod_ParseModuleSpecForTokens':
96:08.19 pk11pars.c:364:47: warning: suggest braces around empty body in an 'else' statement [-Wempty-body]
96:08.19 pk11pars.c:366:47: warning: suggest braces around empty body in an 'else' statement [-Wempty-body]
96:08.19 pk11pars.c:375:6: warning: suggest braces around empty body in an 'else' statement [-Wempty-body]
96:08.19 pk11pars.c:384:7: warning: suggest braces around empty body in an 'else' statement [-Wempty-body]
96:08.19 pk11pars.c:393:7: warning: suggest braces around empty body in an 'else' statement [-Wempty-body]
96:08.19 pk11pars.c:402:7: warning: suggest braces around empty body in an 'else' statement [-Wempty-body]
96:08.19 pk11pars.c: In function 'secmod_MkAppendTokensList':
96:08.19 pk11pars.c:767:13: warning: comparison between signed and unsigned integer expressions [-Wsign-compare]
96:08.19 pk11pars.c:804:13: warning: comparison between signed and unsigned integer expressions [-Wsign-compare]
96:08.41 ckhelper.c: In function 'nssCKObject_GetAttributes':
96:08.41 ckhelper.c:139:36: warning: comparison between signed and unsigned integer expressions [-Wsign-compare]
96:08.42 ckhelper.c: In function 'nssCryptokiTrust_GetAttributes':
96:08.42 ckhelper.c:442:36: warning: comparison between signed and unsigned integer expressions [-Wsign-compare]
96:08.61 pkibase.c: In function 'nssPKIObjectCollection_Traverse':
96:08.61 pkibase.c:906:14: warning: variable 'status' set but not used [-Wunused-but-set-variable]
96:08.61 pkibase.c: In function 'nssCertificateCollection_Create':
96:08.61 pkibase.c:1060:14: warning: variable 'status' set but not used [-Wunused-but-set-variable]
96:08.61 pkibase.c: In function 'nssCRLCollection_Create':
96:08.61 pkibase.c:1167:14: warning: variable 'status' set but not used [-Wunused-but-set-variable]
96:09.31 pk11pk12.c: In function 'PK11_ImportPrivateKeyInfoAndReturnKey':
96:09.31 pk11pk12.c:425:17: warning: variable 'keyType' set but not used [-Wunused-but-set-variable]
96:09.74 pk11pqg.c: In function 'PK11_PQG_ParamGenSeedLen':
96:09.74 pk11pqg.c:230:56: warning: signed and unsigned type in conditional expression [-Wsign-compare]
96:09.75 pk11pqg.c: In function 'PK11_PQG_ParamGen':
96:09.75 pk11pqg.c:241:56: warning: signed and unsigned type in conditional expression [-Wsign-compare]
96:09.75 pk11pqg.c: In function 'PK11_PQG_VerifyParams':
96:09.75 pk11pqg.c:295:19: warning: comparison between signed and unsigned integer expressions [-Wsign-compare]
96:10.17 pki3hack.c: In function 'DeleteCertTrustMatchingSlot':
96:10.17 pki3hack.c:1275:27: warning: comparison between signed and unsigned integer expressions [-Wsign-compare]
96:10.17 pki3hack.c: In function 'STAN_DeleteCertTrustMatchingSlot':
96:10.17 pki3hack.c:1333:19: warning: comparison between signed and unsigned integer expressions [-Wsign-compare]
96:11.16 list.c: In function 'nssList_Add':
96:11.17 list.c:220:14: warning: variable 'nssrv' set but not used [-Wunused-but-set-variable]
96:11.54 pk11skey.c: In function 'pk11_TokenKeyGenWithFlagsAndKeyType':
96:11.54 pk11skey.c:926:17: warning: comparison between signed and unsigned integer expressions [-Wsign-compare]
96:11.54 pk11skey.c: In function 'pk11_HandUnwrap':
96:11.54 pk11skey.c:2296:40: warning: signed and unsigned type in conditional expression [-Wsign-compare]
96:12.89 pk11slot.c: In function 'PK11_InitToken':
96:12.89 pk11slot.c:1108:11: warning: variable 'tmp' set but not used [-Wunused-but-set-variable]
96:12.89 pk11slot.c: In function 'PK11_InitSlot':
96:12.89 pk11slot.c:1352:11: warning: variable 'tmp' set but not used [-Wunused-but-set-variable]
96:12.89 pk11slot.c: In function 'PK11_GetBestSlotMultipleWithAttributes':
96:12.90 pk11slot.c:2076:17: warning: comparison between signed and unsigned integer expressions [-Wsign-compare]
96:12.90 pk11slot.c:2094:18: warning: comparison between signed and unsigned integer expressions [-Wsign-compare]
96:12.90 pk11slot.c: In function 'PK11_ResetToken':
96:12.90 pk11slot.c:2317:22: warning: comparison between signed and unsigned integer expressions [-Wsign-compare]
96:12.90 pk11slot.c:2322:22: warning: comparison between signed and unsigned integer expressions [-Wsign-compare]
96:13.83 pk11util.c: In function 'SECMOD_UpdateSlotList':
96:13.83 pk11util.c:931:15: warning: comparison between signed and unsigned integer expressions [-Wsign-compare]
96:15.27 pkix_revocationchecker.c: In function 'PKIX_RevocationChecker_Check':
96:15.27 pkix_revocationchecker.c:347:25: warning: comparison between signed and unsigned integer expressions [-Wsign-compare]
96:16.05 pkix_tools.c: In function 'pkix_i2hex':
96:16.05 pkix_tools.c:482:9: warning: comparison is always true due to limited range of data type [-Wtype-limits]
96:17.79 pkix_errpaths.c: In function 'PKIX_DoReturn':
96:17.79 pkix_errpaths.c:58:2: warning: suggest braces around empty body in an 'if' statement [-Wempty-body]
96:18.93 pkix_build.c: In function 'pkix_Build_SelectCertsFromTrustAnchors':
96:18.93 pkix_build.c:1541:38: warning: comparison between signed and unsigned integer expressions [-Wsign-compare]
96:21.97 pkix_pl_crl.c: In function 'pkix_pl_CRL_ToString':
96:21.97 pkix_pl_crl.c:455:58: warning: 'crlVersion' may be used uninitialized in this function [-Wmaybe-uninitialized]
96:21.97 pkix_pl_crl.c:354:21: note: 'crlVersion' was declared here
96:21.98 pkix_pl_lifecycle.c: In function 'pkix_pl_lifecycle_ObjectLeakCheck':
96:21.98 pkix_pl_lifecycle.c:87:55: warning: comparison between signed and unsigned integer expressions [-Wsign-compare]
96:21.98 pkix_pl_lifecycle.c: In function 'PKIX_PL_Shutdown':
96:21.98 pkix_pl_lifecycle.c:248:21: warning: variable 'numLeakedObjects' set but not used [-Wunused-but-set-variable]
96:22.03 pkix_pl_cert.c: In function 'PKIX_PL_Cert_Create':
96:22.03 pkix_pl_cert.c:1518:22: warning: variable 'copyDER' set but not used [-Wunused-but-set-variable]
96:23.06 nssinit.c: In function 'NSS_VersionCheck':
96:23.06 nssinit.c:1250:19: warning: variable 'c' set but not used [-Wunused-but-set-variable]
96:23.07 pkix_pl_httpdefaultclient.c: In function 'pkix_pl_HttpDefaultClient_HdrCheckComplete':
96:23.07 pkix_pl_httpdefaultclient.c:268:32: warning: comparison between signed and unsigned integer expressions [-Wsign-compare]
96:23.08 pkix_pl_httpdefaultclient.c:285:41: warning: comparison between signed and unsigned integer expressions [-Wsign-compare]
96:23.08 pkix_pl_httpdefaultclient.c:293:40: warning: comparison between signed and unsigned integer expressions [-Wsign-compare]
96:23.08 pkix_pl_httpdefaultclient.c: In function 'pkix_pl_HttpDefaultClient_RecvBody':
96:23.08 pkix_pl_httpdefaultclient.c:925:39: warning: comparison between signed and unsigned integer expressions [-Wsign-compare]
96:23.08 pkix_pl_httpdefaultclient.c:940:31: warning: comparison between signed and unsigned integer expressions [-Wsign-compare]
96:23.08 pkix_pl_httpdefaultclient.c:945:31: warning: comparison between signed and unsigned integer expressions [-Wsign-compare]
96:23.08 pkix_pl_httpdefaultclient.c:951:38: warning: comparison between signed and unsigned integer expressions [-Wsign-compare]
96:23.08 pkix_pl_httpdefaultclient.c:995:39: warning: comparison between signed and unsigned integer expressions [-Wsign-compare]
96:23.08 pkix_pl_httpdefaultclient.c:1005:43: warning: comparison between signed and unsigned integer expressions [-Wsign-compare]
96:23.08 pkix_pl_httpdefaultclient.c: In function 'pkix_pl_HttpDefaultClient_KeepAliveSession':
96:23.08 pkix_pl_httpdefaultclient.c:1135:36: warning: variable 'client' set but not used [-Wunused-but-set-variable]
96:23.08 pkix_pl_httpdefaultclient.c: In function 'pkix_pl_HttpDefaultClient_TrySendAndReceive':
96:23.08 pkix_pl_httpdefaultclient.c:1429:63: warning: comparison between signed and unsigned integer expressions [-Wsign-compare]
96:23.08 pkix_pl_httpdefaultclient.c: In function 'pkix_pl_HttpDefaultClient_Cancel':
96:23.08 pkix_pl_httpdefaultclient.c:1487:36: warning: variable 'client' set but not used [-Wunused-but-set-variable]
96:24.15 pkix_pl_object.c: In function 'pkix_pl_Object_GetHeader':
96:24.15 pkix_pl_object.c:115:34: warning: comparison between signed and unsigned integer expressions [-Wsign-compare]
96:25.18 pkix_pl_ldaprequest.c: In function 'pkix_pl_LdapRequest_Destroy':
96:25.18 pkix_pl_ldaprequest.c:266:30: warning: variable 'ldapRq' set but not used [-Wunused-but-set-variable]
96:26.52 dtlscon.c: In function 'ssl3_DisableNonDTLSSuites':
96:26.52 dtlscon.c:107:19: warning: unused variable 'rv' [-Wunused-variable]
96:26.52 dtlscon.c: In function 'dtls_HandleHandshake':
96:26.52 dtlscon.c:399:37: warning: comparison between signed and unsigned integer expressions [-Wsign-compare]
96:26.52 dtlscon.c:428:48: warning: comparison between signed and unsigned integer expressions [-Wsign-compare]
96:26.52 dtlscon.c: In function 'dtls_TransmitMessageFlight':
96:26.52 dtlscon.c:679:60: warning: comparison between signed and unsigned integer expressions [-Wsign-compare]
96:26.52 dtlscon.c:679:120: warning: signed and unsigned type in conditional expression [-Wsign-compare]
96:26.52 dtlscon.c:717:26: warning: comparison between signed and unsigned integer expressions [-Wsign-compare]
96:26.52 dtlscon.c: In function 'dtls_SetMTU':
96:26.52 dtlscon.c:952:19: warning: comparison between signed and unsigned integer expressions [-Wsign-compare]
96:26.88 pkix_pl_ldapdefaultclient.c: In function 'pkix_pl_LdapDefaultClient_VerifyBindResponse':
96:26.88 pkix_pl_ldapdefaultclient.c:371:21: warning: '*((void *)&msg+16).resultCode.data' may be used uninitialized in this function [-Wmaybe-uninitialized]
96:26.88 pkix_pl_ldapdefaultclient.c:354:21: note: '*((void *)&msg+16).resultCode.data' was declared here
96:27.47 pkix_pl_pk11certstore.c: In function 'NameCacheHasFetchedCrlInfo':
96:27.47 pkix_pl_pk11certstore.c:382:22: warning: variable 'cert' set but not used [-Wunused-but-set-variable]
96:27.47 pkix_pl_pk11certstore.c: In function 'RemovePartitionedDpsFromList':
96:27.47 pkix_pl_pk11certstore.c:701:20: warning: comparison between signed and unsigned integer expressions [-Wsign-compare]
96:27.47 pkix_pl_pk11certstore.c: In function 'DownloadCrl':
96:27.47 pkix_pl_pk11certstore.c:782:16: warning: variable 'savedError' set but not used [-Wunused-but-set-variable]
96:28.03 pkix_pl_publickey.c: In function 'pkix_pl_PublicKey_Hashcode':
96:28.03 pkix_pl_publickey.c:214:21: warning: variable 'fullHash' set but not used [-Wunused-but-set-variable]
96:28.63 pkix_pl_x500name.c:37:1: warning: 'pkix_pl_X500Name_ToString_Helper' defined but not used [-Wunused-function]
96:29.13 certread.c: In function 'CERT_DecodeCertPackage':
96:29.14 certread.c:419:16: warning: comparison between signed and unsigned integer expressions [-Wsign-compare]
96:29.14 certread.c:447:13: warning: comparison between signed and unsigned integer expressions [-Wsign-compare]
96:29.90 p12e.c: In function 'sec_PKCS12CreateSafeBag':
96:29.90 p12e.c:698:12: warning: variable 'setName' set but not used [-Wunused-but-set-variable]
96:29.90 p12e.c: In function 'sec_pkcs12_encoder_start_context':
96:29.90 p12e.c:1535:12: warning: variable 'rv' set but not used [-Wunused-but-set-variable]
96:30.69 p7decode.c: In function 'sec_pkcs7_verify_signature':
96:30.69 p7decode.c:1293:21: warning: variable 'crls' set but not used [-Wunused-but-set-variable]
96:30.80 p7encode.c: In function 'sec_pkcs7_encoder_start_encrypt':
96:30.80 p7encode.c:62:18: warning: variable 'wincx' set but not used [-Wunused-but-set-variable]
96:30.91 ssl3con.c: In function 'ssl3_CompressMACEncryptRecord':
96:30.91 ssl3con.c:2559:12: warning: comparison between signed and unsigned integer expressions [-Wsign-compare]
96:30.91 ssl3con.c: In function 'ssl3_FlushHandshakeMessages':
96:30.91 ssl3con.c:3122:19: warning: comparison between signed and unsigned integer expressions [-Wsign-compare]
96:30.91 ssl3con.c: In function 'ssl3_HandleClientHello':
96:30.91 ssl3con.c:7782:23: warning: comparison between signed and unsigned integer expressions [-Wsign-compare]
96:30.91 ssl3con.c:8286:28: warning: comparison between signed and unsigned integer expressions [-Wsign-compare]
96:30.91 ssl3con.c: In function 'ssl3_HandleRSAClientKeyExchange':
96:30.91 ssl3con.c:9211:13: warning: variable 'pmsItem' set but not used [-Wunused-but-set-variable]
96:30.91 ssl3con.c:9207:12: warning: variable 'isTLS' set but not used [-Wunused-but-set-variable]
96:30.91 ssl3con.c: In function 'ssl3_HandleCertificateStatus':
96:30.91 ssl3con.c:9779:13: warning: comparison between signed and unsigned integer expressions [-Wsign-compare]
96:30.91 ssl3con.c: In function 'ssl3_HandleHandshakeMessage':
96:30.91 ssl3con.c:6951:22: warning: 'preferSha1' may be used uninitialized in this function [-Wmaybe-uninitialized]
96:30.91 ssl3con.c:6917:12: note: 'preferSha1' was declared here
96:30.91 ssl3con.c: In function 'ssl3_HandleRecord':
96:30.91 ssl3con.c:11589:21: warning: 'dtls_seq_num' may be used uninitialized in this function [-Wmaybe-uninitialized]
96:30.91 ssl3con.c:11309:14: note: 'dtls_seq_num' was declared here
96:31.16 p7local.c: In function 'sec_PKCS7Decrypt':
96:31.16 p7local.c:556:28: warning: comparison between signed and unsigned integer expressions [-Wsign-compare]
96:31.28 ssl3gthr.c: In function 'ssl3_GatherData':
96:31.28 ssl3gthr.c:75:9: warning: comparison between signed and unsigned integer expressions [-Wsign-compare]
96:31.47 sslauth.c: In function 'SSL_AuthCertificate':
96:31.47 sslauth.c:267:18: warning: unused variable 'error' [-Wunused-variable]
96:31.86 cmscipher.c: In function 'NSS_CMSCipherContext_Decrypt':
96:31.86 cmscipher.c:525:28: warning: comparison between signed and unsigned integer expressions [-Wsign-compare]
96:32.74 basicutil.c: In function 'SECU_PrintPRandOSError':
96:32.74 basicutil.c:628:30: warning: comparison between signed and unsigned integer expressions [-Wsign-compare]
96:32.74 basicutil.c:632:30: warning: comparison between signed and unsigned integer expressions [-Wsign-compare]
96:32.74 basicutil.c: In function 'SECU_SECItemHexStringToBinary':
96:32.74 basicutil.c:705:16: warning: comparison between signed and unsigned integer expressions [-Wsign-compare]
96:32.74 basicutil.c:716:16: warning: comparison between signed and unsigned integer expressions [-Wsign-compare]
96:32.74 basicutil.c: In function 'SECU_PrintAsHex':
96:32.74 basicutil.c:286:13: warning: 'column' may be used uninitialized in this function [-Wmaybe-uninitialized]
96:33.00 crmfpop.c: In function 'CRMF_CertReqMsgSetRAVerifiedPOP':
96:33.00 crmfpop.c:36:14: warning: variable 'dummy' set but not used [-Wunused-but-set-variable]
96:33.00 crmfpop.c: In function 'crmf_generic_encoder_callback':
96:33.00 crmfpop.c:119:38: warning: comparison between signed and unsigned integer expressions [-Wsign-compare]
96:33.00 crmfpop.c: In function 'crmf_encode_popoprivkey':
96:33.00 crmfpop.c:349:33: warning: comparison between signed and unsigned integer expressions [-Wsign-compare]
96:33.02 sslcon.c: In function 'ssl2_SendClear':
96:33.02 sslcon.c:865:17: warning: comparison between signed and unsigned integer expressions [-Wsign-compare]
96:33.02 sslcon.c:894:19: warning: comparison between signed and unsigned integer expressions [-Wsign-compare]
96:33.02 sslcon.c: In function 'ssl2_SendStream':
96:33.02 sslcon.c:944:13: warning: comparison between signed and unsigned integer expressions [-Wsign-compare]
96:33.02 sslcon.c:991:19: warning: comparison between signed and unsigned integer expressions [-Wsign-compare]
96:33.02 sslcon.c: In function 'ssl2_SendBlock':
96:33.02 sslcon.c:1058:13: warning: comparison between signed and unsigned integer expressions [-Wsign-compare]
96:33.02 sslcon.c: In function 'ssl2_ServerSetupSessionCypher':
96:33.02 sslcon.c:1624:15: warning: comparison between signed and unsigned integer expressions [-Wsign-compare]
96:33.02 sslcon.c:1648:20: warning: comparison between signed and unsigned integer expressions [-Wsign-compare]
96:33.02 sslcon.c: In function 'ssl2_HandleMessage':
96:33.02 sslcon.c:2498:9: warning: variable 'rv2' set but not used [-Wunused-but-set-variable]
96:33.02 sslcon.c: In function 'ssl2_HandleServerHelloMessage':
96:33.02 sslcon.c:2802:51: warning: comparison between signed and unsigned integer expressions [-Wsign-compare]
96:33.02 sslcon.c:2813:16: warning: comparison between signed and unsigned integer expressions [-Wsign-compare]
96:33.02 sslcon.c:2815:23: warning: comparison between signed and unsigned integer expressions [-Wsign-compare]
96:33.02 sslcon.c:2815:65: warning: signed and unsigned type in conditional expression [-Wsign-compare]
96:33.02 sslcon.c: In function 'NSSSSL_VersionCheck':
96:33.03 sslcon.c:3687:19: warning: variable 'c' set but not used [-Wunused-but-set-variable]
96:33.57 cmsencode.c: In function 'nss_cms_encoder_notify':
96:33.57 cmsencode.c:125:18: warning: variable 'poolp' set but not used [-Wunused-but-set-variable]
96:33.57 cmsencode.c: In function 'nss_cms_before_data':
96:33.57 cmsencode.c:204:18: warning: variable 'poolp' set but not used [-Wunused-but-set-variable]
96:34.30 crmfcont.c: In function 'CRMF_CreateEncryptedKeyWithEncryptedValue':
96:34.31 crmfcont.c:860:25: warning: variable 'dummy' set but not used [-Wunused-but-set-variable]
96:34.45 secutil.c: In function 'SECU_ChangePW2':
96:34.45 secutil.c:333:15: warning: variable 'rv' set but not used [-Wunused-but-set-variable]
96:34.45 secutil.c: In function 'SECU_PrintDumpDerIssuerAndSerial':
96:34.45 secutil.c:1551:19: warning: comparison between signed and unsigned integer expressions [-Wsign-compare]
96:34.45 secutil.c: In function 'secu_PrintPKCS7Signed':
96:34.45 secutil.c:2703:11: warning: passing argument 5 of 'SECU_PrintSignedData' from incompatible pointer type [enabled by default]
96:34.45 In file included from secutil.c:19:0:
96:34.45 secutil.h:260:12: note: expected 'SECU_PPFunc' but argument is of type 'int (*)(struct FILE *, const struct SECItem *, const char *, int)'
96:34.45 secutil.c: In function 'secu_PrintPKCS7SignedAndEnveloped':
96:34.45 secutil.c:2822:11: warning: passing argument 5 of 'SECU_PrintSignedData' from incompatible pointer type [enabled by default]
96:34.45 In file included from secutil.c:19:0:
96:34.45 secutil.h:260:12: note: expected 'SECU_PPFunc' but argument is of type 'int (*)(struct FILE *, const struct SECItem *, const char *, int)'
96:34.45 secutil.c: In function 'SEC_PrintCertificateAndTrust':
96:34.45 secutil.c:3152:10: warning: passing argument 5 of 'SECU_PrintSignedData' from incompatible pointer type [enabled by default]
96:34.45 secutil.c:3125:5: note: expected 'SECU_PPFunc' but argument is of type 'int (*)(struct FILE *, const struct SECItem *, const char *, int)'
96:34.45 secutil.c: In function 'SECU_StoreCRL':
96:34.45 secutil.c:3324:62: warning: comparison between signed and unsigned integer expressions [-Wsign-compare]
96:35.25 cmsrecinfo.c: In function 'NSS_CMSRecipientInfo_UnwrapBulkKey':
96:35.25 cmsrecinfo.c:529:21: warning: variable 'encalg' set but not used [-Wunused-but-set-variable]
96:35.27 ssl3ext.c: In function 'arrayContainsExtension':
96:35.27 ssl3ext.c:310:19: warning: comparison between signed and unsigned integer expressions [-Wsign-compare]
96:35.27 ssl3ext.c: In function 'ssl3_HandleServerNameXtn':
96:35.27 ssl3ext.c:417:43: warning: comparison between signed and unsigned integer expressions [-Wsign-compare]
96:35.27 ssl3ext.c:425:17: warning: variable 'type' set but not used [-Wunused-but-set-variable]
96:35.27 ssl3ext.c:457:22: warning: comparison between signed and unsigned integer expressions [-Wsign-compare]
96:35.27 ssl3ext.c:458:31: warning: comparison between signed and unsigned integer expressions [-Wsign-compare]
96:35.27 ssl3ext.c: In function 'ssl3_SendSessionTicketXtn':
96:35.27 ssl3ext.c:538:28: warning: comparison between signed and unsigned integer expressions [-Wsign-compare]
96:35.27 ssl3ext.c:561:25: warning: comparison between signed and unsigned integer expressions [-Wsign-compare]
96:35.27 ssl3ext.c: In function 'ssl3_ServerHandleAppProtoXtn':
96:35.27 ssl3ext.c:681:15: warning: comparison between signed and unsigned integer expressions [-Wsign-compare]
96:35.27 ssl3ext.c: In function 'ssl3_ClientSendNextProtoNegoXtn':
96:35.27 ssl3ext.c:782:28: warning: comparison between signed and unsigned integer expressions [-Wsign-compare]
96:35.27 ssl3ext.c:792:25: warning: comparison between signed and unsigned integer expressions [-Wsign-compare]
96:35.27 ssl3ext.c: In function 'ssl3_ClientSendAppProtoXtn':
96:35.27 ssl3ext.c:817:28: warning: comparison between signed and unsigned integer expressions [-Wsign-compare]
96:35.27 ssl3ext.c:857:25: warning: comparison between signed and unsigned integer expressions [-Wsign-compare]
96:35.27 ssl3ext.c: In function 'ssl3_ServerSendAppProtoXtn':
96:35.27 ssl3ext.c:886:28: warning: comparison between signed and unsigned integer expressions [-Wsign-compare]
96:35.27 ssl3ext.c:905:25: warning: comparison between signed and unsigned integer expressions [-Wsign-compare]
96:35.27 ssl3ext.c: In function 'ssl3_ServerSendStatusRequestXtn':
96:35.27 ssl3ext.c:952:28: warning: comparison between signed and unsigned integer expressions [-Wsign-compare]
96:35.27 ssl3ext.c: In function 'ssl3_ClientSendStatusRequestXtn':
96:35.27 ssl3ext.c:985:28: warning: comparison between signed and unsigned integer expressions [-Wsign-compare]
96:35.27 ssl3ext.c:1013:25: warning: comparison between signed and unsigned integer expressions [-Wsign-compare]
96:35.27 ssl3ext.c: In function 'ssl3_SendNewSessionTicket':
96:35.27 ssl3ext.c:1249:19: warning: comparison between signed and unsigned integer expressions [-Wsign-compare]
96:35.27 ssl3ext.c: In function 'ssl3_ServerHandleSessionTicketXtn':
96:35.27 ssl3ext.c:1587:23: warning: comparison between signed and unsigned integer expressions [-Wsign-compare]
96:35.27 ssl3ext.c: In function 'ssl3_SendRenegotiationInfoXtn':
96:35.27 ssl3ext.c:1981:28: warning: comparison between signed and unsigned integer expressions [-Wsign-compare]
96:35.27 ssl3ext.c: In function 'ssl3_ClientSendSigAlgsXtn':
96:35.27 ssl3ext.c:2355:28: warning: comparison between signed and unsigned integer expressions [-Wsign-compare]
96:35.27 ssl3ext.c:2369:25: warning: comparison between signed and unsigned integer expressions [-Wsign-compare]
96:35.27 ssl3ext.c: In function 'ssl3_ClientSendDraftVersionXtn':
96:35.27 ssl3ext.c:2445:28: warning: comparison between signed and unsigned integer expressions [-Wsign-compare]
96:35.27 ssl3ext.c:2458:25: warning: comparison between signed and unsigned integer expressions [-Wsign-compare]
96:35.83 derprint.c: In function 'prettyPrintLength':
96:35.83 derprint.c:454:20: warning: comparison between signed and unsigned integer expressions [-Wsign-compare]
96:36.79 cmmfchal.c: In function 'cmmf_create_witness_and_challenge':
96:36.79 cmmfchal.c:33:22: warning: variable 'id' set but not used [-Wunused-but-set-variable]
96:38.07 jarsign.c: In function 'jar_create_pk7':
96:38.07 jarsign.c:174:11: warning: variable 'errstring' set but not used [-Wunused-but-set-variable]
96:38.53 jar.c: In function 'JAR_find_next':
96:38.53 jar.c:423:30: warning: comparison between signed and unsigned integer expressions [-Wsign-compare]
96:38.53 jar.c: In function 'jar_find_first_cert':
96:38.53 jar.c:462:24: warning: comparison between signed and unsigned integer expressions [-Wsign-compare]
96:38.56 smimeutil.c: In function 'NSSSMIME_VersionCheck':
96:38.56 smimeutil.c:770:19: warning: variable 'c' set but not used [-Wunused-but-set-variable]
96:38.56 smimeutil.c: In function 'NSS_SMIMEUtil_FindBulkAlgForRecipients':
96:38.56 smimeutil.c:446:9: warning: 'key_type' may be used uninitialized in this function [-Wmaybe-uninitialized]
96:38.56 smimeutil.c:425:14: note: 'key_type' was declared here
96:38.87 sslsecur.c: In function 'SSL_ConfigSecureServerWithCertChain':
96:38.87 sslsecur.c:847:5: warning: comparison of unsigned expression < 0 is always false [-Wtype-limits]
96:38.87 sslsecur.c: In function 'ssl_SecureRecv':
96:38.87 sslsecur.c:1180:22: warning: variable 'sec' set but not used [-Wunused-but-set-variable]
96:39.57 jarfile.c: In function 'jar_physical_inflate':
96:39.57 jarfile.c:341:32: warning: comparison between signed and unsigned integer expressions [-Wsign-compare]
96:39.57 jarfile.c:356:38: warning: comparison between signed and unsigned integer expressions [-Wsign-compare]
96:39.57 jarfile.c: In function 'jar_extract_mf':
96:39.57 jarfile.c:578:14: warning: comparison between signed and unsigned integer expressions [-Wsign-compare]
96:39.57 jarfile.c: In function 'jar_listzip':
96:39.57 jarfile.c:702:47: warning: comparison between signed and unsigned integer expressions [-Wsign-compare]
96:39.57 jarfile.c:768:43: warning: comparison between signed and unsigned integer expressions [-Wsign-compare]
96:39.57 jarfile.c: In function 'jar_listtar':
96:39.57 jarfile.c:830:45: warning: comparison between signed and unsigned integer expressions [-Wsign-compare]
96:39.57 jarfile.c:824:12: warning: variable 'when' set but not used [-Wunused-but-set-variable]
96:39.57 jarfile.c:823:14: warning: variable 'mode' set but not used [-Wunused-but-set-variable]
96:40.44 sslinfo.c: In function 'SSL_DisableDefaultExportCipherSuites':
96:40.44 sslinfo.c:247:15: warning: variable 'rv' set but not used [-Wunused-but-set-variable]
96:40.44 sslinfo.c: In function 'SSL_DisableExportCipherSuites':
96:40.44 sslinfo.c:268:15: warning: variable 'rv' set but not used [-Wunused-but-set-variable]
96:40.76 ssl3ecc.c: In function 'ssl3_DisableECCSuites':
96:40.76 ssl3ecc.c:969:19: warning: unused variable 'rv' [-Wunused-variable]
96:40.76 ssl3ecc.c: In function 'ssl3_SendSupportedCurvesXtn':
96:40.76 ssl3ecc.c:1130:28: warning: comparison between signed and unsigned integer expressions [-Wsign-compare]
96:40.76 ssl3ecc.c: In function 'ssl3_HandleSupportedCurvesXtn':
96:40.76 ssl3ecc.c:1238:35: warning: comparison between signed and unsigned integer expressions [-Wsign-compare]
96:40.99 sslsock.c: In function 'ssl_WriteV':
96:40.99 sslsock.c:2524:30: warning: comparison between signed and unsigned integer expressions [-Wsign-compare]
96:40.99 sslsock.c:2537:68: warning: comparison between signed and unsigned integer expressions [-Wsign-compare]
96:40.99 sslsock.c:2556:28: warning: comparison between signed and unsigned integer expressions [-Wsign-compare]
96:40.99 sslsock.c:2556:59: warning: signed and unsigned type in conditional expression [-Wsign-compare]
96:40.99 sslsock.c:2559:23: warning: comparison between signed and unsigned integer expressions [-Wsign-compare]
96:40.99 sslsock.c:2565:56: warning: comparison between signed and unsigned integer expressions [-Wsign-compare]
96:41.07 libnss3.so
96:43.07 mkdir: kann Verzeichnis „/opt/FirefoxSource/mozilla-release/objdir-droid/security/nss/lib/freebl“ nicht anlegen: Die Datei existiert bereits
96:43.96 shlibsign.c: In function 'writeItem':
96:43.96 shlibsign.c:150:22: warning: comparison between signed and unsigned integer expressions [-Wsign-compare]
96:43.96 shlibsign.c: In function 'main':
96:43.96 shlibsign.c:908:40: warning: comparison between signed and unsigned integer expressions [-Wsign-compare]
96:44.05 cd mangle; /usr/bin/make libs
96:45.16 loader.c: In function 'freebl_LoadDSO':
96:45.16 loader.c:135:14: warning: variable 'status' set but not used [-Wunused-but-set-variable]
96:45.16 loader.c: In function 'BL_Unload':
96:45.16 loader.c:904:20: warning: unused variable 'status' [-Wunused-variable]
96:45.81 pk12util.c: In function 'p12u_InitContext':
96:45.81 pk12util.c:104:12: warning: variable 'fileExist' set but not used [-Wunused-but-set-variable]
96:45.81 pk12util.c: In function 'P12U_ListPKCS12File':
96:45.81 pk12util.c:762:30: warning: passing argument 5 of 'SECU_PrintSignedData' from incompatible pointer type [enabled by default]
96:45.81 In file included from pk12util.c:11:0:
96:45.81 /opt/FirefoxSource/mozilla-release/objdir-droid/dist/private/nss/secutil.h:260:12: note: expected 'SECU_PPFunc' but argument is of type 'int (*)(struct FILE *, const struct SECItem *, const char *, int)'
96:45.84 ldvector.c: In function 'FREEBL_GetVector':
96:45.84 ldvector.c:301:19: warning: variable 'c' set but not used [-Wunused-but-set-variable]
96:46.55 keystuff.c: In function 'UpdateRNG':
96:46.55 keystuff.c:96:18: warning: comparison between signed and unsigned integer expressions [-Wsign-compare]
96:46.55 keystuff.c: In function 'CERTUTIL_GeneratePrivateKey':
96:46.55 keystuff.c:497:15: warning: variable 'algtag' set but not used [-Wunused-but-set-variable]
96:48.81 token.c: In function 'nssCKFWToken_GetUTCTime':
96:48.81 token.c:1261:27: warning: variable 'z' set but not used [-Wunused-but-set-variable]
96:49.24 pk11.c: In function 'ListModule':
96:49.24 pk11.c:612:16: warning: comparison between signed and unsigned integer expressions [-Wsign-compare]
96:49.37 rawhash.c: In function 'HASH_GetRawHashObject':
96:49.37 rawhash.c:156:5: warning: comparison of unsigned expression < 0 is always false [-Wtype-limits]
96:50.66 sha512.c: In function 'SHA512_Compress':
96:50.66 sha512.c:933:14: warning: unused variable 't1' [-Wunused-variable]
96:50.66 sha512.c:955:18: warning: unused variable 't2' [-Wunused-variable]
96:50.66 sha512.c:955:14: warning: unused variable 't1' [-Wunused-variable]
96:50.66 sha512.c: In function 'SHA512_End':
96:50.66 sha512.c:1229:14: warning: unused variable 't1' [-Wunused-variable]
96:50.66 sha512.c: In function 'SHA512_EndRaw':
96:50.66 sha512.c:1274:14: warning: unused variable 't1' [-Wunused-variable]
96:50.80 ytab.c: In function 'Pk11Install_yyparse':
96:50.80 ytab.c:219:5: warning: suggest parentheses around assignment used as truth value [-Wparentheses]
96:51.05 cd builtins; /usr/bin/make libs
96:51.80 cts.c: In function 'CTS_DecryptUpdate':
96:51.80 cts.c:226:23: warning: comparison between signed and unsigned integer expressions [-Wsign-compare]
96:52.24 lex.Pk11Install_yy.cpp:1060:13: warning: 'Pkcs11Install_yyunput' defined but not used [-Wunused-function]
96:52.24 lex.Pk11Install_yy.cpp:1106:12: warning: 'input' defined but not used [-Wunused-function]
96:52.28 bfind.c: In function 'builtins_attrmatch':
96:52.28 bfind.c:122:11: warning: comparison between signed and unsigned integer expressions [-Wsign-compare]
96:52.45 gcm.c: In function 'gcm_getX':
96:52.45 gcm.c:223:13: warning: comparison between signed and unsigned integer expressions [-Wsign-compare]
96:52.47 binst.c: In function 'builtins_mdInstance_GetLibraryVersion':
96:52.47 binst.c:70:17: warning: variable 'c' set but not used [-Wunused-but-set-variable]
96:53.41 dh.c: In function 'DH_Derive':
96:53.41 dh.c:271:13: warning: comparison between signed and unsigned integer expressions [-Wsign-compare]
96:53.77 ec.c: In function 'ec_points_mul':
96:53.77 ec.c:89:17: warning: comparison between signed and unsigned integer expressions [-Wsign-compare]
96:53.77 ec.c: In function 'EC_ValidatePublicKey':
96:53.77 ec.c:450:33: warning: comparison between signed and unsigned integer expressions [-Wsign-compare]
96:53.78 ecdecode.c: In function 'gf_populate_params':
96:53.78 ecdecode.c:120:5: warning: comparison of unsigned expression < 0 is always false [-Wtype-limits]
96:54.46 dsa.c: In function 'DSA_VerifyDigest':
96:54.46 dsa.c:518:25: warning: comparison between signed and unsigned integer expressions [-Wsign-compare]
96:54.46 dsa.c:530:27: warning: comparison between signed and unsigned integer expressions [-Wsign-compare]
96:55.08 pqg.c: In function 'makePrimefromPrimesShaweTaylor':
96:55.08 pqg.c:617:34: warning: comparison between signed and unsigned integer expressions [-Wsign-compare]
96:55.08 pqg.c:687:28: warning: comparison between signed and unsigned integer expressions [-Wsign-compare]
96:55.08 pqg.c: In function 'makePrimefromSeedShaweTaylor':
96:55.08 pqg.c:849:28: warning: comparison between signed and unsigned integer expressions [-Wsign-compare]
96:55.08 pqg.c: In function 'pqg_ParamGen':
96:55.08 pqg.c:1232:18: warning: variable 'b' set but not used [-Wunused-but-set-variable]
96:55.08 pqg.c: In function 'PQG_VerifyParams':
96:55.08 pqg.c:1614:50: warning: comparison between signed and unsigned integer expressions [-Wsign-compare]
96:55.08 pqg.c:1672:25: warning: comparison between signed and unsigned integer expressions [-Wsign-compare]
96:55.08 pqg.c:1708:18: warning: comparison between signed and unsigned integer expressions [-Wsign-compare]
96:55.08 pqg.c:1709:25: warning: comparison between signed and unsigned integer expressions [-Wsign-compare]
96:55.08 pqg.c:1710:33: warning: comparison between signed and unsigned integer expressions [-Wsign-compare]
96:55.08 pqg.c:1733:29: warning: comparison between signed and unsigned integer expressions [-Wsign-compare]
96:55.08 pqg.c:1775:27: warning: 'type' may be used uninitialized in this function [-Wmaybe-uninitialized]
96:55.08 pqg.c:1595:16: note: 'type' was declared here
96:55.08 pqg.c:1777:5: warning: 'hashtype' may be used uninitialized in this function [-Wmaybe-uninitialized]
96:55.08 pqg.c:1594:19: note: 'hashtype' was declared here
96:55.37 shvfy.c: In function 'readItem':
96:55.37 shvfy.c:267:19: warning: comparison between signed and unsigned integer expressions [-Wsign-compare]
96:55.51 rsa.c: In function 'RSA_NewKey':
96:55.51 rsa.c:251:29: warning: comparison between signed and unsigned integer expressions [-Wsign-compare]
96:55.51 rsa.c: In function 'rsa_get_primes_from_exponents':
96:55.51 rsa.c:482:52: warning: comparison between signed and unsigned integer expressions [-Wsign-compare]
96:55.89 mpi/mpprime.c: In function 'mpp_make_prime':
96:55.89 mpi/mpprime.c:445:47: warning: comparison between signed and unsigned integer expressions [-Wsign-compare]
96:56.31 mpi/mplogic.c: In function 'mpl_num_set':
96:56.31 mpi/mplogic.c:230:20: warning: comparison between signed and unsigned integer expressions [-Wsign-compare]
96:56.31 mpi/mplogic.c: In function 'mpl_num_clear':
96:56.31 mpi/mplogic.c:260:20: warning: comparison between signed and unsigned integer expressions [-Wsign-compare]
96:58.31 mpi/mpi.c: In function 'mp_expt':
96:58.31 mpi/mpi.c:1114:20: warning: comparison between signed and unsigned integer expressions [-Wsign-compare]
96:58.31 mpi/mpi.c:1118:22: warning: comparison between signed and unsigned integer expressions [-Wsign-compare]
96:58.31 mpi/mpi.c: In function 's_mp_exptmod':
96:58.31 mpi/mpi.c:1497:20: warning: comparison between signed and unsigned integer expressions [-Wsign-compare]
96:58.31 mpi/mpi.c:1501:22: warning: comparison between signed and unsigned integer expressions [-Wsign-compare]
96:58.31 mpi/mpi.c: In function 'mp_trailing_zeros':
96:58.31 mpi/mpi.c:2012:45: warning: comparison between signed and unsigned integer expressions [-Wsign-compare]
96:58.31 mpi/mpi.c: In function 's_mp_fixup_reciprocal':
96:58.31 mpi/mpi.c:2164:19: warning: comparison between signed and unsigned integer expressions [-Wsign-compare]
96:58.31 mpi/mpi.c:2164:51: warning: signed and unsigned type in conditional expression [-Wsign-compare]
96:58.31 mpi/mpi.c:2166:11: warning: comparison between signed and unsigned integer expressions [-Wsign-compare]
96:58.31 mpi/mpi.c: In function 's_mp_lshd':
96:58.31 mpi/mpi.c:2938:18: warning: comparison between signed and unsigned integer expressions [-Wsign-compare]
96:58.31 mpi/mpi.c: In function 's_mp_mul_2':
96:58.31 mpi/mpi.c:3063:12: warning: comparison between signed and unsigned integer expressions [-Wsign-compare]
96:58.31 mpi/mpi.c: In function 's_mp_todigit':
96:58.31 mpi/mpi.c:4600:10: warning: comparison between signed and unsigned integer expressions [-Wsign-compare]
96:58.31 mpi/mpi.c: In function 'mp_to_unsigned_octets':
96:58.31 mpi/mpi.c:4720:29: warning: comparison between signed and unsigned integer expressions [-Wsign-compare]
96:58.31 mpi/mpi.c: In function 'mp_to_signed_octets':
96:58.31 mpi/mpi.c:4752:29: warning: comparison between signed and unsigned integer expressions [-Wsign-compare]
96:58.31 mpi/mpi.c:4766:20: warning: comparison between signed and unsigned integer expressions [-Wsign-compare]
96:58.31 mpi/mpi.c:4767:18: warning: comparison between signed and unsigned integer expressions [-Wsign-compare]
96:58.31 mpi/mpi.c: In function 'mp_to_fixlen_octets':
96:58.31 mpi/mpi.c:4792:29: warning: comparison between signed and unsigned integer expressions [-Wsign-compare]
96:58.31 mpi/mpi.c:4795:16: warning: comparison between signed and unsigned integer expressions [-Wsign-compare]
96:58.37 ecl/ecp_521.c: In function 'ec_GFp_nistp521_mod':
96:58.37 ecl/ecp_521.c:42:73: warning: comparison between signed and unsigned integer expressions [-Wsign-compare]
96:58.37 ecl/ecp_521.c:50:18: warning: comparison between signed and unsigned integer expressions [-Wsign-compare]
96:59.58 lgglue.c: In function 'sftkdb_resolvePath':
96:59.58 lgglue.c:44:24: warning: comparison between signed and unsigned integer expressions [-Wsign-compare]
97:01.89 lowpbe.c: In function 'nsspkcs5_PKCS12PBE':
97:01.89 lowpbe.c:519:22: warning: comparison between signed and unsigned integer expressions [-Wsign-compare]
97:02.11 pkcs11u.c: In function 'sftk_DeleteObject':
97:02.11 pkcs11u.c:1177:22: warning: unused variable 'to' [-Wunused-variable]
97:02.11 pkcs11u.c: In function 'sftk_NewTokenObject':
97:02.11 pkcs11u.c:1902:22: warning: variable 'tokObject' set but not used [-Wunused-but-set-variable]
97:02.59 pkcs11.c: In function 'sftk_GetPubKey':
97:02.59 pkcs11.c:1756:35: warning: comparison between signed and unsigned integer expressions [-Wsign-compare]
97:02.59 pkcs11.c:1764:35: warning: comparison between signed and unsigned integer expressions [-Wsign-compare]
97:02.59 pkcs11.c:1774:27: warning: comparison between signed and unsigned integer expressions [-Wsign-compare]
97:02.59 pkcs11.c: In function 'NSC_GetInfo':
97:02.59 pkcs11.c:3144:19: warning: variable 'c' set but not used [-Wunused-but-set-variable]
97:02.59 pkcs11.c: In function 'NSC_GetAttributeValue':
97:02.59 pkcs11.c:4314:58: warning: comparison between signed and unsigned integer expressions [-Wsign-compare]
97:02.59 pkcs11.c: In function 'sftk_emailhack':
97:02.59 pkcs11.c:4527:17: warning: comparison between signed and unsigned integer expressions [-Wsign-compare]
97:02.59 pkcs11.c: In function 'NSC_FindObjects':
97:02.59 pkcs11.c:4743:54: warning: signed and unsigned type in conditional expression [-Wsign-compare]
97:02.59 pkcs11.c: In function 'NSC_CreateObject':
97:02.59 pkcs11.c:4085:21: warning: 'moduleIndex' may be used uninitialized in this function [-Wmaybe-uninitialized]
97:02.59 pkcs11.c:4005:19: note: 'moduleIndex' was declared here
97:02.88 sftkhmac.c: In function 'sftk_HMACConstantTime_Update':
97:02.88 sftkhmac.c:149:15: warning: unused variable 'rv' [-Wunused-variable]
97:02.88 sftkhmac.c: In function 'sftk_SSLv3MACConstantTime_Update':
97:02.88 sftkhmac.c:163:15: warning: unused variable 'rv' [-Wunused-variable]
97:02.99 sdb.c: In function 'sdb_FindObjectsInit':
97:02.99 sdb.c:702:28: warning: comparison between signed and unsigned integer expressions [-Wsign-compare]
97:02.99 sdb.c:727:32: warning: comparison between signed and unsigned integer expressions [-Wsign-compare]
97:02.99 sdb.c: In function 'sdb_GetAttributeValueNoLock':
97:02.99 sdb.c:848:17: warning: comparison between signed and unsigned integer expressions [-Wsign-compare]
97:02.99 sdb.c:900:34: warning: comparison between signed and unsigned integer expressions [-Wsign-compare]
97:02.99 sdb.c: In function 'sdb_SetAttributeValue':
97:02.99 sdb.c:978:27: warning: comparison between signed and unsigned integer expressions [-Wsign-compare]
97:02.99 sdb.c:1007:17: warning: comparison between signed and unsigned integer expressions [-Wsign-compare]
97:02.99 sdb.c: In function 'sdb_CreateObject':
97:02.99 sdb.c:1138:42: warning: comparison between signed and unsigned integer expressions [-Wsign-compare]
97:02.99 sdb.c:1168:17: warning: comparison between signed and unsigned integer expressions [-Wsign-compare]
97:03.53 sftkdb.c: In function 'sftkdb_fixupTemplateOut':
97:03.53 sftkdb.c:328:22: warning: variable 'data' set but not used [-Wunused-but-set-variable]
97:03.53 sftkdb.c:345:69: warning: comparison between signed and unsigned integer expressions [-Wsign-compare]
97:03.53 sftkdb.c: In function 'sftk_signTemplate':
97:03.53 sftkdb.c:520:17: warning: comparison between signed and unsigned integer expressions [-Wsign-compare]
97:03.53 sftkdb.c: In function 'sftkdb_CreateObject':
97:03.53 sftkdb.c:576:12: warning: variable 'inTransaction' set but not used [-Wunused-but-set-variable]
97:03.53 sftkdb.c: In function 'sftk_ExtractTemplate':
97:03.53 sftkdb.c:619:17: warning: comparison between signed and unsigned integer expressions [-Wsign-compare]
97:03.53 sftkdb.c:632:17: warning: comparison between signed and unsigned integer expressions [-Wsign-compare]
97:03.53 sftkdb.c: In function 'sftkdb_resolveConflicts':
97:03.53 sftkdb.c:1045:13: warning: comparison between signed and unsigned integer expressions [-Wsign-compare]
97:03.53 sftkdb.c: In function 'sftkdb_FindObjects':
97:03.53 sftkdb.c:1261:14: warning: comparison between signed and unsigned integer expressions [-Wsign-compare]
97:03.53 sftkdb.c: In function 'sftkdb_GetObjectTemplate':
97:03.53 sftkdb.c:1613:14: warning: comparison between signed and unsigned integer expressions [-Wsign-compare]
97:03.53 sftkdb.c:1631:63: warning: comparison between signed and unsigned integer expressions [-Wsign-compare]
97:03.53 sftkdb.c: In function 'sftkdb_handleIDAndName':
97:03.53 sftkdb.c:2014:11: warning: variable 'crv' set but not used [-Wunused-but-set-variable]
97:03.53 sftkdb.c: In function 'sftkdb_mergeObject':
97:03.53 sftkdb.c:2196:17: warning: comparison between signed and unsigned integer expressions [-Wsign-compare]
97:03.53 sftkdb.c: In function 'sftkdb_Update':
97:03.54 sftkdb.c:2301:38: warning: comparison between signed and unsigned integer expressions [-Wsign-compare]
97:03.75 sftkpwd.c: In function 'sftk_updateMacs':
97:03.75 sftkpwd.c:908:17: warning: comparison between signed and unsigned integer expressions [-Wsign-compare]
97:03.75 sftkpwd.c:909:31: warning: comparison between signed and unsigned integer expressions [-Wsign-compare]
97:03.75 sftkpwd.c:930:17: warning: comparison between signed and unsigned integer expressions [-Wsign-compare]
97:03.75 sftkpwd.c:935:31: warning: comparison between signed and unsigned integer expressions [-Wsign-compare]
97:03.75 sftkpwd.c:868:11: warning: variable 'crv2' set but not used [-Wunused-but-set-variable]
97:03.75 sftkpwd.c:867:11: warning: variable 'crv' set but not used [-Wunused-but-set-variable]
97:03.75 sftkpwd.c: In function 'sftk_updateEncrypted':
97:03.75 sftkpwd.c:986:17: warning: comparison between signed and unsigned integer expressions [-Wsign-compare]
97:03.75 sftkpwd.c:993:31: warning: comparison between signed and unsigned integer expressions [-Wsign-compare]
97:03.75 sftkpwd.c: In function 'sftkdb_convertObjects':
97:03.75 sftkpwd.c:1125:38: warning: comparison between signed and unsigned integer expressions [-Wsign-compare]
97:04.50 pkcs11c.c: In function 'NSC_GenerateKeyPair':
97:04.50 pkcs11c.c:4340:9: warning: variable 'private_value_bits' set but not used [-Wunused-but-set-variable]
97:04.50 pkcs11c.c: In function 'sftk_PackagePrivateKey':
97:04.50 pkcs11c.c:4862:14: warning: variable 'fordebug' set but not used [-Wunused-but-set-variable]
97:04.50 pkcs11c.c: In function 'NSC_DeriveKey':
97:04.50 pkcs11c.c:6764:18: warning: comparison between signed and unsigned integer expressions [-Wsign-compare]
97:04.50 pkcs11c.c:6769:18: warning: comparison between signed and unsigned integer expressions [-Wsign-compare]
97:04.50 pkcs11c.c:6850:20: warning: comparison between signed and unsigned integer expressions [-Wsign-compare]
97:04.50 pkcs11c.c: In function 'NSC_GenerateKeyPair':
97:04.50 pkcs11c.c:4260:6: warning: 'subPrimeLen' may be used uninitialized in this function [-Wmaybe-uninitialized]
97:04.50 pkcs11c.c:4042:14: note: 'subPrimeLen' was declared here
97:04.50 pkcs11c.c:4212:23: warning: 'modulusLen' may be used uninitialized in this function [-Wmaybe-uninitialized]
97:04.50 pkcs11c.c:4041:14: note: 'modulusLen' was declared here
97:04.50 pkcs11c.c: In function 'NSC_GenerateKey':
97:04.50 pkcs11c.c:3968:13: warning: 'hashType' may be used uninitialized in this function [-Wmaybe-uninitialized]
97:05.64 libjs_static.a
168:44.86 libjs_static.a.desc
168:45.88 libeditline.a.desc
168:45.98 js
170:25.17 jsapi-tests
170:35.30 gdb-tests
171:01.54 libcertverifier.a.desc
171:01.78 libmozillapkix.a.desc
171:02.03 libmozillapkix_gtest.a.desc
171:02.36 libpkixtestutil.a.desc
171:02.53 libsecurity_apps.a.desc
171:03.15 libxpt.a
171:03.96 libxpt.a.desc
171:04.37 libxpcom_string.a.desc
171:04.57 libxpcomglue_s.a
171:05.83 libxpcomglue_s.a.desc
171:06.33 libxpcomglue.a
171:06.49 libxpcomglue.a.desc
171:06.84 libxpcomglue_s_nomozalloc.a
171:06.91 libxpcomglue_s_nomozalloc.a.desc
171:07.28 libxpcom_glue_gtest.a.desc
171:07.58 libxpcom_base.a.desc
171:07.94 libxpcom_ds.a.desc
171:08.38 libxpcom_io.a.desc
171:08.85 libxpcom_components.a.desc
171:09.27 libxpcom_threads.a.desc
171:09.56 libxpcom_reflect_xptinfo.a.desc
171:09.87 libxpcom_reflect_xptcall.a.desc
171:10.04 libxpcom_reflect_xptcall_md_unix.a.desc
171:40.81 libchrome_src.a.desc
171:41.43 libxpcom_core.a.desc
171:41.99 libmodules_libpref_src.a.desc
171:42.09 /opt/FirefoxSource/mozilla-release/netwerk/base/public/security-prefs.js: WARNING: no preprocessor directives found
171:42.36 libintl_hyphenation_src.a.desc
171:42.80 libintl_locale_src.a.desc
171:43.01 libintl_locale_src_unix.a.desc
171:43.84 libintl_lwbrk_src.a.desc
171:44.60 libintl_strres_src.a.desc
171:47.81 libunicharutil_external_s.a
171:48.39 libunicharutil_external_s.a.desc
171:48.66 libintl_unicharutil_util_internal.a
171:48.82 libintl_unicharutil_util_internal.a.desc
171:49.07 libintl_unicharutil_src.a.desc
171:51.05 libintl_uconv_src.a.desc
171:51.49 libi18n.a.desc
171:52.67 libnetwerk_base_src.a.desc
171:53.25 libnetwerk_cookie.a.desc
171:53.73 libnetwerk_dns.a.desc
171:54.22 libnetwerk_socket.a.desc
171:54.48 libnetwerk_mime.a.desc
171:54.90 libnetwerk_streamconv_src.a.desc
171:55.38 libnetwerk_streamconv_converters.a.desc
171:55.88 libnetwerk_cache.a.desc
171:56.61 libnetwerk_cache2.a.desc
171:57.07 libnetwerk_protocol_about.a.desc
171:57.52 libnetwerk_protocol_app.a.desc
171:57.78 libnetwerk_protocol_data.a.desc
171:58.08 libnetwerk_protocol_device.a.desc
171:58.40 libnetwerk_protocol_file.a.desc
171:58.84 libnetwerk_protocol_ftp.a.desc
171:59.92 libnetwerk_protocol_http.a.desc
172:00.76 libnetwerk_protocol_res.a.desc
172:01.13 libnetwerk_protocol_viewsource.a.desc
172:01.62 libnetwerk_protocol_websocket.a.desc
172:02.11 libnetwerk_protocol_wyciwyg.a.desc
172:02.58 libnetwerk_system_android.a.desc
172:02.89 libnetwerk_ipc.a.desc
172:03.69 libnecko.a.desc
172:04.14 libextensions_auth.a.desc
172:05.57 libipc_chromium.a.desc
172:08.05 libipc_glue.a.desc
172:08.77 libipc_ipdl.a.desc
172:09.41 libipc_testshell.a.desc
172:09.82 libjs_ipc.a.desc
172:10.57 libhal.a.desc
172:11.46 libjs_xpconnect_wrappers.a.desc
172:11.81 libjs_xpconnect_loader.a.desc
172:12.47 libxpconnect_s.a.desc
172:13.12 libintl_chardet_src.a.desc
172:13.41 libyuv_neon.a.desc
172:13.64 libyuv.a.desc
172:13.89 libjar.a.desc
172:14.50 libmodules_libjar_zipwriter_src.a.desc
172:15.02 libstorage_src.a.desc
172:15.33 libstoragecomps.a.desc
172:15.56 libextensions_cookie.a.desc
172:15.93 libextensions_permissions.a.desc
172:16.47 librdf_base_src.a.desc
172:16.70 librdfutil_external_s.a
172:16.90 librdfutil_external_s.a.desc
172:17.10 librdf_util_src_internal.a.desc
172:17.29 librdf_datasource_src.a.desc
172:17.49 librdf.a.desc
172:17.71 libutils.so
172:18.14 libstagefright.so
172:18.54 libvideoeditorplayer.so
172:18.91 libutils.so
172:19.31 libstagefright.so
172:19.67 libstagefright_color_conversion.so
172:20.06 libstagefright.so
172:20.42 libstagefright.so
172:50.44 libomxplugin.so
172:50.93 libomxplugingb.so
172:51.34 libomxplugingb235.so
172:51.71 libomxpluginfroyo.so
172:52.20 libstagefright.so
172:52.77 libomxpluginhc.so
172:53.25 libomxpluginkk.so
172:54.66 libgtest.a.desc
172:54.88 liburiloader_base.a.desc
172:55.31 liburiloader_exthandler.a.desc
172:55.80 WriteArgument
172:56.16 liburiloader_prefetch.a.desc
172:56.61 libcaps.a.desc
172:57.01 libparser_expat_lib.a.desc
172:57.42 libparser_xml_src.a.desc
172:57.93 libhtmlpars.a.desc
172:58.28 libparser_html.a.desc
172:59.03 libgfx_cairo_cairo_src.a.desc
172:59.44 libgfx_cairo_libpixman_src.a.desc
172:59.80 libgfx_2d.a.desc
173:00.11 libgfx_ycbcr.a.desc
173:00.52 libgfx_angle.a.desc
173:00.97 libgfx_src.a.desc
173:01.39 libgfx_qcms.a.desc
173:01.69 libgfx_gl.a.desc
173:02.55 libgfx_layers.a.desc
173:03.60 libgfx_graphite2_src.a.desc
173:03.91 libgfx_harfbuzz_src.a.desc
173:04.22 libgfx_ots_src.a.desc
173:04.68 libthebes.a.desc
173:05.17 libgfx_ipc.a.desc
173:06.41 libgfx_skia.a.desc
173:07.98 libgfxtest.a.desc
173:08.69 libimage_src.a.desc
173:09.15 libimage_decoders.a.desc
173:09.43 libimage_decoders_icon_android.a.desc
173:09.65 libimgicon.a.desc
173:09.99 libimage_encoders_ico.a.desc
173:10.20 libimage_encoders_png.a.desc
173:10.40 libimage_encoders_jpeg.a.desc
173:10.60 libimage_encoders_bmp.a.desc
173:10.82 libimglib2.a.desc
173:17.47 libdom_animation.a.desc
173:17.65 libdom_apps_src.a.desc
173:18.66 libdom_base.a.desc
173:19.90 libdom_activities_src.a.desc
173:20.27 libdom_archivereader.a.desc
173:20.99 libdom_bindings.a.desc
173:21.67 libdombindings_test_s.a.desc
173:21.81 libdom_battery.a.desc
173:22.00 libdom_browser-element.a.desc
173:22.59 libdom_crypto.a.desc
173:23.24 libdom_alarm.a.desc
173:23.68 libdom_datastore.a.desc
173:24.14 libdom_devicestorage.a.desc
173:24.42 libdom_encoding.a.desc
173:25.02 libdom_events.a.desc
173:25.45 libdom_filehandle.a.desc
173:25.79 libdom_filesystem.a.desc
173:26.11 libdom_asmjscache.a.desc
173:26.31 libdom_media.a.desc
173:27.56 libdom_power.a.desc
173:28.40 libdom_quota.a.desc
173:30.04 libdom_mobilemessage_src.a.desc
173:31.30 libdom_src_jsurl.a.desc
173:31.46 libdom_src_storage.a.desc
173:31.58 libdom_src_offline.a.desc
173:31.74 libdom_src_json.a.desc
173:31.98 libdom_src_geolocation.a.desc
173:32.23 libdom_src_notification.a.desc
173:32.44 libdom_time.a.desc
173:33.44 libdom_network_src.a.desc
173:34.14 libdom_plugins_base.a.desc
173:34.70 libdom_plugins_base_android.a.desc
173:35.07 libdom_plugins_ipc.a.desc
173:35.43 libdom_indexedDB.a.desc
173:35.93 libdom_indexedDB_ipc.a.desc
173:40.16 /opt/FirefoxSource/mozilla-release/dom/indexedDB/test/extensions/bootstrap.js: WARNING: no preprocessor directives found
173:40.34 libdom_system.a.desc
173:40.83 libdom_system_android.a.desc
173:41.27 libdom_ipc.a.desc
173:42.68 libdom_workers.a.desc
173:43.12 /opt/FirefoxSource/mozilla-release/dom/workers/test/extensions/bootstrap/bootstrap.js: WARNING: no preprocessor directives found
173:43.16 /opt/FirefoxSource/mozilla-release/dom/workers/test/extensions/bootstrap/worker.js: WARNING: no preprocessor directives found
173:43.56 /opt/FirefoxSource/mozilla-release/dom/workers/test/extensions/traditional/worker.js: WARNING: no preprocessor directives found
173:43.94 libdom_camera.a.desc
173:44.24 libdom_audiochannel.a.desc
173:44.64 libdom_promise.a.desc
173:44.95 libdom_smil.a.desc
173:45.33 libdom_telephony.a.desc
173:46.10 libdom_xbl.a.desc
173:47.01 libdom_xslt_base.a.desc
173:47.25 libdom_xslt_xml.a.desc
173:47.70 libdom_xslt_xpath.a.desc
173:48.29 libdom_xslt_xslt.a.desc
173:49.65 libdom_resourcestats.a.desc
173:50.67 libdom_gamepad.a.desc
173:51.61 libnptest.so
173:52.04 libnpsecondtest.so
173:52.55 libnptestjava.so
173:53.06   adding: install.rdf (deflated 52%)
173:53.15   adding: plugins/libnptest.so (deflated 60%)
173:53.22   adding: plugins/libnpsecondtest.so (deflated 60%)
173:53.33 libview_src.a.desc
173:53.87 libwidget_shared.a.desc
173:54.23 libxpwidgets_s.a.desc
173:54.87 libwidget_android.a.desc
173:56.28 libcontent_base_src.a.desc
173:58.12 libcontent_canvas_src.a.desc
173:59.85 libcontent_html_content_src.a.desc
174:00.55 libcontent_html_document_src.a.desc
174:00.77 libcontent_mathml_content_src.a.desc
174:01.24 libcontent_media.a.desc
174:01.90 libcontent_media_encoder.a.desc
174:02.21 libmozgmp.a.desc
174:02.77 libcontent_media_mediasource.a.desc
174:03.08 libcontent_media_ogg.a.desc
174:03.61 libcontent_media_webaudio.a.desc
174:04.16 libcontent_media_webaudio_blink.a.desc
174:04.89 libcontent_media_raw.a.desc
174:05.12 libcontent_media_wave.a.desc
174:05.37 libcontent_media_webm.a.desc
174:05.61 libcontent_media_android.a.desc
174:05.88 libcontent_media_webrtc.a.desc
174:06.31 libcontent_media_webspeech_synth.a.desc
174:06.83 libcontent_media_webspeech_recognition.a.desc
174:07.29 libcontent_media_eme.a.desc
174:07.61 libmedia_gtest.a.desc
174:07.84 libcontent_svg_document_src.a.desc
174:09.04 libcontent_svg_content_src.a.desc
174:10.19 libcontent_xml_content_src.a.desc
174:11.55 libcontent_xml_document_src.a.desc
174:12.55 libcontent_xul_document_src.a.desc
174:13.35 libcontent_xul_content_src.a.desc
174:14.03 libcontent_xul_templates_src.a.desc
174:14.67 libeditor_txtsvc.a.desc
174:15.14 libeditor_libeditor_base.a.desc
174:15.58 libeditor_libeditor_text.a.desc
174:15.96 libeditor_libeditor_html.a.desc
174:16.36 libeditor_txmgr.a.desc
174:16.79 libeditor_composer.a.desc
174:17.42 liblayout_style.a.desc
174:18.87 liblayout_base.a.desc
174:19.58 liblayout_generic.a.desc
174:20.48 liblayout_forms.a.desc
174:20.99 liblayout_tables.a.desc
174:21.59 liblayout_svg.a.desc
174:22.24 liblayout_xul.a.desc
174:22.98 liblayout_xul_tree.a.desc
174:23.44 liblayout_xul_grid.a.desc
174:23.82 liblayout_ipc.a.desc
174:24.32 liblayout_mathml.a.desc
174:24.94 liblayout_inspector.a.desc
174:25.78 liblayout_printing.a.desc
174:26.19 libgklayout.a.desc
174:26.69 libgkmedias.a.desc
174:27.13 libdocshell_base.a.desc
174:27.82 libdocshell_shistory_src.a.desc
174:28.05 libdocshell_build.a.desc
174:29.13 libembedding_components_windowwatcher_src.a.desc
174:29.34 libembedding_components_appstartup_src.a.desc
174:29.80 libembedding_components_find_src.a.desc
174:30.25 libembedding_components_webbrowserpersist_src.a.desc
174:30.74 libembedding_components_commandhandler_src.a.desc
174:30.94 libembedding_components_printingui_src_unixshared.a.desc
174:31.16 libembedcomponents.a.desc
174:31.41 libembedding_browser_webBrowser.a.desc
174:31.79 libwebbrwsr.a.desc
174:32.59 libxpfe_appshell_src.a.desc
174:32.88 libother-licenses_skia-npapi.a.desc
174:33.10 libextensions_universalchardet_src_base.a.desc
174:33.35 libuniversalchardet.a.desc
174:33.58 libaccessible_other.a.desc
174:33.73 libaccessible_base.a.desc
174:34.25 libaccessible_generic.a.desc
174:34.64 libaccessible_html.a.desc
174:35.59 libaccessible_xpcom.a.desc
174:35.91 libaccessible_xul.a.desc
174:36.47 libprofdirserviceprovidersa_s.a.desc
174:36.80 libtools_profiler.a.desc
174:37.27 libsps_test.a.desc
174:37.58 libxpfe_components_windowds.a.desc
174:37.92 libxpfe_components_directory.a.desc
174:38.25 libappcomps.a.desc
174:38.94 libextensions_spellcheck_hunspell_src.a.desc
174:39.27 libspellchecker.a.desc
174:39.85 libsecurity_manager_boot_src.a.desc
174:40.29 libsecurity_manager_ssl_src.a.desc
174:41.14 libtlsserver.a.desc
174:41.38 BadCertServer
174:41.39 GenerateOCSPResponse
174:41.40 OCSPStaplingServer
174:41.86 libssltest.a.desc
174:43.01 libsecurity_manager_pki_src.a.desc
174:44.14 libtoolkit_components_alerts.a.desc
174:44.92 libtoolkit_components_commandlines.a.desc
174:46.37 libtoolkit_components_diskspacewatcher.a.desc
174:46.80 libtoolkit_components_downloads.a.desc
174:48.60 libtoolkit_components_finalizationwitness.a.desc
174:49.76 libtoolkit_components_find.a.desc
174:50.32 libtoolkit_components_jsdownloads_src.a.desc
174:51.00 libtoolkit_components_mediasniffer.a.desc
174:51.39 libtoolkit_components_osfile.a.desc
174:52.06 libtoolkit_components_parentalcontrols.a.desc
174:52.87 libtoolkit_components_perf.a.desc
174:54.21 libtoolkit_components_protobuf.a.desc
174:54.43 libtoolkit_components_reflect.a.desc
174:54.91 libtoolkit_components_startup.a.desc
174:55.34 libtoolkit_components_statusfilter.a.desc
174:55.57 libtoolkit_components_telemetry.a.desc
174:57.01 libtoolkit_components_typeaheadfind.a.desc
174:58.58 libtoolkit_components_workerlz4.a.desc
174:58.77 libtoolkit_components_ctypes.a.desc
174:58.98 libjsctypes-test.so
175:00.07 libtoolkit_components_autocomplete.a.desc
175:00.38 libtoolkit_components_satchel.a.desc
175:01.51 libtoolkit_components_url-classifier.a.desc
175:04.69 libtoolkitcomps.a.desc
175:10.67 libtoolkit_devtools_server.a.desc
175:15.76 libtoolkit_identity.a.desc
175:18.45 libtoolkit_mozapps_extensions.a.desc
175:27.66 BadPlugin
175:27.67 GoodPlugin
175:28.25 libtoolkit_profile.a.desc
175:30.74 TestWebappRT
175:31.06 libtoolkit_system_androidproxy.a.desc
175:31.37 libbreakpad_common_s.a.desc
175:31.96 libtoolkit_crashreporter_google-breakpad_src_processor.a.desc
175:32.20 libbreakpad_linux_common_s.a.desc
175:33.09 libxulapp_s.a.desc
175:33.85 libextensions_pref_autoconfig_src.a.desc
175:34.90 libservices_crypto_component.a.desc
175:35.80 libstartupcache.a.desc
175:36.19 libjs_ductwork_debugger.a.desc
175:36.49 libother-licenses_snappy.a.desc
175:36.71 libbrowsercomps.a.desc
175:37.04 libxul.a.desc
175:37.85 libStaticXULComponentsEnd.a.desc
175:38.04 libxul.so
525:11.39 /opt/FirefoxSource/mozilla-release/tools/quitter/chrome.manifest: WARNING: no preprocessor directives found
525:14.58 ssltunnel
525:18.01 /opt/FirefoxSource/mozilla-release/mobile/android/thirdparty/jap/branding/locales/en-US/brand.properties: WARNING: no useful preprocessor directives found
525:19.84 /opt/FirefoxSource/mozilla-release/mobile/locales/en-US/overrides/netError.dtd: WARNING: no preprocessor directives found
525:19.84 /opt/FirefoxSource/mozilla-release/mobile/locales/en-US/overrides/appstrings.properties: WARNING: no useful preprocessor directives found
525:19.84 /opt/FirefoxSource/mozilla-release/mobile/locales/en-US/overrides/passwordmgr.properties: WARNING: no useful preprocessor directives found
525:22.26 /opt/FirefoxSource/mozilla-release/mobile/android/base/WebappManifestFragment.xml.frag.in: WARNING: no preprocessor directives found
525:26.11 gecko-mozglue.jar
525:26.17 squareup-picasso.jar
525:27.10 Reading 0 suggested sites: []
525:27.10 /opt/FirefoxSource/mozilla-release/objdir-droid/mobile/android/base/res/raw/suggestedsites.json updated
525:56.51 sync-thirdparty.jar
525:56.66 websockets.jar
525:56.73 make[5]: *** Keine Regel vorhanden, um das Target »/opt/FirefoxSource/mozilla-release/mobile/android/thirdparty/jap/jar_dependencies/ANONDroidLib-0.1.1-SNAPSHOT.jar«,
525:56.73   benötigt von »gecko-browser.jar«, zu erstellen.  Schluss.
525:56.73 make[5]: *** Warte auf noch nicht beendete Prozesse...
526:00.78 generated/org/mozilla/gecko/mozglue/GeckoLoader.java:284: warning: [deprecation] CPU_ABI in Build has been deprecated
526:00.78         final String abi = android.os.Build.CPU_ABI;
526:00.78                                            ^
526:00.82 generated/org/mozilla/gecko/mozglue/GeckoLoader.java:346: warning: [deprecation] CPU_ABI in Build has been deprecated
526:00.84         message.append(": ABI: " + MOZ_APP_ABI + ", " + android.os.Build.CPU_ABI);
526:00.84                                                                         ^
526:01.25 2 warnings
526:02.90 Note: /opt/FirefoxSource/mozilla-release/mobile/android/thirdparty/com/squareup/picasso/Utils.java uses or overrides a deprecated API.
526:02.90 Note: Recompile with -Xlint:deprecation for details.
526:09.90 Note: Some input files use or override a deprecated API.
526:09.90 Note: Recompile with -Xlint:deprecation for details.
526:09.90 Note: Some input files use unchecked or unsafe operations.
526:09.90 Note: Recompile with -Xlint:unchecked for details.
526:10.51 make[4]: *** [mobile/android/base/libs] Fehler 2
526:10.51 make[3]: *** [libs] Fehler 2
526:10.51 make[2]: *** [default] Fehler 2
526:10.51 make[1]: *** [realbuild] Fehler 2
526:10.52 make: *** [build] Fehler 2
526:10.52 452 compiler warnings present.
Build step 'Shell ausführen' marked build as failure
[PostBuildScript] - Execution post build scripts.
[PostBuildScript] Build is not success : do not execute script
Finished: FAILURE